^C:\USERS\COLEW\ONEDRIVE\DOCUMENTS\UNREAL COURSE\SECTION_02\BULLSCOWGAME\DEBUG\FBULLCOWGAME.OBJ|C:\USERS\COLEW\ONEDRIVE\DOCUMENTS\UNREAL COURSE\SECTION_02\BULLSCOWGAME\DEBUG\MAIN.OBJ
C:\USERS\COLEW\ONEDRIVE\DOCUMENTS\UNREAL COURSE\SECTION_02\DEBUG\BULLSCOWGAME.ILK
C:\USERS\COLEW\ONEDRIVE\DOCUMENTS\UNREAL COURSE\SECTION_02\DEBUG\BULLSCOWGAME.EXE
C:\USERS\COLEW\ONEDRIVE\DOCUMENTS\UNREAL COURSE\SECTION_02\DEBUG\BULLSCOWGAME.PDB
^C:\USERS\COLEW\ONEDRIVE\DOCUMENTS\SCHOOL\PORTFOLIO\BULLSANDCOWS\BULLSCOWGAME\DEBUG\FBULLCOWGAME.OBJ|C:\USERS\COLEW\ONEDRIVE\DOCUMENTS\SCHOOL\PORTFOLIO\BULLSANDCOWS\BULLSCOWGAME\DEBUG\MAIN.OBJ
C:\USERS\COLEW\ONEDRIVE\DOCUMENTS\SCHOOL\PORTFOLIO\BULLSANDCOWS\DEBUG\BULLSCOWGAME.EXE
C:\USERS\COLEW\ONEDRIVE\DOCUMENTS\SCHOOL\PORTFOLIO\BULLSANDCOWS\DEBUG\BULLSCOWGAME.ILK
C:\USERS\COLEW\ONEDRIVE\DOCUMENTS\SCHOOL\PORTFOLIO\BULLSANDCOWS\DEBUG\BULLSCOWGAME.PDB
^C:\USERS\COLEW\ONEDRIVE\DOCUMENTS\SCHOOL\PORTFOLIO\C++\BULLSANDCOWS\BULLS-AND-COWS\BULLSCOWGAME\DEBUG\FBULLCOWGAME.OBJ|C:\USERS\COLEW\ONEDRIVE\DOCUMENTS\SCHOOL\PORTFOLIO\C++\BULLSANDCOWS\BULLS-AND-COWS\BULLSCOWGAME\DEBUG\MAIN.OBJ
C:\USERS\COLEW\ONEDRIVE\DOCUMENTS\SCHOOL\PORTFOLIO\C++\BULLSANDCOWS\BULLS-AND-COWS\DEBUG\BULLSCOWGAME.EXE
C:\USERS\COLEW\ONEDRIVE\DOCUMENTS\SCHOOL\PORTFOLIO\C++\BULLSANDCOWS\BULLS-AND-COWS\DEBUG\BULLSCOWGAME.ILK
C:\USERS\COLEW\ONEDRIVE\DOCUMENTS\SCHOOL\PORTFOLIO\C++\BULLSANDCOWS\BULLS-AND-COWS\DEBUG\BULLSCOWGAME.PDB
