AStarAlgorithm/Binaries/Win64/AStarAlgorithm-Win64-Shipping.exe	2021-04-12T08:52:42.446Z
AStarAlgorithm/Binaries/Win64/turbojpeg.dll	2021-02-03T23:52:21.448Z
Engine/Extras/Redist/en-us/UE4PrereqSetup_x64.exe	2021-01-07T19:18:17.168Z
Engine/Binaries/ThirdParty/Oculus/OVRPlugin/OVRPlugin/Win64/OVRPlugin.dll	2021-01-07T19:14:59.264Z
Engine/Binaries/ThirdParty/DbgHelp/dbghelp.dll	2021-02-03T23:48:57.324Z
Engine/Binaries/ThirdParty/PhysX3/Win64/VS2015/PxFoundation_x64.dll	2021-01-07T19:15:09.396Z
Engine/Binaries/ThirdParty/PhysX3/Win64/VS2015/PxPvdSDK_x64.dll	2021-01-07T19:15:09.413Z
Engine/Binaries/ThirdParty/PhysX3/Win64/VS2015/PhysX3_x64.dll	2021-01-07T19:15:08.248Z
Engine/Binaries/ThirdParty/PhysX3/Win64/VS2015/PhysX3Cooking_x64.dll	2021-01-07T19:15:08.783Z
Engine/Binaries/ThirdParty/PhysX3/Win64/VS2015/PhysX3Common_x64.dll	2021-01-07T19:15:08.415Z
Engine/Binaries/ThirdParty/PhysX3/Win64/VS2015/APEX_Clothing_x64.dll	2021-01-07T19:15:06.200Z
Engine/Binaries/ThirdParty/PhysX3/Win64/VS2015/APEX_Legacy_x64.dll	2021-01-07T19:15:07.086Z
Engine/Binaries/ThirdParty/PhysX3/Win64/VS2015/ApexFramework_x64.dll	2021-01-07T19:15:07.658Z
Engine/Binaries/ThirdParty/PhysX3/Win64/VS2015/NvCloth_x64.dll	2021-01-07T19:15:07.845Z
Engine/Binaries/ThirdParty/Ogg/Win64/VS2015/libogg_64.dll	2021-01-07T19:14:59.269Z
Engine/Binaries/ThirdParty/Vorbis/Win64/VS2015/libvorbis_64.dll	2021-01-07T19:15:28.533Z
Engine/Binaries/ThirdParty/Vorbis/Win64/VS2015/libvorbisfile_64.dll	2021-01-07T19:15:28.534Z
Engine/Binaries/ThirdParty/NVIDIA/NVaftermath/Win64/GFSDK_Aftermath_Lib.x64.dll	2021-01-07T19:14:58.839Z
Engine/Binaries/ThirdParty/OpenVR/OpenVRv1_5_17/Win64/openvr_api.dll	2021-01-07T19:14:59.362Z
Engine/Binaries/ThirdParty/Windows/XAudio2_9/x64/xaudio2_9redist.dll	2021-01-07T19:15:29.087Z
AStarAlgorithm.exe	2021-04-12T09:18:56.521Z
