[gd_scene load_steps=4 format=2]

[ext_resource path="res://275+_16x16_RPG_Items/16x16_RPG_Items.png" type="Texture" id=1]
[ext_resource path="res://Items/Bomb.gd" type="Script" id=2]

[sub_resource type="CircleShape2D" id=1]
radius = 10.3983

[node name="Bomb" type="Sprite"]
scale = Vector2( 0.25, 0.25 )
texture = ExtResource( 1 )
region_enabled = true
region_rect = Rect2( 288, 192, 16, 16 )
script = ExtResource( 2 )

[node name="Area2D" type="Area2D" parent="."]
collision_layer = 0
collision_mask = 2

[node name="CollisionShape2D" type="CollisionShape2D" parent="Area2D"]
shape = SubResource( 1 )
[connection signal="body_entered" from="Area2D" to="." method="_on_Area2D_body_entered"]
