[gd_scene load_steps=6 format=2]

[ext_resource path="res://Action RPG Resources/World/Grass.png" type="Texture" id=1]
[ext_resource path="res://World/Grass.gd" type="Script" id=2]
[ext_resource path="res://Hitboxes and Hurtboxes/Hurtbox.tscn" type="PackedScene" id=4]

[sub_resource type="RectangleShape2D" id=1]
extents = Vector2( 6.64452, 6.72667 )

[sub_resource type="RectangleShape2D" id=2]
extents = Vector2( 7.62885, 7.61859 )

[node name="Grass" type="Node2D"]
scale = Vector2( 0.5, 0.5 )
script = ExtResource( 2 )

[node name="Grass" type="Sprite" parent="."]
texture = ExtResource( 1 )
centered = false
offset = Vector2( -8, -8 )

[node name="Hurtbox" parent="." instance=ExtResource( 4 )]
collision_layer = 8

[node name="CollisionShape2D" parent="Hurtbox" index="0"]
position = Vector2( 8, 8 )
shape = SubResource( 1 )

[node name="StaticBody2D" type="StaticBody2D" parent="."]

[node name="CollisionShape2D" type="CollisionShape2D" parent="StaticBody2D"]
position = Vector2( 8, 8 )
shape = SubResource( 2 )
[connection signal="area_entered" from="Hurtbox" to="." method="_on_Hurtbox_area_entered"]

[editable path="Hurtbox"]
