[gd_scene load_steps=5 format=2]

[ext_resource path="res://Action RPG Resources/NPCs/ShakeyEyesSheet.png" type="Texture" id=1]
[ext_resource path="res://Buildings/ShakeyEyes.gd" type="Script" id=2]
[ext_resource path="res://Dialogue.tscn" type="PackedScene" id=3]

[sub_resource type="Animation" id=1]
resource_name = "Animation"
length = 2.0
loop = true
tracks/0/type = "bezier"
tracks/0/path = NodePath("Sprite:position:x")
tracks/0/interp = 1
tracks/0/loop_wrap = true
tracks/0/imported = false
tracks/0/enabled = true
tracks/0/keys = {
"points": PoolRealArray( 0.174644, -0.25, 0, 0.25, 0, 0, -0.25, 0, 0.25, 0, 0.174644, -0.25, 0, 0.25, 0 ),
"times": PoolRealArray( 0, 1, 2 )
}
tracks/1/type = "bezier"
tracks/1/path = NodePath("Sprite:position:y")
tracks/1/interp = 1
tracks/1/loop_wrap = true
tracks/1/imported = false
tracks/1/enabled = true
tracks/1/keys = {
"points": PoolRealArray( -5.80157, -0.25, 0, 0.25, 0, -21.8182, -0.25, 0, 0.25, 0, -5.80157, -0.25, 0, 0.25, 0 ),
"times": PoolRealArray( 0, 1, 2 )
}
tracks/2/type = "value"
tracks/2/path = NodePath("Sprite:flip_h")
tracks/2/interp = 1
tracks/2/loop_wrap = true
tracks/2/imported = false
tracks/2/enabled = true
tracks/2/keys = {
"times": PoolRealArray( 0, 1, 2 ),
"transitions": PoolRealArray( 1, 1, 1 ),
"update": 1,
"values": [ false, true, false ]
}
tracks/3/type = "bezier"
tracks/3/path = NodePath("Sprite:modulate:r")
tracks/3/interp = 1
tracks/3/loop_wrap = true
tracks/3/imported = false
tracks/3/enabled = true
tracks/3/keys = {
"points": PoolRealArray( 1, -0.25, 0, 0.25, 0, 0.643137, -0.25, 0, 0.25, 0, 1, -0.25, 0, 0.25, 0 ),
"times": PoolRealArray( 0, 1, 2 )
}
tracks/4/type = "bezier"
tracks/4/path = NodePath("Sprite:modulate:g")
tracks/4/interp = 1
tracks/4/loop_wrap = true
tracks/4/imported = false
tracks/4/enabled = true
tracks/4/keys = {
"points": PoolRealArray( 1, -0.25, 0, 0.25, 0, 0.866667, -0.25, 0, 0.25, 0, 1, -0.25, 0, 0.25, 0 ),
"times": PoolRealArray( 0, 1, 2 )
}
tracks/5/type = "bezier"
tracks/5/path = NodePath("Sprite:modulate:b")
tracks/5/interp = 1
tracks/5/loop_wrap = true
tracks/5/imported = false
tracks/5/enabled = true
tracks/5/keys = {
"points": PoolRealArray( 1, -0.25, 0, 0.25, 0, 0.639216, -0.25, 0, 0.25, 0, 1, -0.25, 0, 0.25, 0 ),
"times": PoolRealArray( 0, 1, 2 )
}
tracks/6/type = "bezier"
tracks/6/path = NodePath("Sprite:modulate:a")
tracks/6/interp = 1
tracks/6/loop_wrap = true
tracks/6/imported = false
tracks/6/enabled = true
tracks/6/keys = {
"points": PoolRealArray( 0.682, -0.25, 0, 0.25, 0, 1, -0.25, 0, 0.25, 0, 0.682, -0.25, 0, 0.25, 0 ),
"times": PoolRealArray( 0, 1, 2 )
}

[node name="ShakeyEyes" type="Node2D"]
position = Vector2( 80, 80 )
scale = Vector2( 1.1, 1.1 )
script = ExtResource( 2 )

[node name="Sprite" type="Sprite" parent="."]
modulate = Color( 1, 1, 1, 0.682 )
position = Vector2( 0.174644, -5.80157 )
scale = Vector2( 2.5, 2.5 )
texture = ExtResource( 1 )
hframes = 4

[node name="AnimationPlayer" type="AnimationPlayer" parent="."]
method_call_mode = 1
anims/Animation = SubResource( 1 )

[node name="Dialogue" parent="." instance=ExtResource( 3 )]
position = Vector2( 0, 43.6364 )
dialogue = "Hello, I'm a ghost"
