[gd_scene load_steps=4 format=2]

[ext_resource path="res://RunninBloods_HUGE_16x16_Top-Down-Tileset/Final_Tileset.png" type="Texture" id=1]
[ext_resource path="res://World/Trees/FloorSwitchUnpressed.gd" type="Script" id=2]

[sub_resource type="RectangleShape2D" id=1]
extents = Vector2( 7.42911, 7.34865 )

[node name="FloorSwitchUnpressed" type="Area2D"]
position = Vector2( 0, -8 )
collision_layer = 0
collision_mask = 2
script = ExtResource( 2 )
__meta__ = {
"_edit_group_": true
}

[node name="UnpressedSprite" type="Sprite" parent="."]
texture = ExtResource( 1 )
region_enabled = true
region_rect = Rect2( 368, 208, 16, 16 )

[node name="PressedSprite" type="Sprite" parent="."]
visible = false
texture = ExtResource( 1 )
region_enabled = true
region_rect = Rect2( 256, 320, 16, 16 )

[node name="CollisionShape2D" type="CollisionShape2D" parent="."]
shape = SubResource( 1 )
[connection signal="body_entered" from="." to="." method="_on_FloorSwitchUnpressed_body_entered"]
[connection signal="body_exited" from="." to="." method="_on_FloorSwitchUnpressed_body_exited"]
