module disperse

go 1.19

require (
	github.com/gofiber/fiber/v2 v2.37.1
	github.com/gofiber/websocket/v2 v2.0.25
)

require (
	github.com/andybalholm/brotli v1.0.4 // indirect
	github.com/fasthttp/websocket v1.5.0 // indirect
	github.com/google/uuid v1.3.0 // indirect
	github.com/klauspost/compress v1.15.0 // indirect
	github.com/savsgio/gotils v0.0.0-20211223103454-d0aaa54c5899 // indirect
	github.com/valyala/bytebufferpool v1.0.0 // indirect
	github.com/valyala/fasthttp v1.40.0 // indirect
	github.com/valyala/tcplisten v1.0.0 // indirect
	golang.org/x/sys v0.0.0-20220227234510-4e6760a101f9 // indirect
)
