<svg width="20" height="20" viewBox="0 0 20 20" fill="none" xmlns="http://www.w3.org/2000/svg">
<rect width="20" height="20" rx="4" fill="#D9730D"/>
<path fill-rule="evenodd" clip-rule="evenodd" d="M14.9263 6.57258C14.9738 6.68475 15 6.80807 15 6.93751V13.1875C15 13.5111 14.8361 13.7964 14.5867 13.9649C14.4371 14.066 14.2567 14.125 14.0625 14.125H14.0625H5.93751L5.9375 14.125C5.90514 14.125 5.87317 14.1234 5.84166 14.1202C5.70716 14.1065 5.58106 14.0644 5.46948 14C5.18886 13.838 5 13.5348 5 13.1875L5.00001 13.183V6.942C5 6.9405 5 6.939 5 6.9375C5 6.41973 5.41973 6 5.9375 6L14.0625 6C14.2418 6 14.4093 6.05032 14.5517 6.13761C14.7178 6.2394 14.8497 6.39144 14.9263 6.57258ZM6.87501 7.875L13.125 7.875V12.25L6.87501 12.25L6.87501 7.875Z" fill="#F0F6FC"/>
<path d="M11.2981 10.3956C11.5545 10.2475 11.5545 9.87745 11.2981 9.72941L9.63942 8.77179C9.38301 8.62375 9.0625 8.8088 9.0625 9.10488L9.0625 11.0201C9.0625 11.3162 9.38301 11.5012 9.63942 11.3532L11.2981 10.3956Z" fill="#F0F6FC"/>
</svg>
