{
    "mnemonic": "priority supply couple broccoli balcony sort flag keep original wrong pottery version",
    "shardToWrite": "DEVNET_L1A",
    "shardToExecute": "DEVNET_L1A",
    "endpoint": "https://api-devnet.coinweb.io/wallet",
    "unsafe": true
}
