{
  "7.0.7": {
    "customer-area-acf-integration": "3.0.1",
    "customer-area-collaboration": "4.0.1",
    "customer-area-conversations": "4.0.1",
    "customer-area-enhanced-files": "2.0.0",
    "customer-area-extended-permissions": "5.0.0",
    "customer-area-invoicing": "2.0.0",
    "customer-area-login-form": "5.0.1",
    "customer-area-managed-groups": "4.0.0",
    "customer-area-master-colors": "1.0.0",
    "customer-area-master-demo": "0.0.1",
    "customer-area-notifications": "6.0.2",
    "customer-area-one-compat": "1.0.0",
    "customer-area-owner-restriction": "4.0.0",
    "customer-area-paypal-gateway": "1.0.0",
    "customer-area-projects": "4.0.1",
    "customer-area-protect-post-types": "2.0.0",
    "customer-area-search": "3.0.0",
    "customer-area-smart-groups": "2.0.0",
    "customer-area-switch-users": "4.0.0",
    "customer-area-tasks": "4.0.1"
  },
  "7.0.8": {
    "customer-area-acf-integration": "3.0.1",
    "customer-area-collaboration": "4.0.1",
    "customer-area-conversations": "4.0.2",
    "customer-area-enhanced-files": "2.0.0",
    "customer-area-extended-permissions": "5.0.0",
    "customer-area-invoicing": "2.0.1",
    "customer-area-login-form": "5.0.1",
    "customer-area-managed-groups": "4.0.0",
    "customer-area-master-colors": "1.0.0",
    "customer-area-master-demo": "0.0.1",
    "customer-area-notifications": "6.0.2",
    "customer-area-one-compat": "1.0.0",
    "customer-area-owner-restriction": "4.0.0",
    "customer-area-paypal-gateway": "1.0.0",
    "customer-area-projects": "4.0.2",
    "customer-area-protect-post-types": "2.0.0",
    "customer-area-search": "3.0.0",
    "customer-area-smart-groups": "2.0.0",
    "customer-area-switch-users": "4.0.0",
    "customer-area-tasks": "4.0.2"
  },
  "7.1.0": {
    "customer-area-acf-integration": "3.1.0",
    "customer-area-collaboration": "4.0.2",
    "customer-area-conversations": "4.0.3",
    "customer-area-enhanced-files": "2.0.1",
    "customer-area-extended-permissions": "5.0.1",
    "customer-area-invoicing": "2.1.0",
    "customer-area-login-form": "5.0.1",
    "customer-area-managed-groups": "4.0.1",
    "customer-area-master-colors": "1.0.0",
    "customer-area-master-demo": "0.0.1",
    "customer-area-notifications": "6.0.3",
    "customer-area-one-compat": "1.0.0",
    "customer-area-owner-restriction": "4.0.1",
    "customer-area-paypal-gateway": "1.0.0",
    "customer-area-projects": "4.0.3",
    "customer-area-protect-post-types": "2.0.1",
    "customer-area-search": "3.0.1",
    "customer-area-smart-groups": "2.0.1",
    "customer-area-switch-users": "4.0.1",
    "customer-area-tasks": "4.0.3"
  },
  "7.1.2": {
    "customer-area-acf-integration": "3.1.0",
    "customer-area-collaboration": "4.0.2",
    "customer-area-conversations": "4.0.3",
    "customer-area-enhanced-files": "2.0.1",
    "customer-area-extended-permissions": "5.0.1",
    "customer-area-invoicing": "2.1.0",
    "customer-area-login-form": "5.0.1",
    "customer-area-managed-groups": "4.0.1",
    "customer-area-master-colors": "1.0.0",
    "customer-area-master-demo": "0.0.1",
    "customer-area-notifications": "6.0.3",
    "customer-area-one-compat": "1.0.0",
    "customer-area-owner-restriction": "4.0.1",
    "customer-area-paypal-gateway": "1.0.0",
    "customer-area-projects": "4.0.3",
    "customer-area-protect-post-types": "2.0.1",
    "customer-area-search": "3.0.1",
    "customer-area-smart-groups": "2.0.1",
    "customer-area-switch-users": "4.0.1",
    "customer-area-tasks": "4.0.3"
  },
  "7.1.3": {
    "customer-area-acf-integration": "3.1.0",
    "customer-area-collaboration": "4.0.2",
    "customer-area-conversations": "4.0.3",
    "customer-area-enhanced-files": "2.0.1",
    "customer-area-extended-permissions": "5.0.1",
    "customer-area-invoicing": "2.1.0",
    "customer-area-login-form": "5.0.1",
    "customer-area-managed-groups": "4.0.1",
    "customer-area-master-colors": "1.0.0",
    "customer-area-master-demo": "0.0.1",
    "customer-area-notifications": "6.0.3",
    "customer-area-one-compat": "1.0.0",
    "customer-area-owner-restriction": "4.0.1",
    "customer-area-paypal-gateway": "1.0.0",
    "customer-area-projects": "4.0.3",
    "customer-area-protect-post-types": "2.0.1",
    "customer-area-search": "3.0.1",
    "customer-area-smart-groups": "2.0.1",
    "customer-area-switch-users": "4.0.1",
    "customer-area-tasks": "4.0.3"
  },
  "7.1.4": {
    "customer-area-acf-integration": "3.1.0",
    "customer-area-collaboration": "4.0.2",
    "customer-area-conversations": "4.0.3",
    "customer-area-enhanced-files": "2.0.1",
    "customer-area-extended-permissions": "5.0.1",
    "customer-area-invoicing": "2.1.1",
    "customer-area-login-form": "5.0.1",
    "customer-area-managed-groups": "4.0.1",
    "customer-area-master-colors": "1.0.0",
    "customer-area-master-demo": "0.0.1",
    "customer-area-notifications": "6.0.3",
    "customer-area-one-compat": "1.0.0",
    "customer-area-owner-restriction": "4.0.1",
    "customer-area-paypal-gateway": "1.0.0",
    "customer-area-projects": "4.0.3",
    "customer-area-protect-post-types": "2.0.1",
    "customer-area-search": "3.0.1",
    "customer-area-smart-groups": "2.0.1",
    "customer-area-switch-users": "4.0.1",
    "customer-area-tasks": "4.0.3"
  },
  "7.1.5": {
    "customer-area-acf-integration": "3.1.0",
    "customer-area-collaboration": "4.0.2",
    "customer-area-conversations": "4.0.3",
    "customer-area-enhanced-files": "2.0.1",
    "customer-area-extended-permissions": "5.0.1",
    "customer-area-invoicing": "2.1.1",
    "customer-area-login-form": "5.0.1",
    "customer-area-managed-groups": "4.0.1",
    "customer-area-master-colors": "1.0.0",
    "customer-area-master-demo": "0.0.1",
    "customer-area-notifications": "6.0.3",
    "customer-area-one-compat": "1.0.0",
    "customer-area-owner-restriction": "4.0.1",
    "customer-area-paypal-gateway": "1.0.0",
    "customer-area-projects": "4.0.3",
    "customer-area-protect-post-types": "2.0.1",
    "customer-area-search": "3.0.1",
    "customer-area-smart-groups": "2.0.1",
    "customer-area-switch-users": "4.0.1",
    "customer-area-tasks": "4.0.3"
  },
  "7.1.9": {
    "customer-area-acf-integration": "3.1.0",
    "customer-area-collaboration": "4.0.2",
    "customer-area-conversations": "4.0.4",
    "customer-area-design-extras": "1.0.0",
    "customer-area-enhanced-files": "2.0.1",
    "customer-area-extended-permissions": "5.0.1",
    "customer-area-invoicing": "2.1.1",
    "customer-area-login-form": "5.0.1",
    "customer-area-managed-groups": "4.0.1",
    "customer-area-master-demo": "0.0.1",
    "customer-area-notifications": "6.0.3",
    "customer-area-one-compat": "1.0.0",
    "customer-area-owner-restriction": "4.0.1",
    "customer-area-paypal-gateway": "1.0.0",
    "customer-area-projects": "4.0.3",
    "customer-area-protect-post-types": "2.0.1",
    "customer-area-search": "3.0.1",
    "customer-area-smart-groups": "2.0.1",
    "customer-area-switch-users": "4.0.2",
    "customer-area-tasks": "4.0.3",
    "customer-area-unread-documents": "1.0.0"
  },
  "7.2.0": {
    "customer-area-acf-integration": "3.1.0",
    "customer-area-collaboration": "4.0.2",
    "customer-area-conversations": "4.1.0",
    "customer-area-design-extras": "1.0.0",
    "customer-area-enhanced-files": "2.0.1",
    "customer-area-extended-permissions": "5.0.2",
    "customer-area-invoicing": "2.2.0",
    "customer-area-login-form": "5.0.2",
    "customer-area-managed-groups": "4.0.1",
    "customer-area-master-demo": "0.0.1",
    "customer-area-notifications": "6.1.1",
    "customer-area-one-compat": "1.0.0",
    "customer-area-owner-restriction": "4.0.1",
    "customer-area-paypal-gateway": "1.0.0",
    "customer-area-projects": "4.1.0",
    "customer-area-protect-post-types": "2.0.1",
    "customer-area-search": "3.0.1",
    "customer-area-smart-groups": "2.0.1",
    "customer-area-switch-users": "4.0.2",
    "customer-area-tasks": "4.1.1",
    "customer-area-unread-documents": "1.0.1"
  },
  "7.2.1": {
    "customer-area-acf-integration": "3.1.0",
    "customer-area-collaboration": "4.0.2",
    "customer-area-conversations": "4.1.0",
    "customer-area-design-extras": "1.0.0",
    "customer-area-enhanced-files": "2.0.1",
    "customer-area-extended-permissions": "5.0.2",
    "customer-area-invoicing": "2.2.0",
    "customer-area-login-form": "5.0.2",
    "customer-area-managed-groups": "4.0.1",
    "customer-area-master-demo": "0.0.1",
    "customer-area-notifications": "6.1.1",
    "customer-area-one-compat": "1.0.0",
    "customer-area-owner-restriction": "4.0.1",
    "customer-area-paypal-gateway": "1.0.0",
    "customer-area-projects": "4.1.0",
    "customer-area-protect-post-types": "2.0.1",
    "customer-area-search": "3.0.1",
    "customer-area-smart-groups": "2.0.1",
    "customer-area-switch-users": "4.0.2",
    "customer-area-tasks": "4.1.1",
    "customer-area-unread-documents": "1.0.1"
  },
  "7.3.0": {
    "customer-area-acf-integration": "3.1.0",
    "customer-area-collaboration": "4.0.2",
    "customer-area-conversations": "4.1.1",
    "customer-area-design-extras": "1.0.0",
    "customer-area-enhanced-files": "2.0.1",
    "customer-area-extended-permissions": "5.0.3",
    "customer-area-invoicing": "2.3.0",
    "customer-area-login-form": "5.0.2",
    "customer-area-managed-groups": "4.0.2",
    "customer-area-master-demo": "0.0.1",
    "customer-area-notifications": "6.2.0",
    "customer-area-one-compat": "1.0.0",
    "customer-area-owner-restriction": "4.0.1",
    "customer-area-paypal-gateway": "1.0.0",
    "customer-area-projects": "4.1.1",
    "customer-area-protect-post-types": "2.0.1",
    "customer-area-search": "3.0.1",
    "customer-area-smart-groups": "2.0.2",
    "customer-area-stripe-gateway": "1.0.0",
    "customer-area-switch-users": "4.0.2",
    "customer-area-tasks": "4.1.2",
    "customer-area-unread-documents": "1.0.1"
  },
  "7.4.0": {
    "customer-area-acf-integration": "3.2.0",
    "customer-area-collaboration": "4.0.3",
    "customer-area-conversations": "4.2.0",
    "customer-area-design-extras": "1.0.2",
    "customer-area-enhanced-files": "2.0.1",
    "customer-area-extended-permissions": "5.0.3",
    "customer-area-invoicing": "2.4.0",
    "customer-area-login-form": "5.0.3",
    "customer-area-managed-groups": "4.0.2",
    "customer-area-notifications": "6.3.0",
    "customer-area-owner-restriction": "4.0.2",
    "customer-area-paypal-gateway": "1.0.0",
    "customer-area-projects": "4.1.2",
    "customer-area-protect-post-types": "2.0.2",
    "customer-area-search": "3.0.2",
    "customer-area-smart-groups": "2.0.2",
    "customer-area-stripe-gateway": "1.0.0",
    "customer-area-switch-users": "4.0.2",
    "customer-area-tasks": "4.1.3",
    "customer-area-unread-documents": "1.0.1"
  },
  "7.4.1": {
    "customer-area-acf-integration": "3.2.0",
    "customer-area-collaboration": "4.0.3",
    "customer-area-conversations": "4.1.1",
    "customer-area-design-extras": "1.0.1",
    "customer-area-enhanced-files": "2.0.1",
    "customer-area-extended-permissions": "5.0.3",
    "customer-area-invoicing": "2.4.0",
    "customer-area-login-form": "5.0.3",
    "customer-area-managed-groups": "4.0.2",
    "customer-area-master-demo": "0.0.1",
    "customer-area-notifications": "6.3.0",
    "customer-area-one-compat": "1.0.0",
    "customer-area-owner-restriction": "4.0.2",
    "customer-area-paypal-gateway": "1.0.0",
    "customer-area-projects": "4.1.2",
    "customer-area-protect-post-types": "2.0.2",
    "customer-area-search": "3.0.2",
    "customer-area-smart-groups": "2.0.2",
    "customer-area-stripe-gateway": "1.0.0",
    "customer-area-switch-users": "4.0.2",
    "customer-area-tasks": "4.1.3",
    "customer-area-unread-documents": "1.0.1"
  },
  "7.4.2": {
    "customer-area-acf-integration": "3.2.0",
    "customer-area-collaboration": "4.0.3",
    "customer-area-conversations": "4.2.0",
    "customer-area-design-extras": "1.0.2",
    "customer-area-enhanced-files": "2.0.1",
    "customer-area-extended-permissions": "5.0.3",
    "customer-area-invoicing": "2.4.0",
    "customer-area-login-form": "5.0.3",
    "customer-area-managed-groups": "4.0.2",
    "customer-area-master-demo": "0.0.1",
    "customer-area-notifications": "6.3.0",
    "customer-area-one-compat": "1.0.0",
    "customer-area-owner-restriction": "4.0.2",
    "customer-area-paypal-gateway": "1.0.0",
    "customer-area-projects": "4.1.2",
    "customer-area-protect-post-types": "2.0.2",
    "customer-area-search": "3.0.3",
    "customer-area-smart-groups": "2.0.2",
    "customer-area-stripe-gateway": "1.0.0",
    "customer-area-switch-users": "4.0.2",
    "customer-area-tasks": "4.1.3",
    "customer-area-unread-documents": "1.0.1"
  },
  "7.4.3": {
    "customer-area-acf-integration": "3.2.0",
    "customer-area-collaboration": "4.0.3",
    "customer-area-conversations": "4.2.0",
    "customer-area-design-extras": "1.0.2",
    "customer-area-enhanced-files": "2.0.1",
    "customer-area-extended-permissions": "5.0.3",
    "customer-area-invoicing": "2.4.0",
    "customer-area-login-form": "5.0.3",
    "customer-area-managed-groups": "4.0.2",
    "customer-area-master-demo": "0.0.1",
    "customer-area-notifications": "6.3.0",
    "customer-area-one-compat": "1.0.0",
    "customer-area-owner-restriction": "4.0.2",
    "customer-area-paypal-gateway": "1.0.0",
    "customer-area-projects": "4.1.2",
    "customer-area-protect-post-types": "2.0.2",
    "customer-area-search": "3.0.3",
    "customer-area-smart-groups": "2.0.2",
    "customer-area-stripe-gateway": "1.0.0",
    "customer-area-switch-users": "4.0.2",
    "customer-area-tasks": "4.1.3",
    "customer-area-unread-documents": "1.0.1"
  },
  "7.4.4": {
    "customer-area-acf-integration": "3.2.0",
    "customer-area-collaboration": "4.0.3",
    "customer-area-conversations": "4.2.0",
    "customer-area-design-extras": "1.0.2",
    "customer-area-enhanced-files": "2.0.1",
    "customer-area-extended-permissions": "5.0.3",
    "customer-area-invoicing": "2.4.0",
    "customer-area-login-form": "5.0.3",
    "customer-area-managed-groups": "4.0.2",
    "customer-area-master-demo": "0.0.1",
    "customer-area-notifications": "6.3.0",
    "customer-area-owner-restriction": "4.0.2",
    "customer-area-paypal-gateway": "1.0.0",
    "customer-area-projects": "4.1.2",
    "customer-area-protect-post-types": "2.0.3",
    "customer-area-search": "3.0.3",
    "customer-area-smart-groups": "2.0.2",
    "customer-area-stripe-gateway": "1.0.0",
    "customer-area-switch-users": "4.0.2",
    "customer-area-tasks": "4.1.3",
    "customer-area-unread-documents": "1.0.1"
  },
  "7.4.5": {
    "customer-area-acf-integration": "3.2.0",
    "customer-area-collaboration": "4.0.4",
    "customer-area-conversations": "4.2.1",
    "customer-area-design-extras": "1.0.2",
    "customer-area-enhanced-files": "2.0.1",
    "customer-area-extended-permissions": "5.0.3",
    "customer-area-invoicing": "2.4.0",
    "customer-area-login-form": "5.0.3",
    "customer-area-managed-groups": "4.0.2",
    "customer-area-master-demo": "0.0.1",
    "customer-area-notifications": "6.3.1",
    "customer-area-owner-restriction": "4.0.2",
    "customer-area-paypal-gateway": "1.0.1",
    "customer-area-projects": "4.1.3",
    "customer-area-protect-post-types": "2.0.3",
    "customer-area-search": "3.0.3",
    "customer-area-smart-groups": "2.0.2",
    "customer-area-stripe-gateway": "1.0.1",
    "customer-area-switch-users": "4.0.2",
    "customer-area-tasks": "4.1.4",
    "customer-area-unread-documents": "1.0.1"
  },
  "7.4.6": {
    "customer-area-acf-integration": "3.2.0",
    "customer-area-collaboration": "4.0.4",
    "customer-area-conversations": "4.2.1",
    "customer-area-design-extras": "1.0.3",
    "customer-area-enhanced-files": "2.0.1",
    "customer-area-extended-permissions": "5.0.3",
    "customer-area-invoicing": "2.4.0",
    "customer-area-login-form": "5.0.3",
    "customer-area-managed-groups": "4.0.2",
    "customer-area-master-demo": "0.0.1",
    "customer-area-notifications": "6.3.1",
    "customer-area-owner-restriction": "4.0.2",
    "customer-area-paypal-gateway": "1.0.1",
    "customer-area-projects": "4.1.4",
    "customer-area-protect-post-types": "2.0.3",
    "customer-area-search": "3.0.3",
    "customer-area-smart-groups": "2.0.2",
    "customer-area-stripe-gateway": "1.0.1",
    "customer-area-switch-users": "4.0.2",
    "customer-area-tasks": "4.1.4",
    "customer-area-unread-documents": "1.0.1"
  },
  "7.5.0": {
    "customer-area-acf-integration": "3.3.0",
    "customer-area-collaboration": "4.1.0",
    "customer-area-conversations": "4.3.0",
    "customer-area-design-extras": "1.1.0",
    "customer-area-enhanced-files": "2.1.0",
    "customer-area-extended-permissions": "5.1.0",
    "customer-area-invoicing": "2.5.0",
    "customer-area-login-form": "5.1.0",
    "customer-area-managed-groups": "4.1.0",
    "customer-area-master-demo": "0.0.1",
    "customer-area-notifications": "6.4.0",
    "customer-area-owner-restriction": "4.1.0",
    "customer-area-paypal-gateway": "1.1.0",
    "customer-area-projects": "4.2.0",
    "customer-area-protect-post-types": "2.1.0",
    "customer-area-search": "3.1.0",
    "customer-area-smart-groups": "2.1.0",
    "customer-area-stripe-gateway": "1.1.0",
    "customer-area-switch-users": "4.1.0",
    "customer-area-tasks": "4.2.0",
    "customer-area-terms-of-service": "1.0.0",
    "customer-area-unread-documents": "1.1.0"
  },
  "7.5.1": {
    "customer-area-acf-integration": "3.3.0",
    "customer-area-collaboration": "4.1.0",
    "customer-area-conversations": "4.3.1",
    "customer-area-design-extras": "1.1.0",
    "customer-area-enhanced-files": "2.1.0",
    "customer-area-extended-permissions": "5.1.0",
    "customer-area-invoicing": "2.5.0",
    "customer-area-login-form": "5.1.0",
    "customer-area-managed-groups": "4.1.0",
    "customer-area-master-demo": "0.0.1",
    "customer-area-notifications": "6.4.1",
    "customer-area-owner-restriction": "4.1.0",
    "customer-area-paypal-gateway": "1.1.0",
    "customer-area-projects": "4.2.0",
    "customer-area-protect-post-types": "2.1.0",
    "customer-area-search": "3.1.0",
    "customer-area-smart-groups": "2.1.0",
    "customer-area-stripe-gateway": "1.1.0",
    "customer-area-switch-users": "4.1.0",
    "customer-area-tasks": "4.2.0",
    "customer-area-terms-of-service": "1.0.1",
    "customer-area-unread-documents": "1.1.0"
  },
  "7.6.0": {
    "customer-area-acf-integration": "4.0.0",
    "customer-area-collaboration": "4.1.1",
    "customer-area-conversations": "4.3.2",
    "customer-area-design-extras": "1.1.1",
    "customer-area-enhanced-files": "2.1.1",
    "customer-area-extended-permissions": "5.1.0",
    "customer-area-invoicing": "2.5.1",
    "customer-area-login-form": "5.1.2",
    "customer-area-managed-groups": "4.1.0",
    "customer-area-master-demo": "0.0.1",
    "customer-area-notifications": "6.4.2",
    "customer-area-owner-restriction": "4.1.1",
    "customer-area-paypal-gateway": "1.1.1",
    "customer-area-projects": "4.2.1",
    "customer-area-protect-post-types": "2.1.1",
    "customer-area-smart-groups": "2.1.0",
    "customer-area-stripe-gateway": "1.1.1",
    "customer-area-switch-users": "4.1.1",
    "customer-area-tasks": "4.2.1",
    "customer-area-terms-of-service": "1.0.2",
    "customer-area-unread-documents": "1.1.1"
  },
  "7.7.0": {
    "customer-area-acf-integration": "5.0.0",
    "customer-area-collaboration": "4.1.1",
    "customer-area-conversations": "4.3.2",
    "customer-area-design-extras": "1.2.0",
    "customer-area-enhanced-files": "2.1.1",
    "customer-area-extended-permissions": "5.1.0",
    "customer-area-invoicing": "2.5.1",
    "customer-area-login-form": "5.1.2",
    "customer-area-managed-groups": "4.1.0",
    "customer-area-master-demo": "0.0.1",
    "customer-area-notifications": "6.4.2",
    "customer-area-owner-restriction": "4.1.1",
    "customer-area-paypal-gateway": "1.1.1",
    "customer-area-projects": "4.2.1",
    "customer-area-protect-post-types": "2.1.1",
    "customer-area-search": "3.1.1",
    "customer-area-smart-groups": "2.1.0",
    "customer-area-stripe-gateway": "1.1.1",
    "customer-area-switch-users": "4.1.2",
    "customer-area-tasks": "4.2.1",
    "customer-area-terms-of-service": "1.0.2",
    "customer-area-theme-integration": "1.0.0",
    "customer-area-unread-documents": "1.1.1"
  },
  "7.7.1": {
    "customer-area-acf-integration": "5.0.0",
    "customer-area-collaboration": "4.1.1",
    "customer-area-conversations": "4.3.2",
    "customer-area-design-extras": "1.2.0",
    "customer-area-enhanced-files": "2.1.1",
    "customer-area-extended-permissions": "5.1.0",
    "customer-area-invoicing": "2.5.1",
    "customer-area-login-form": "5.1.2",
    "customer-area-managed-groups": "4.1.0",
    "customer-area-master-demo": "0.0.1",
    "customer-area-notifications": "6.4.2",
    "customer-area-owner-restriction": "4.1.1",
    "customer-area-paypal-gateway": "1.1.1",
    "customer-area-projects": "4.2.1",
    "customer-area-protect-post-types": "2.1.1",
    "customer-area-search": "3.1.1",
    "customer-area-smart-groups": "2.1.0",
    "customer-area-stripe-gateway": "1.1.1",
    "customer-area-switch-users": "4.1.2",
    "customer-area-tasks": "4.2.1",
    "customer-area-terms-of-service": "1.0.2",
    "customer-area-theme-integration": "1.0.0",
    "customer-area-unread-documents": "1.1.1"
  },
  "7.7.2": {
    "customer-area-acf-integration": "5.0.0",
    "customer-area-collaboration": "4.1.1",
    "customer-area-conversations": "4.3.2",
    "customer-area-design-extras": "1.2.1",
    "customer-area-enhanced-files": "2.1.1",
    "customer-area-extended-permissions": "5.1.0",
    "customer-area-invoicing": "2.5.1",
    "customer-area-login-form": "5.1.2",
    "customer-area-managed-groups": "4.1.0",
    "customer-area-master-demo": "0.0.1",
    "customer-area-notifications": "6.4.2",
    "customer-area-owner-restriction": "4.1.1",
    "customer-area-paypal-gateway": "1.1.1",
    "customer-area-projects": "4.2.1",
    "customer-area-protect-post-types": "2.1.1",
    "customer-area-search": "3.1.1",
    "customer-area-smart-groups": "2.1.0",
    "customer-area-stripe-gateway": "1.1.1",
    "customer-area-switch-users": "4.1.2",
    "customer-area-tasks": "4.2.1",
    "customer-area-terms-of-service": "1.0.2",
    "customer-area-theme-integration": "1.0.0",
    "customer-area-unread-documents": "1.1.1"
  },
  "7.7.3": {
    "customer-area-acf-integration": "5.0.0",
    "customer-area-collaboration": "4.1.1",
    "customer-area-conversations": "4.3.3",
    "customer-area-design-extras": "1.2.1",
    "customer-area-enhanced-files": "2.1.1",
    "customer-area-extended-permissions": "5.1.0",
    "customer-area-invoicing": "2.5.2",
    "customer-area-login-form": "5.1.2",
    "customer-area-managed-groups": "4.1.0",
    "customer-area-master-demo": "0.0.1",
    "customer-area-notifications": "6.4.2",
    "customer-area-owner-restriction": "4.1.1",
    "customer-area-paypal-gateway": "1.1.1",
    "customer-area-projects": "4.2.1",
    "customer-area-protect-post-types": "2.1.1",
    "customer-area-search": "3.1.2",
    "customer-area-smart-groups": "2.1.0",
    "customer-area-stripe-gateway": "1.1.1",
    "customer-area-switch-users": "4.1.2",
    "customer-area-tasks": "4.2.1",
    "customer-area-terms-of-service": "1.0.2",
    "customer-area-theme-integration": "1.0.0",
    "customer-area-unread-documents": "1.1.1"
  },
  "7.7.4": {
    "customer-area-acf-integration": "5.0.0",
    "customer-area-collaboration": "4.1.1",
    "customer-area-conversations": "4.3.3",
    "customer-area-design-extras": "1.2.1",
    "customer-area-enhanced-files": "2.1.1",
    "customer-area-extended-permissions": "5.1.0",
    "customer-area-invoicing": "2.5.2",
    "customer-area-login-form": "5.1.2",
    "customer-area-managed-groups": "4.1.0",
    "customer-area-master-demo": "0.0.1",
    "customer-area-notifications": "6.4.2",
    "customer-area-owner-restriction": "4.1.1",
    "customer-area-paypal-gateway": "1.1.1",
    "customer-area-projects": "4.2.1",
    "customer-area-protect-post-types": "2.1.1",
    "customer-area-search": "3.1.2",
    "customer-area-smart-groups": "2.1.0",
    "customer-area-stripe-gateway": "1.1.1",
    "customer-area-switch-users": "4.1.2",
    "customer-area-tasks": "4.2.1",
    "customer-area-terms-of-service": "1.0.2",
    "customer-area-theme-integration": "1.0.0",
    "customer-area-unread-documents": "1.1.1"
  },
  "7.7.6": {
    "customer-area-acf-integration": "5.0.0",
    "customer-area-collaboration": "4.1.1",
    "customer-area-conversations": "4.3.3",
    "customer-area-design-extras": "1.2.1",
    "customer-area-enhanced-files": "2.1.1",
    "customer-area-extended-permissions": "5.1.0",
    "customer-area-invoicing": "2.5.2",
    "customer-area-login-form": "5.1.2",
    "customer-area-managed-groups": "4.1.0",
    "customer-area-master-demo": "0.0.1",
    "customer-area-notifications": "6.4.2",
    "customer-area-owner-restriction": "4.1.1",
    "customer-area-paypal-gateway": "1.1.1",
    "customer-area-projects": "4.2.2",
    "customer-area-protect-post-types": "2.1.1",
    "customer-area-search": "3.1.2",
    "customer-area-smart-groups": "2.1.0",
    "customer-area-stripe-gateway": "1.1.1",
    "customer-area-switch-users": "4.1.2",
    "customer-area-tasks": "4.2.1",
    "customer-area-terms-of-service": "1.0.2",
    "customer-area-unread-documents": "1.1.1"
  },
  "7.7.7": {
    "customer-area-acf-integration": "5.0.0",
    "customer-area-collaboration": "4.1.1",
    "customer-area-conversations": "4.3.3",
    "customer-area-design-extras": "1.2.1",
    "customer-area-enhanced-files": "2.1.1",
    "customer-area-extended-permissions": "5.1.0",
    "customer-area-invoicing": "2.5.2",
    "customer-area-login-form": "5.1.2",
    "customer-area-managed-groups": "4.1.0",
    "customer-area-master-demo": "0.0.1",
    "customer-area-notifications": "6.4.2",
    "customer-area-owner-restriction": "4.1.1",
    "customer-area-paypal-gateway": "1.1.1",
    "customer-area-projects": "4.2.2",
    "customer-area-protect-post-types": "2.1.1",
    "customer-area-search": "3.1.2",
    "customer-area-smart-groups": "2.1.0",
    "customer-area-stripe-gateway": "1.1.1",
    "customer-area-switch-users": "4.1.2",
    "customer-area-tasks": "4.2.1",
    "customer-area-terms-of-service": "1.0.2",
    "customer-area-unread-documents": "1.1.1"
  },
  "7.8.0": {
    "customer-area-acf-integration": "5.0.0",
    "customer-area-collaboration": "4.1.2",
    "customer-area-conversations": "4.3.4",
    "customer-area-design-extras": "1.2.2",
    "customer-area-enhanced-files": "2.1.1",
    "customer-area-extended-permissions": "5.1.0",
    "customer-area-invoicing": "2.5.2",
    "customer-area-login-form": "5.1.3",
    "customer-area-managed-groups": "4.1.0",
    "customer-area-master-demo": "0.0.1",
    "customer-area-notifications": "6.4.2",
    "customer-area-owner-restriction": "4.1.1",
    "customer-area-paypal-gateway": "1.1.1",
    "customer-area-projects": "4.2.3",
    "customer-area-protect-post-types": "2.1.1",
    "customer-area-search": "3.1.2",
    "customer-area-smart-groups": "2.1.1",
    "customer-area-stripe-gateway": "1.1.1",
    "customer-area-switch-users": "4.1.2",
    "customer-area-tasks": "4.2.2",
    "customer-area-terms-of-service": "1.0.2",
    "customer-area-unread-documents": "1.1.1"
  },
  "7.8.1": {
    "customer-area-acf-integration": "5.0.0",
    "customer-area-collaboration": "4.1.2",
    "customer-area-conversations": "4.3.4",
    "customer-area-design-extras": "1.2.2",
    "customer-area-enhanced-files": "2.1.1",
    "customer-area-extended-permissions": "5.1.0",
    "customer-area-invoicing": "2.5.2",
    "customer-area-login-form": "5.1.3",
    "customer-area-managed-groups": "4.1.0",
    "customer-area-master-demo": "0.0.1",
    "customer-area-notifications": "6.4.2",
    "customer-area-owner-restriction": "4.1.1",
    "customer-area-paypal-gateway": "1.1.1",
    "customer-area-projects": "4.2.3",
    "customer-area-protect-post-types": "2.1.1",
    "customer-area-search": "3.1.2",
    "customer-area-smart-groups": "2.1.1",
    "customer-area-stripe-gateway": "1.1.1",
    "customer-area-switch-users": "4.1.2",
    "customer-area-tasks": "4.2.2",
    "customer-area-terms-of-service": "1.0.2",
    "customer-area-unread-documents": "1.1.1"
  },
  "7.8.2": {
    "customer-area-acf-integration": "5.0.0",
    "customer-area-collaboration": "4.1.2",
    "customer-area-conversations": "4.3.4",
    "customer-area-design-extras": "1.2.3",
    "customer-area-enhanced-files": "2.1.1",
    "customer-area-extended-permissions": "5.1.0",
    "customer-area-invoicing": "2.5.2",
    "customer-area-login-form": "5.1.3",
    "customer-area-managed-groups": "4.1.0",
    "customer-area-master-demo": "0.0.1",
    "customer-area-notifications": "6.4.2",
    "customer-area-owner-restriction": "4.1.1",
    "customer-area-paypal-gateway": "1.1.1",
    "customer-area-projects": "4.2.3",
    "customer-area-protect-post-types": "2.1.1",
    "customer-area-search": "3.1.2",
    "customer-area-smart-groups": "2.1.1",
    "customer-area-stripe-gateway": "1.1.1",
    "customer-area-switch-users": "4.1.2",
    "customer-area-tasks": "4.2.2",
    "customer-area-terms-of-service": "1.0.2",
    "customer-area-unread-documents": "1.1.1"
  },
  "7.8.3": {
    "customer-area-acf-integration": "5.0.0",
    "customer-area-bulk-actions": "1.0.0",
    "customer-area-collaboration": "4.1.2",
    "customer-area-conversations": "4.3.4",
    "customer-area-design-extras": "1.2.3",
    "customer-area-enhanced-files": "2.1.1",
    "customer-area-extended-permissions": "5.1.0",
    "customer-area-invoicing": "2.5.2",
    "customer-area-login-form": "5.1.3",
    "customer-area-managed-groups": "4.1.0",
    "customer-area-master-demo": "0.0.1",
    "customer-area-notifications": "6.4.2",
    "customer-area-owner-restriction": "4.1.1",
    "customer-area-paypal-gateway": "1.1.1",
    "customer-area-projects": "4.2.3",
    "customer-area-protect-post-types": "2.1.1",
    "customer-area-search": "3.1.2",
    "customer-area-smart-groups": "2.1.1",
    "customer-area-stripe-gateway": "1.1.1",
    "customer-area-switch-users": "4.1.2",
    "customer-area-tasks": "4.2.2",
    "customer-area-terms-of-service": "1.0.2",
    "customer-area-unread-documents": "1.1.1"
  },
  "7.8.4": {
    "customer-area-acf-integration": "5.0.0",
    "customer-area-bulk-actions": "1.0.0",
    "customer-area-collaboration": "4.1.2",
    "customer-area-conversations": "4.3.4",
    "customer-area-design-extras": "1.2.3",
    "customer-area-enhanced-files": "2.1.1",
    "customer-area-extended-permissions": "5.1.0",
    "customer-area-invoicing": "2.5.2",
    "customer-area-login-form": "5.1.3",
    "customer-area-managed-groups": "4.1.0",
    "customer-area-master-demo": "0.0.1",
    "customer-area-notifications": "6.4.2",
    "customer-area-owner-restriction": "4.1.1",
    "customer-area-paypal-gateway": "1.1.1",
    "customer-area-projects": "4.2.3",
    "customer-area-protect-post-types": "2.1.1",
    "customer-area-search": "3.1.2",
    "customer-area-smart-groups": "2.1.1",
    "customer-area-stripe-gateway": "1.1.1",
    "customer-area-switch-users": "4.1.2",
    "customer-area-tasks": "4.2.2",
    "customer-area-terms-of-service": "1.0.2",
    "customer-area-unread-documents": "1.1.1"
  },
  "7.8.5": {
    "customer-area-acf-integration": "5.0.0",
    "customer-area-bulk-actions": "1.0.0",
    "customer-area-collaboration": "4.1.2",
    "customer-area-conversations": "4.3.4",
    "customer-area-design-extras": "1.2.3",
    "customer-area-enhanced-files": "2.1.1",
    "customer-area-extended-permissions": "5.1.0",
    "customer-area-invoicing": "2.5.2",
    "customer-area-login-form": "5.1.3",
    "customer-area-managed-groups": "4.1.0",
    "customer-area-master-demo": "0.0.1",
    "customer-area-notifications": "6.4.2",
    "customer-area-owner-restriction": "4.1.1",
    "customer-area-paypal-gateway": "1.1.1",
    "customer-area-projects": "4.2.3",
    "customer-area-protect-post-types": "2.1.1",
    "customer-area-search": "3.1.2",
    "customer-area-smart-groups": "2.1.1",
    "customer-area-stripe-gateway": "1.1.1",
    "customer-area-switch-users": "4.1.2",
    "customer-area-tasks": "4.2.2",
    "customer-area-terms-of-service": "1.0.2",
    "customer-area-unread-documents": "1.1.1"
  },
  "7.8.6": {
    "customer-area-acf-integration": "5.0.0",
    "customer-area-collaboration": "4.1.2",
    "customer-area-compatibility-divi": "1.0.3",
    "customer-area-content-expiry": "1.0.0",
    "customer-area-conversations": "4.3.4",
    "customer-area-design-extras": "1.2.3",
    "customer-area-enhanced-files": "2.1.1",
    "customer-area-extended-permissions": "5.1.0",
    "customer-area-invoicing": "2.5.2",
    "customer-area-login-form": "5.1.3",
    "customer-area-managed-groups": "4.1.0",
    "customer-area-master-demo": "0.0.1",
    "customer-area-notifications": "6.4.2",
    "customer-area-owner-restriction": "4.1.1",
    "customer-area-paypal-gateway": "1.1.1",
    "customer-area-projects": "4.2.3",
    "customer-area-protect-post-types": "2.1.1",
    "customer-area-search": "3.1.2",
    "customer-area-smart-groups": "2.1.1",
    "customer-area-stripe-gateway": "1.1.1",
    "customer-area-switch-users": "4.1.2",
    "customer-area-tasks": "4.2.2",
    "customer-area-terms-of-service": "1.0.2",
    "customer-area-unread-documents": "1.1.1"
  },
  "7.9.0": {
    "customer-area-acf-integration": "5.1.0",
    "customer-area-collaboration": "4.2.0",
    "customer-area-compatibility-divi": "1.0.4",
    "customer-area-content-expiry": "1.0.1",
    "customer-area-conversations": "4.4.0",
    "customer-area-design-extras": "1.3.0",
    "customer-area-enhanced-files": "2.2.0",
    "customer-area-extended-permissions": "5.2.0",
    "customer-area-invoicing": "2.6.0",
    "customer-area-login-form": "5.2.0",
    "customer-area-managed-groups": "4.2.0",
    "customer-area-master-demo": "1.0.0",
    "customer-area-notifications": "6.5.0",
    "customer-area-owner-restriction": "4.2.0",
    "customer-area-paypal-gateway": "1.2.0",
    "customer-area-projects": "4.3.0",
    "customer-area-protect-post-types": "2.2.0",
    "customer-area-search": "3.2.0",
    "customer-area-smart-groups": "2.2.0",
    "customer-area-stripe-gateway": "1.2.0",
    "customer-area-switch-users": "4.2.0",
    "customer-area-tasks": "4.3.0",
    "customer-area-terms-of-service": "1.1.0",
    "customer-area-unread-documents": "1.2.0"
  },
  "7.9.2": {
    "customer-area-acf-integration": "5.2.0",
    "customer-area-collaboration": "4.2.0",
    "customer-area-compatibility-divi": "1.1.0",
    "customer-area-content-expiry": "1.0.1",
    "customer-area-conversations": "4.4.0",
    "customer-area-design-extras": "1.3.1",
    "customer-area-enhanced-files": "2.2.0",
    "customer-area-extended-permissions": "5.2.0",
    "customer-area-invoicing": "2.6.0",
    "customer-area-login-form": "5.2.0",
    "customer-area-managed-groups": "4.2.0",
    "customer-area-master-demo": "1.0.0",
    "customer-area-notifications": "6.5.0",
    "customer-area-owner-restriction": "4.2.0",
    "customer-area-paypal-gateway": "1.2.0",
    "customer-area-projects": "4.3.0",
    "customer-area-protect-post-types": "2.2.0",
    "customer-area-search": "3.2.1",
    "customer-area-smart-groups": "2.2.0",
    "customer-area-stripe-gateway": "1.2.0",
    "customer-area-switch-users": "4.2.0",
    "customer-area-tasks": "4.3.0",
    "customer-area-terms-of-service": "1.1.0",
    "customer-area-unread-documents": "1.2.0"
  },
  "7.10.0": {
    "customer-area-acf-integration": "5.2.0",
    "customer-area-collaboration": "4.2.0",
    "customer-area-compatibility-divi": "1.1.0",
    "customer-area-content-expiry": "1.1.0",
    "customer-area-conversations": "4.5.0",
    "customer-area-design-extras": "1.4.0",
    "customer-area-enhanced-files": "2.2.0",
    "customer-area-extended-permissions": "5.2.0",
    "customer-area-invoicing": "2.7.0",
    "customer-area-login-form": "5.2.0",
    "customer-area-managed-groups": "4.2.0",
    "customer-area-master-demo": "1.1.0",
    "customer-area-notifications": "6.6.0",
    "customer-area-owner-restriction": "4.2.0",
    "customer-area-paypal-gateway": "1.2.0",
    "customer-area-projects": "4.4.0",
    "customer-area-protect-post-types": "2.2.0",
    "customer-area-search": "3.3.0",
    "customer-area-smart-groups": "2.2.0",
    "customer-area-stripe-gateway": "1.2.0",
    "customer-area-switch-users": "4.3.0",
    "customer-area-tasks": "4.4.0",
    "customer-area-terms-of-service": "1.2.0",
    "customer-area-unread-documents": "1.2.0"
  },
  "7.10.1": {
    "customer-area-acf-integration": "5.2.0",
    "customer-area-collaboration": "4.2.0",
    "customer-area-compatibility-divi": "1.1.1",
    "customer-area-content-expiry": "1.1.0",
    "customer-area-conversations": "4.5.0",
    "customer-area-design-extras": "1.4.1",
    "customer-area-enhanced-files": "2.2.0",
    "customer-area-extended-permissions": "5.2.0",
    "customer-area-invoicing": "2.7.0",
    "customer-area-login-form": "5.2.0",
    "customer-area-managed-groups": "4.2.0",
    "customer-area-master-demo": "1.1.0",
    "customer-area-notifications": "6.6.0",
    "customer-area-owner-restriction": "4.2.0",
    "customer-area-paypal-gateway": "1.2.0",
    "customer-area-projects": "4.4.0",
    "customer-area-protect-post-types": "2.2.0",
    "customer-area-search": "3.3.0",
    "customer-area-smart-groups": "2.2.0",
    "customer-area-stripe-gateway": "1.2.0",
    "customer-area-switch-users": "4.3.0",
    "customer-area-tasks": "4.4.0",
    "customer-area-terms-of-service": "1.2.0",
    "customer-area-unread-documents": "1.2.0"
  },
  "7.10.2": {
    "customer-area-acf-integration": "5.2.0",
    "customer-area-collaboration": "4.2.0",
    "customer-area-compatibility-divi": "1.1.1",
    "customer-area-content-expiry": "1.1.0",
    "customer-area-conversations": "4.5.0",
    "customer-area-design-extras": "1.4.2",
    "customer-area-enhanced-files": "2.2.0",
    "customer-area-extended-permissions": "5.2.0",
    "customer-area-invoicing": "2.7.0",
    "customer-area-login-form": "5.2.0",
    "customer-area-managed-groups": "4.2.0",
    "customer-area-master-demo": "1.1.0",
    "customer-area-notifications": "6.6.0",
    "customer-area-owner-restriction": "4.2.0",
    "customer-area-paypal-gateway": "1.2.0",
    "customer-area-projects": "4.4.0",
    "customer-area-protect-post-types": "2.2.0",
    "customer-area-search": "3.3.1",
    "customer-area-smart-groups": "2.2.0",
    "customer-area-stripe-gateway": "1.2.0",
    "customer-area-switch-users": "4.3.0",
    "customer-area-tasks": "4.4.0",
    "customer-area-terms-of-service": "1.2.0",
    "customer-area-unread-documents": "1.2.0"
  },
  "7.10.3": {
    "customer-area-acf-integration": "5.2.0",
    "customer-area-collaboration": "4.2.0",
    "customer-area-compatibility-divi": "1.1.1",
    "customer-area-content-expiry": "1.1.0",
    "customer-area-conversations": "4.5.1",
    "customer-area-design-extras": "1.4.3",
    "customer-area-enhanced-files": "2.2.0",
    "customer-area-extended-permissions": "5.2.0",
    "customer-area-invoicing": "2.7.1",
    "customer-area-login-form": "5.2.0",
    "customer-area-managed-groups": "4.2.0",
    "customer-area-master-demo": "1.1.0",
    "customer-area-notifications": "6.6.0",
    "customer-area-owner-restriction": "4.2.0",
    "customer-area-paypal-gateway": "1.2.0",
    "customer-area-projects": "4.4.1",
    "customer-area-protect-post-types": "2.2.0",
    "customer-area-search": "3.3.1",
    "customer-area-smart-groups": "2.2.0",
    "customer-area-stripe-gateway": "1.2.0",
    "customer-area-switch-users": "4.3.0",
    "customer-area-tasks": "4.4.1",
    "customer-area-terms-of-service": "1.2.0",
    "customer-area-unread-documents": "1.2.0"
  },
  "7.10.4": {
    "customer-area-acf-integration": "5.2.0",
    "customer-area-collaboration": "4.2.0",
    "customer-area-compatibility-divi": "1.1.1",
    "customer-area-content-expiry": "1.1.0",
    "customer-area-conversations": "4.5.1",
    "customer-area-design-extras": "1.4.4",
    "customer-area-enhanced-files": "2.2.0",
    "customer-area-extended-permissions": "5.2.0",
    "customer-area-invoicing": "2.7.1",
    "customer-area-login-form": "5.2.0",
    "customer-area-managed-groups": "4.2.0",
    "customer-area-master-demo": "1.1.0",
    "customer-area-notifications": "6.6.0",
    "customer-area-owner-restriction": "4.2.0",
    "customer-area-paypal-gateway": "1.2.0",
    "customer-area-projects": "4.4.1",
    "customer-area-protect-post-types": "2.2.0",
    "customer-area-search": "3.3.1",
    "customer-area-smart-groups": "2.2.0",
    "customer-area-stripe-gateway": "1.2.0",
    "customer-area-switch-users": "4.3.0",
    "customer-area-tasks": "4.4.1",
    "customer-area-terms-of-service": "1.2.1",
    "customer-area-unread-documents": "1.2.0"
  },
  "7.10.6": {
    "customer-area-acf-integration": "5.2.0",
    "customer-area-collaboration": "4.2.0",
    "customer-area-compatibility-divi": "1.1.1",
    "customer-area-content-expiry": "1.1.0",
    "customer-area-conversations": "4.5.2",
    "customer-area-design-extras": "1.4.4",
    "customer-area-enhanced-files": "2.2.0",
    "customer-area-extended-permissions": "5.2.0",
    "customer-area-invoicing": "2.7.1",
    "customer-area-login-form": "5.2.0",
    "customer-area-managed-groups": "4.2.0",
    "customer-area-master-demo": "1.1.0",
    "customer-area-notifications": "6.6.0",
    "customer-area-owner-restriction": "4.2.0",
    "customer-area-paypal-gateway": "1.2.0",
    "customer-area-projects": "4.4.1",
    "customer-area-protect-post-types": "2.2.0",
    "customer-area-search": "3.3.1",
    "customer-area-smart-groups": "2.2.0",
    "customer-area-stripe-gateway": "1.2.0",
    "customer-area-switch-users": "4.3.0",
    "customer-area-tasks": "4.4.1",
    "customer-area-terms-of-service": "1.2.1",
    "customer-area-unread-documents": "1.2.0"
  },
  "8.0.0": {
    "customer-area-acf-integration": "6.0.0",
    "customer-area-bulk-import": "1.0.0",
    "customer-area-collaboration": "5.0.0",
    "customer-area-compatibility-divi": "2.0.0",
    "customer-area-content-expiry": "2.0.0",
    "customer-area-conversations": "5.0.0",
    "customer-area-design-extras": "2.0.0",
    "customer-area-enhanced-files": "3.0.0",
    "customer-area-extended-permissions": "6.0.0",
    "customer-area-invoicing": "3.0.0",
    "customer-area-login-form": "6.0.0",
    "customer-area-managed-groups": "5.0.0",
    "customer-area-master-demo": "2.0.0",
    "customer-area-notifications": "7.0.0",
    "customer-area-owner-restriction": "5.0.0",
    "customer-area-paypal-gateway": "2.0.0",
    "customer-area-projects": "5.0.0",
    "customer-area-protect-post-types": "3.0.0",
    "customer-area-search": "4.0.0",
    "customer-area-smart-groups": "3.0.0",
    "customer-area-stripe-gateway": "2.0.0",
    "customer-area-switch-users": "5.0.0",
    "customer-area-tasks": "5.0.0",
    "customer-area-terms-of-service": "2.0.0",
    "customer-area-unread-documents": "2.0.0"
  },
  "8.0.1": {
    "customer-area-acf-integration": "6.0.0",
    "customer-area-bulk-import": "1.0.0",
    "customer-area-collaboration": "5.0.0",
    "customer-area-compatibility-divi": "2.0.0",
    "customer-area-content-expiry": "2.0.0",
    "customer-area-conversations": "5.0.0",
    "customer-area-design-extras": "2.0.0",
    "customer-area-enhanced-files": "3.0.0",
    "customer-area-extended-permissions": "6.0.0",
    "customer-area-invoicing": "3.0.0",
    "customer-area-login-form": "6.0.0",
    "customer-area-managed-groups": "5.0.0",
    "customer-area-master-demo": "2.0.0",
    "customer-area-notifications": "7.0.0",
    "customer-area-owner-restriction": "5.0.0",
    "customer-area-paypal-gateway": "2.0.0",
    "customer-area-projects": "5.0.0",
    "customer-area-protect-post-types": "3.0.0",
    "customer-area-search": "4.0.0",
    "customer-area-smart-groups": "3.0.0",
    "customer-area-stripe-gateway": "2.0.0",
    "customer-area-switch-users": "5.0.0",
    "customer-area-tasks": "5.0.0",
    "customer-area-terms-of-service": "2.0.0",
    "customer-area-unread-documents": "2.0.0"
  },
  "8.0.2": {
    "customer-area-acf-integration": "6.0.0",
    "customer-area-bulk-import": "1.0.0",
    "customer-area-collaboration": "5.0.0",
    "customer-area-compatibility-divi": "2.0.0",
    "customer-area-content-expiry": "2.0.0",
    "customer-area-conversations": "5.0.0",
    "customer-area-design-extras": "2.0.0",
    "customer-area-enhanced-files": "3.0.0",
    "customer-area-extended-permissions": "6.0.0",
    "customer-area-invoicing": "3.0.0",
    "customer-area-login-form": "6.0.0",
    "customer-area-managed-groups": "5.0.0",
    "customer-area-master-demo": "2.0.0",
    "customer-area-notifications": "7.0.0",
    "customer-area-owner-restriction": "5.0.0",
    "customer-area-paypal-gateway": "2.0.0",
    "customer-area-projects": "5.0.0",
    "customer-area-protect-post-types": "3.0.0",
    "customer-area-search": "4.0.0",
    "customer-area-smart-groups": "3.0.0",
    "customer-area-stripe-gateway": "2.0.0",
    "customer-area-switch-users": "5.0.0",
    "customer-area-tasks": "5.0.0",
    "customer-area-terms-of-service": "2.0.0",
    "customer-area-unread-documents": "2.0.0"
  },
  "8.0.3": {
    "customer-area-acf-integration": "6.0.0",
    "customer-area-bulk-import": "1.0.0",
    "customer-area-collaboration": "5.0.0",
    "customer-area-compatibility-divi": "2.0.0",
    "customer-area-content-expiry": "2.0.0",
    "customer-area-conversations": "5.0.0",
    "customer-area-design-extras": "2.0.0",
    "customer-area-enhanced-files": "3.0.0",
    "customer-area-extended-permissions": "6.0.0",
    "customer-area-invoicing": "3.0.0",
    "customer-area-login-form": "6.0.0",
    "customer-area-managed-groups": "5.0.0",
    "customer-area-master-demo": "2.0.0",
    "customer-area-notifications": "7.0.0",
    "customer-area-owner-restriction": "5.0.0",
    "customer-area-paypal-gateway": "2.0.0",
    "customer-area-projects": "5.0.0",
    "customer-area-protect-post-types": "3.0.0",
    "customer-area-search": "4.0.0",
    "customer-area-smart-groups": "3.0.0",
    "customer-area-stripe-gateway": "2.0.0",
    "customer-area-switch-users": "5.0.0",
    "customer-area-tasks": "5.0.0",
    "customer-area-terms-of-service": "2.0.0",
    "customer-area-unread-documents": "2.0.0"
  },
  "8.0.4": {
    "customer-area-acf-integration": "6.0.0",
    "customer-area-bulk-import": "1.0.0",
    "customer-area-collaboration": "5.0.0",
    "customer-area-compatibility-divi": "2.0.0",
    "customer-area-content-expiry": "2.0.0",
    "customer-area-conversations": "5.0.0",
    "customer-area-design-extras": "2.0.0",
    "customer-area-enhanced-files": "3.0.0",
    "customer-area-extended-permissions": "6.0.0",
    "customer-area-invoicing": "3.0.0",
    "customer-area-login-form": "6.0.0",
    "customer-area-managed-groups": "5.0.0",
    "customer-area-master-demo": "2.0.0",
    "customer-area-notifications": "7.0.0",
    "customer-area-owner-restriction": "5.0.0",
    "customer-area-paypal-gateway": "2.0.0",
    "customer-area-projects": "5.0.0",
    "customer-area-protect-post-types": "3.0.0",
    "customer-area-search": "4.0.0",
    "customer-area-smart-groups": "3.0.0",
    "customer-area-stripe-gateway": "2.0.0",
    "customer-area-switch-users": "5.0.0",
    "customer-area-tasks": "5.0.0",
    "customer-area-terms-of-service": "2.0.0",
    "customer-area-unread-documents": "2.0.0"
  },
  "8.0.5": {
    "customer-area-acf-integration": "6.0.2",
    "customer-area-bulk-import": "1.0.0",
    "customer-area-collaboration": "5.0.2",
    "customer-area-compatibility-divi": "3.0.2",
    "customer-area-content-expiry": "2.0.2",
    "customer-area-conversations": "5.0.2",
    "customer-area-design-extras": "2.0.2",
    "customer-area-enhanced-files": "3.0.2",
    "customer-area-extended-permissions": "6.0.1",
    "customer-area-invoicing": "3.0.2",
    "customer-area-login-form": "6.0.1",
    "customer-area-managed-groups": "5.0.1",
    "customer-area-master-demo": "2.0.1",
    "customer-area-notifications": "7.0.2",
    "customer-area-owner-restriction": "5.0.2",
    "customer-area-paypal-gateway": "2.0.1",
    "customer-area-projects": "5.0.2",
    "customer-area-protect-post-types": "3.0.2",
    "customer-area-search": "4.0.1",
    "customer-area-smart-groups": "3.0.2",
    "customer-area-stripe-gateway": "2.0.1",
    "customer-area-switch-users": "5.0.1",
    "customer-area-tasks": "5.0.2",
    "customer-area-terms-of-service": "2.0.1",
    "customer-area-unread-documents": "2.0.1"
  },
  "8.0.6": {
    "customer-area-acf-integration": "6.0.2",
    "customer-area-bulk-import": "1.0.0",
    "customer-area-collaboration": "5.0.2",
    "customer-area-compatibility-divi": "3.0.3",
    "customer-area-content-expiry": "2.0.2",
    "customer-area-conversations": "5.0.2",
    "customer-area-design-extras": "2.0.2",
    "customer-area-enhanced-files": "3.0.2",
    "customer-area-extended-permissions": "6.0.1",
    "customer-area-ftp-mass-import": "1.0.0",
    "customer-area-invoicing": "3.0.2",
    "customer-area-login-form": "6.0.1",
    "customer-area-managed-groups": "5.0.1",
    "customer-area-master-demo": "2.0.1",
    "customer-area-notifications": "7.0.2",
    "customer-area-owner-restriction": "5.0.1",
    "customer-area-paypal-gateway": "2.0.1",
    "customer-area-projects": "5.0.2",
    "customer-area-protect-post-types": "3.0.2",
    "customer-area-search": "4.0.1",
    "customer-area-smart-groups": "3.0.2",
    "customer-area-stripe-gateway": "2.0.1",
    "customer-area-switch-users": "5.0.1",
    "customer-area-tasks": "5.0.2",
    "customer-area-terms-of-service": "2.0.1",
    "customer-area-unread-documents": "2.0.1"
  },
  "8.1.0": {
    "customer-area-acf-integration": "6.0.3",
    "customer-area-bulk-import": "1.0.0",
    "customer-area-collaboration": "5.0.2",
    "customer-area-compatibility-divi": "3.0.3",
    "customer-area-content-expiry": "2.0.2",
    "customer-area-conversations": "5.0.2",
    "customer-area-design-extras": "2.1.0",
    "customer-area-enhanced-files": "3.0.2",
    "customer-area-extended-permissions": "6.0.1",
    "customer-area-ftp-mass-import": "1.0.0",
    "customer-area-invoicing": "3.0.2",
    "customer-area-login-form": "6.0.1",
    "customer-area-managed-groups": "5.0.1",
    "customer-area-master-demo": "2.0.1",
    "customer-area-notifications": "7.0.3",
    "customer-area-owner-restriction": "5.0.1",
    "customer-area-paypal-gateway": "2.0.1",
    "customer-area-projects": "5.0.2",
    "customer-area-protect-post-types": "3.0.2",
    "customer-area-search": "4.0.1",
    "customer-area-smart-groups": "3.0.2",
    "customer-area-stripe-gateway": "2.0.1",
    "customer-area-switch-users": "5.0.1",
    "customer-area-tasks": "5.0.2",
    "customer-area-terms-of-service": "2.0.1",
    "customer-area-unread-documents": "2.0.1"
  },
  "8.1.1": {
    "customer-area-acf-integration": "6.0.3",
    "customer-area-bulk-import": "1.0.0",
    "customer-area-collaboration": "5.0.2",
    "customer-area-compatibility-divi": "3.0.3",
    "customer-area-content-expiry": "2.0.2",
    "customer-area-conversations": "5.0.3",
    "customer-area-design-extras": "2.1.1",
    "customer-area-enhanced-files": "3.0.2",
    "customer-area-extended-permissions": "6.0.1",
    "customer-area-ftp-mass-import": "1.0.0",
    "customer-area-invoicing": "3.0.3",
    "customer-area-login-form": "6.0.2",
    "customer-area-managed-groups": "5.0.1",
    "customer-area-master-demo": "2.0.1",
    "customer-area-notifications": "7.0.4",
    "customer-area-owner-restriction": "5.0.2",
    "customer-area-paypal-gateway": "2.0.1",
    "customer-area-projects": "5.0.3",
    "customer-area-protect-post-types": "3.0.2",
    "customer-area-search": "4.0.1",
    "customer-area-smart-groups": "3.0.2",
    "customer-area-stripe-gateway": "2.0.1",
    "customer-area-switch-users": "5.0.2",
    "customer-area-tasks": "5.0.3",
    "customer-area-terms-of-service": "2.0.1",
    "customer-area-unread-documents": "2.0.1"
  },
  "8.1.2": {
    "customer-area-acf-integration": "6.0.3",
    "customer-area-bulk-import": "1.0.0",
    "customer-area-collaboration": "5.0.2",
    "customer-area-compatibility-divi": "3.0.3",
    "customer-area-content-expiry": "2.0.2",
    "customer-area-conversations": "5.0.3",
    "customer-area-design-extras": "2.1.1",
    "customer-area-enhanced-files": "3.0.2",
    "customer-area-extended-permissions": "6.0.1",
    "customer-area-ftp-mass-import": "1.0.0",
    "customer-area-invoicing": "3.0.3",
    "customer-area-login-form": "6.0.2",
    "customer-area-managed-groups": "5.0.1",
    "customer-area-master-demo": "2.0.1",
    "customer-area-notifications": "7.0.4",
    "customer-area-owner-restriction": "5.0.2",
    "customer-area-paypal-gateway": "2.0.1",
    "customer-area-projects": "5.0.3",
    "customer-area-protect-post-types": "3.0.2",
    "customer-area-search": "4.0.1",
    "customer-area-smart-groups": "3.0.2",
    "customer-area-stripe-gateway": "2.0.1",
    "customer-area-switch-users": "5.0.2",
    "customer-area-tasks": "5.0.3",
    "customer-area-terms-of-service": "2.0.1",
    "customer-area-unread-documents": "2.0.1"
  }
}