{
    "home": {
        "route": "/",
        "regex": "^/$"
    },
    "create contact": {
        "route": "/tasks/create",
        "regex": "^/tasks/create$"
    },
    "login": {
        "route": "/login",
        "regex": "^/login$"
    },
    "wizard": {
        "route": "/wizard",
        "regex": "^/wizard$"
    },
    "profile": {
        "route": "/profile",
        "regex": "^/profile$"
    }
}