{
  "collectionName": {
    "insert": [
      {
        "_id": "",
        "attr1": "",
        "attr2": "",
        "attr3": ""
      }
    ],
    "update": [
      {
        "_id": "",
        "attr1": "",
        "attr2": "",
        "attr3": ""
      }
    ],
    "delete": [
      {
        "_id": ""
      }
    ],
    "updateMany": {
      "criteria": {
        "filter": "",
        "type": "",
        "value": "",
        "fieldName": ""
      },
      "documentsToUpdate": [
        {
          "$addFields": {
            "attr1": "",
            "attr2": ""
          }
        },
        {
          "$set": {
            "attr1": "",
            "attr2": ""
          }
        }
      ]
    }

  }
}