{
  "collectionName": {
    "insert": [
      {
        "_id": "",
        "attr1": "",
        "attr2": "",
        "attr3": ""
      }
    ],
    "update": [
      {
        "_id": "",
        "attr1": "",
        "attr2": "",
        "attr3": ""
      }
    ],
    "delete": [
      {
        "_id": ""
      }
    ]
  }
}
