 ,-----. ,--.   ,--. ,-----.     ,------.  ,------.  ,---.   ,--------.   ,--------. ,--.   ,--.
'  .--./  \  `.'  /  |  |) /_    |  .--. ' |  .---' '   .-'  '--.  .--'   '--.  .--' |   `.'   |
|  |       '.    /   |  .-.  \   |  '--'.' |  `--,  `.  `-.     |  |         |  |    |  |'.'|  |
'  '--'\     |  |    |  '--' /   |  |\  \  |  `---. .-'    |    |  |         |  |    |  |   |  |
 `-----'     `--'    `------'    `--' '--' `------' `-----'     `--'         `--'    `--'   `--'

:: Spring Boot :: ${spring-boot.version}
