{
  "name": "Craft a Trident and Elytra",
  "icon": "minecraft:trident",
  "category": "patchouli:notable_mods",
  "read_by_default": false,
  "pages": [
    {
      "type": "patchouli:text",
      "text": "The Trident and Elytra are craftable!$(br2)Go out and hunt some Thrashers deep in cold ocean biomes for the Trident and find some Netherite and slime balls for your first Elytra. Also the Elytra can be put on your back Curios slot so you can wear it with armor!"
    },
    {
      "type": "patchouli:crafting",
      "recipe": "upgrade_aquatic:trident",
      "recipe2": "crafttweaker:minecraft_elytra"
    }
  ]
}