{
  "name": "Create",
  "icon": "create:cogwheel",
  "category": "patchouli:notable_mods",
  "read_by_default": false,
  "pages": [
    {
      "type": "patchouli:text",
      "text": "Create is the only big tech mod in this pack and it should need no introduction. This pack not only contains Create, but also 16 addon moods for it! Here are the addons mods:$(br2)$(l)Alloyed:$() Adds new metals like Steel and Bronze.$(br)$(l)Central Kitchen:$() Adds Farmer's Delight compat to Create.$(br)$(l)Chunkloading:$() Adds a Create Powered chunk loader.$(br)$(l)Crystal Clear:$() Adds new types of glass."
    },
    {
      "type": "patchouli:text",
      "text": "$(l)Diesel Generators:$() Adds a new power source with Diesel.$(br)$(l)Encased:$() Adds new customization option to Create machines.$(br)$(l)Enchantment Industry:$() Adds new ways of automating experience and enchanting.$(br)$(l)Extended Cogwheel:$() Adds new cogwheels.$(br)$(l)Jetpack:$() Adds a jetpack.$(br)$(l)Liquid Burner:$() Allows burners to accept liquid sources like lava.$(br)$(l)Mechanical Spawner:$() Adds a Create powered mechanical spawner for artificial spawning."
    },
    {
      "type": "patchouli:text",
      "text": "$(br)$(l)New Age:$() A big expansion that adds reactors and electricity.$(br)$(l)Slice and Dice:$() More Farmer's Delight and other food compat.$(br)$(l)Steam 'n' Rails:$() Adds a ton of new train related items.$(br)$(l)Structures:$() Adds Create machines to some villages.$(br)$(l)Tipsy n' Dizzy:$() Allows you brew alcohol."
    }
  ]
}