{
  "replace": true,
  "key": "shulker_shell",
  "category": "scale",
  "primary": 6,
  "secondary": 0.4,
  "tertiary": 1,
  "durability": 1024,
  "integrityCost": 1,
  "integrityGain": 6,
  "magicCapacity": 120,
  "toolLevel": 0,
  "toolEfficiency": 0,
  "tints": {
    "glyph": "shulker_glyph",
    "texture": "shulker"
  },
  "textures": [
    "crude",
    "default"
  ],
  "material": {
    "items": [ "minecraft:shulker_shell" ]
  },
  "requiredTools": {
    "cut": "minecraft:stone"
  }
}
