{
  "attributes": [
    {
      "attribute": "minecraft:generic.attack_damage",
      "amount": 5,
      "operation": 0
    },
    {
      "attribute": "minecraft:generic.attack_speed",
      "amount": -1.6,
      "operation": 0
    },
    {
      "attribute": "forge:reach_distance",
      "amount": 2,
      "operation": 0
    },
    {
      "attribute": "dungeons_gear:attack_reach",
      "amount": 2,
      "operation": 0
    }
  ],
  "material": "dungeons_gear:generic",
  "built_in_enchantments": [],
  "unique": false,
  "rarity": "UNCOMMON",
  "combo": 3
}