{
  "type": "minecraft:chest",
  "pools": [
    {
      "name": "main",
      "rolls": 1.0,
      "bonus_rolls": 0.0,
      "entries": [
        {
          "type": "minecraft:item",
          "weight": 2,
          "name": "sophisticatedbackpacks:advanced_magnet_upgrade"
        },
        {
          "type": "minecraft:empty",
          "weight": 98
        }
      ]
    }
  ]
}