{
  "type": "minecraft:entity",
  "pools": [
    {
      "bonus_rolls": 0.0,
      "conditions": [
        {
          "condition": "minecraft:killed_by_player"
        }
      ],
      "entries": [
        {
          "type": "minecraft:item",
          "name": "twilightforest:giant_sword",
          "weight": "3"
        },
        {
          "type": "empty",
          "weight": "17"
        }
      ],
      "rolls": 1.0
    }
  ]
}