{
  "type": "minecraft:chest",
  "pools": [
    {
      "bonus_rolls": 0.0,
      "entries": [
        {
          "type": "minecraft:item",
          "functions": [
            {
              "add": false,
              "count": {
                "type": "minecraft:uniform",
                "max": 9.0,
                "min": 1.0
              },
              "function": "minecraft:set_count"
            }
          ],
          "name": "minecraft:iron_ingot"
        },
        {
          "type": "minecraft:item",
          "functions": [
            {
              "add": false,
              "count": {
                "type": "minecraft:uniform",
                "max": 5.0,
                "min": 1.0
              },
              "function": "minecraft:set_count"
            }
          ],
          "name": "minecraft:emerald"
        },
        {
          "type": "minecraft:item",
          "functions": [
            {
              "add": false,
              "count": {
                "type": "minecraft:uniform",
                "max": 9.0,
                "min": 1.0
              },
              "function": "minecraft:set_count"
            }
          ],
          "name": "twilightforest:ironwood_ingot"
        },
        {
          "type": "minecraft:item",
          "functions": [
            {
              "add": false,
              "count": {
                "type": "minecraft:uniform",
                "max": 12.0,
                "min": 1.0
              },
              "function": "minecraft:set_count"
            }
          ],
          "name": "twilightforest:maze_wafer"
        },
        {
          "type": "minecraft:item",
          "functions": [
            {
              "function": "minecraft:set_nbt",
              "tag": "{Potion:\"minecraft:strong_regeneration\"}"
            }
          ],
          "name": "minecraft:potion"
        },
        {
          "type": "minecraft:item",
          "functions": [
            {
              "function": "minecraft:set_nbt",
              "tag": "{Potion:\"minecraft:strong_healing\"}"
            }
          ],
          "name": "minecraft:potion"
        },
        {
          "type": "minecraft:item",
          "functions": [
            {
              "function": "minecraft:set_nbt",
              "tag": "{Potion:\"minecraft:strong_swiftness\"}"
            }
          ],
          "name": "minecraft:potion"
        }
      ],
      "rolls": 4.0
    },
    {
      "bonus_rolls": 0.0,
      "entries": [
        {
          "type": "minecraft:item",
          "functions": [
            {
              "enchantments": {
                "minecraft:infinity": 1,
                "minecraft:punch": 2
              },
              "function": "twilightforest:enchant"
            }
          ],
          "name": "minecraft:bow"
        },
        {
          "type": "minecraft:item",
          "functions": [
            {
              "enchantments": {
                "minecraft:flame": 1,
                "minecraft:power": 3
              },
              "function": "twilightforest:enchant"
            }
          ],
          "name": "minecraft:bow"
        },
        {
          "type": "minecraft:item",
          "functions": [
            {
              "enchantments": [
                "twilightforest:fire_react"
              ],
              "function": "minecraft:enchant_randomly"
            }
          ],
          "name": "minecraft:book"
        },
        {
          "type": "minecraft:item",
          "functions": [
            {
              "add": false,
              "count": {
                "type": "minecraft:uniform",
                "max": 12.0,
                "min": 1.0
              },
              "function": "minecraft:set_count"
            }
          ],
          "name": "twilightforest:steeleaf_ingot"
        },
        {
          "type": "minecraft:item",
          "functions": [
            {
              "enchantments": {
                "minecraft:protection": 3
              },
              "function": "twilightforest:enchant"
            }
          ],
          "name": "twilightforest:steeleaf_chestplate"
        },
        {
          "type": "minecraft:item",
          "functions": [
            {
              "enchantments": {
                "minecraft:protection": 2
              },
              "function": "twilightforest:enchant"
            }
          ],
          "name": "twilightforest:steeleaf_boots"
        },
        {
          "type": "minecraft:item",
          "functions": [
            {
              "enchantments": {
                "minecraft:fire_protection": 4
              },
              "function": "twilightforest:enchant"
            }
          ],
          "name": "twilightforest:steeleaf_leggings"
        },
        {
          "type": "minecraft:item",
          "functions": [
            {
              "enchantments": {
                "minecraft:respiration": 3
              },
              "function": "twilightforest:enchant"
            }
          ],
          "name": "twilightforest:steeleaf_helmet"
        }
      ],
      "rolls": 2.0
    },
    {
      "bonus_rolls": 0.0,
      "entries": [
        {
          "type": "minecraft:item",
          "name": "minecraft:emerald_block"
        },
        {
          "type": "minecraft:item",
          "name": "minecraft:ender_chest"
        }
      ],
      "rolls": 1.0
    }
  ]
}