{
  "name": "Workshop Decorations",
  "icon": "workshop_for_handsome_adventurer:workstation_placer_oak",
  "category": "patchouli:notable_mods",
  "read_by_default": false,
  "pages": [
    {
      "type": "patchouli:text",
      "text": "Workshop for Handsome Adventurer is a mod that adds new furniture for you workshop. You can hang up tools and weapons to show them off or even hang up Tetra hammers and axes to be used with your Tetra workbench. Workstations can even be upgraded!"
    },
    {
      "type": "patchouli:crafting",
      "recipe": "workshop_for_handsome_adventurer:workstation_placer_oak",
      "recipe2": "workshop_for_handsome_adventurer:tool_rack_framed_oak"
    }
  ]
}