{
  "replace": true,
  "key": "socket_emerald",
  "hidden": true,
  "category": "socket",
  "primary": 0,
  "secondary": 0,
  "tertiary": 0,
  "durability": 48,
  "integrityCost": 1,
  "integrityGain": 0,
  "magicCapacity": 0,
  "toolLevel": 0,
  "toolEfficiency": 0,
  "effects": {
    "criticalStrike": [15, 2]
  },
  "tints": {
    "glyph": "emerald_glyph",
    "texture": "emerald"
  },
  "textures": ["default"],
  "experienceCost": 2,
  "material": {
    "items": [ "minecraft:emerald" ]
  }
}
