{
  "attributes": [
    {
      "attribute": "minecraft:generic.attack_damage",
      "amount": 12,
      "operation": 0
    },
    {
      "attribute": "minecraft:generic.attack_speed",
      "amount": -3.2,
      "operation": 0
    },
    {
      "attribute": "minecraft:generic.attack_knockback",
      "amount": 1,
      "operation": 0
    }
  ],
  "material": "dungeons_gear:generic",
  "built_in_enchantments": [],
  "unique": false,
  "rarity": "UNCOMMON",
  "combo": 3
}