{
  "name": "Cataclysm",
  "icon": "cataclysm:abyss_eye",
  "category": "patchouli:notable_mods",
  "read_by_default": false,
  "pages": [
    {
      "type": "patchouli:text",
      "text": "L_Ender's Cataclysm mod has a bunch of massive dungeons and difficult bosses to defeat for insane rewards. Once you've beat the Twilight Forest and have access to Eyes of Ender, use JEI to search for the @cataclysm mod and make the new Eyes to get started on your boss hunt!"
    },
    {
      "type": "patchouli:entity",
      "entity": "cataclysm:ignis",
      "text": "$(o)\"Born of unrelenting flame, Ignis is a warlord of fire and fury, wielding a blade that turns the battlefield to embers.\""
    }
  ]
}