{
  "replace": true,
  "key": "obsidian",
  "category": "stone",
  "primary": 5,
  "secondary": 5,
  "tertiary": 0,
  "durability": 1024,
  "integrityCost": 3,
  "integrityGain": 1,
  "magicCapacity": 90,
  "toolLevel": "minecraft:netherite",
  "toolEfficiency": 6,
  "tints": {
    "glyph": "obsidian_glyph",
    "texture": "obsidian"
  },
  "textureOverrides": [ "items/module/sword/blade/heavy/" ],
  "tintOverrides": false,
  "textures": [
    "obsidian",
    "grainy",
    "crude",
    "default"
  ],
  "material": {
    "tag": "forge:obsidian"
  },
  "improvements": {
    "arrested": 0
  },
  "requiredTools": {
    "hammer_dig": "minecraft:diamond"
  }
}
