{
  "attributes": [
    {
      "attribute": "minecraft:generic.attack_damage",
      "amount": 1,
      "operation": 0
    },
    {
      "attribute": "minecraft:generic.attack_speed",
      "amount": -0.0,
      "operation": 0
    }
  ],
  "material": "dungeons_gear:generic",
  "built_in_enchantments": [],
  "light": true,
  "unique": true,
  "rarity": "RARE",
  "combo": 4
}