{
  "name": "The End",
  "icon": "minecraft:end_stone",
  "category": "patchouli:main_quest",
  "sortnum": 4,
  "read_by_default": false,
  "pages": [
    {
      "type": "patchouli:spotlight",
      "title": "The End",
      "item": "phantasm:fallen_star",
      "text": "The End is a desolate void of floating islands, shrouded in darkness and ruled by the unknown. Your goal here is to defeat the Ender Dragon and collect materials for the Aether portal frame."
    },
    {
      "type": "patchouli:entity",
      "entity": "minecraft:ender_dragon",
      "text": "$(o)\"The final guardian of the End, a winged titan of shadow and fury, defending its realm with relentless power.\""
    },
    {
      "type": "patchouli:crafting",
      "recipe": "crafttweaker:minecraft_ender_eye",
      "text": "You'll need Eyes of Ender in order to locate the Stronghold and activate the Portal to The End. They can be made by combining Ender Pearls and Fiery Blood from the Twilight Forest's Hydra."
    },
    {
      "type": "patchouli:spotlight",
      "item": "twilightforest:fiery_blood",
      "text": "Fiery Blood is a rare resource, but luckily you can multiply it! You can combine Fiery Blood into a Mechanical Mixer along with materials from The Undergarden to brew more."
    },
    {
      "type": "patchouli:text",
      "title": "Tetra Materials",
      "text": "Here is a list of notable materials from this dimension and their best intended use.$(br2)$(l)Tools:$() Stellium"
    },
    {
      "type": "patchouli:text",
      "title": "Gems and Sockets",
      "text": "$(l)Gems:$() Chorundum, Crystal Shard, and Void Crystal Shard$(br2)$(l)Sockets:$() Void Crystal"
    }
  ]
}