{
  "replace": true,
  "key": "wool",
  "category": "fabric",
  "hidden": true,
  "hiddenOutcomes": true,
  "primary": 1,
  "secondary": 1,
  "tertiary": 5,
  "durability": 200,
  "integrityCost": 1,
  "integrityGain": 4,
  "magicCapacity": 90,
  "toolLevel": 0,
  "toolEfficiency": 0,
  "tints": {
    "glyph": "ffffff",
    "texture": "dddddd"
  },
  "textures": [
    "crude",
    "default"
  ],
  "material": {
    "tag": "minecraft:wool"
  },
  "requiredTools": {
    "cut": "minecraft:wood"
  }
}
