{
  "name": "Carts",
  "icon": "astikorcarts:animal_cart",
  "category": "patchouli:notable_mods",
  "read_by_default": false,
  "pages": [
    {
      "type": "patchouli:text",
      "text": "Build carts to help transport many items, animals, and even other players! You can drag these around yourself or with a horse by hitting P near them.$(br2)Saddles are craftable now too."
    },
    {
      "type": "patchouli:crafting",
      "recipe": "astikorcarts:supply_cart",
      "recipe2": "aether:aether_saddle"
    }
  ]
}