{
  "se.mickelus.tetra.blocks.workbench.gui.WorkbenchScreen": {
    "ignore": true
  },
  "se.mickelus.tetra.blocks.workbench.WorkbenchContainer": {
    "ignore": true
  },
  "moonfather.workshop_for_handsome_adventurer.block_entities.screens.SimpleTableCraftingScreen": {
    "playerSideOnly": true
  },
  "moonfather.workshop_for_handsome_adventurer.block_entities.SimpleTableMenu": {
    "ignore": true
  },
  "moonfather.workshop_for_handsome_adventurer.block_entities.screens.DualTableCraftingScreen": {
    "playerSideOnly": true
  },
  "moonfather.workshop_for_handsome_adventurer.block_entities.DualTableMenu": {
    "ignore": true
  },
  "se.mickelus.tetra.blocks.forged.container.ForgedContainerScreen": {
    "ignore": true
  },
  "se.mickelus.tetra.blocks.forged.container.ForgedContainerMenu": {
    "ignore": true
  },
  "se.mickelus.tetra.items.modular.impl.toolbelt.gui.screen.ToolbeltScreen": {
    "ignore": true
  },
  "se.mickelus.tetra.items.modular.impl.toolbelt.ToolbeltContainer": {
    "ignore": true
  },
  "net.mcreator.stalwartdungeons.client.gui.TeleporterGUIScreen": {
    "playerSideOnly": true
  },
  "net.mcreator.stalwartdungeons.world.inventory.TeleporterGUIMenu": {
    "ignore": true
  },
  "net.mehvahdjukaar.supplementaries.client.screens.TrappedPresentBlockScreen": {
    "playerSideOnly": true
  },
  "net.mehvahdjukaar.supplementaries.common.inventories.TrappedPresentContainerMenu": {
    "ignore": true
  },
  "fuzs.easymagic.client.gui.screens.inventory.ModEnchantmentScreen": {
    "playerSideOnly": true
  },
  "fuzs.easymagic.world.inventory.ModEnchantmentMenu": {
    "ignore": true
  },
  "net.mehvahdjukaar.supplementaries.client.screens.PulleyBlockScreen": {
    "playerSideOnly": true
  },
  "net.mehvahdjukaar.supplementaries.common.inventories.PulleyBlockContainerMenu": {
    "ignore": true
  },
  "tallestegg.guardvillagers.client.gui.GuardInventoryScreen": {
    "ignore": true
  },
  "tallestegg.guardvillagers.entities.GuardContainer": {
    "ignore": true
  },
  "io.github.mortuusars.exposure.gui.screen.LightroomScreen": {
    "playerSideOnly": true
  },
  "io.github.mortuusars.exposure.menu.LightroomMenu": {
    "ignore": true
  },
  "io.github.mortuusars.exposure.gui.screen.camera.CameraAttachmentsScreen": {
    "playerSideOnly": true
  },
  "io.github.mortuusars.exposure.menu.CameraAttachmentsMenu": {
    "ignore": true
  },
  "com.teamabnormals.environmental.client.gui.screens.inventory.SlabfishInventoryScreen": {
    "playerSideOnly": true
  },
  "com.teamabnormals.environmental.common.inventory.SlabfishInventoryMenu": {
    "ignore": true
  },
  "plus.dragons.createenchantmentindustry.content.contraptions.enchanting.enchanter.EnchantingGuideScreen": {
    "ignore": true
  },
  "plus.dragons.createenchantmentindustry.content.contraptions.enchanting.enchanter.EnchantingGuideMenu": {
    "ignore": true
  },
  "com.simibubi.create.content.schematics.cannon.SchematicannonScreen": {
    "ignore": true
  },
  "com.simibubi.create.content.schematics.cannon.SchematicannonMenu": {
    "ignore": true
  },
  "com.simibubi.create.content.schematics.table.SchematicTableScreen": {
    "ignore": true
  },
  "com.simibubi.create.content.schematics.table.SchematicTableMenu": {
    "ignore": true
  },
  "com.simibubi.create.content.equipment.toolbox.ToolboxScreen": {
    "ignore": true
  },
  "com.simibubi.create.content.equipment.toolbox.ToolboxMenu": {
    "ignore": true
  },
  "com.simibubi.create.content.equipment.blueprint.BlueprintScreen": {
    "ignore": true
  },
  "com.simibubi.create.content.equipment.blueprint.BlueprintMenu": {
    "ignore": true
  },
  "com.simibubi.create.content.logistics.filter.AttributeFilterMenu": {
    "ignore": true
  },
  "com.simibubi.create.content.logistics.filter.AttributeFilterScreen": {
    "ignore": true
  },
  "com.simibubi.create.content.logistics.filter.FilterMenu": {
    "ignore": true
  },
  "com.simibubi.create.content.logistics.filter.FilterScreen": {
    "ignore": true
  },
  "com.simibubi.create.content.redstone.link.controller.LinkedControllerMenu": {
    "ignore": true
  },
  "com.simibubi.create.content.redstone.link.controller.LinkedControllerScreen": {
    "ignore": true
  },
  "com.simibubi.create.content.trains.schedule.ScheduleMenu": {
    "ignore": true
  },
  "com.simibubi.create.content.trains.schedule.ScheduleScreen": {
    "ignore": true
  },
  "de.maxhenkel.corpse.gui.DeathHistoryScreen": {
    "ignore": true
  },
  "de.maxhenkel.corpse.gui.CorpseInventoryScreen": {
    "playerSideOnly": true
  },
  "de.maxhenkel.corpse.gui.CorpseInventoryContainer": {
    "ignore": true
  },
  "de.mennomax.astikorcarts.client.gui.screen.inventory.PlowScreen": {
    "playerSideOnly": true
  },
  "de.mennomax.astikorcarts.inventory.container.PlowContainer": {
      "ignore": true
  },
  "com.aetherteam.aether.client.gui.screen.inventory.AltarScreen": {
      "playerSideOnly": true
  },
  "com.aetherteam.aether.inventory.menu.AltarMenu": {
    "ignore": true
  },
  "com.aetherteam.aether.client.gui.screen.inventory.FreezerScreen": {
    "playerSideOnly": true
  },
  "com.aetherteam.aether.inventory.menu.FreezerMenu": {
    "ignore": true
  },
  "com.aetherteam.aether.client.gui.screen.inventory.IncubatorScreen": {
    "playerSideOnly": true
  },
  "com.aetherteam.aether.inventory.menu.IncubatorMenu": {
    "ignore": true
  },
  "com.aetherteam.aether.client.gui.screen.inventory.LoreBookScreen": {
    "ignore": true
  },
  "com.aetherteam.aether.inventory.menu.LoreBookMenu": {
    "ignore": true
  },
  "net.zepalesque.redux.blockentity.HolystoneFurnaceScreen": {
    "playerSideOnly": true
  },
  "net.zepalesque.redux.blockentity.HolystoneFurnaceMenu": {
    "ignore": true
  },
  "twilightforest.client.UncraftingScreen": {
    "playerSideOnly": true
  },
  "twilightforest.inventory.UncraftingMenu": {
    "ignore": true
  },
  "com.hrznstudio.titanium.client.screen.container.BasicAddonScreen": {
    "playerSideOnly": true
  },
  "com.hrznstudio.titanium.container.BasicAddonContainer": {
    "ignore": true
  }
}