{
  "attributes": [
    {
      "attribute": "minecraft:generic.attack_speed",
      "amount": 0.06,
      "operation": 1
    }
  ],
  "built_in_enchantments": [],
  "material": "dungeons_gear:hide",
  "unique": false,
  "rarity": "UNCOMMON"
}