{
  "name": "Bad Omen Effect",
  "icon": "savage_and_ravage:griefer_helmet",
  "category": "patchouli:notable_mods",
  "read_by_default": false,
  "pages": [
    {
      "type": "patchouli:text",
      "text": "You will not get a Bad Omen effect by simply killing Pillagers. You must place an Ominous Banner and burn it with a Flint and Steel in order to get the Bad Omen Effect.$(br2)Also check out this cool Griefer Armor you can build."
    },
    {
      "type": "patchouli:crafting",
      "recipe": "savage_and_ravage:blast_proof_plating",
      "recipe2": "savage_and_ravage:griefer_helmet"
    }
  ]
}