{
  "type": "minecraft:chest",
  "pools": [
    {
      "bonus_rolls": 0.0,
      "entries": [
        {
          "type": "minecraft:loot_table",
          "name": "twilightforest:structures/useless",
          "weight": 25
        },
        {
          "type": "minecraft:item",
          "functions": [
            {
              "add": false,
              "count": {
                "type": "minecraft:uniform",
                "max": 4.0,
                "min": 1.0
              },
              "function": "minecraft:set_count"
            }
          ],
          "name": "minecraft:iron_ingot",
          "weight": 75
        },
        {
          "type": "minecraft:item",
          "functions": [
            {
              "add": false,
              "count": {
                "type": "minecraft:uniform",
                "max": 4.0,
                "min": 1.0
              },
              "function": "minecraft:set_count"
            }
          ],
          "name": "minecraft:gunpowder",
          "weight": 75
        },
        {
          "type": "minecraft:item",
          "functions": [
            {
              "add": false,
              "count": {
                "type": "minecraft:uniform",
                "max": 4.0,
                "min": 1.0
              },
              "function": "minecraft:set_count"
            }
          ],
          "name": "twilightforest:ironwood_ingot",
          "weight": 75
        },
        {
          "type": "minecraft:item",
          "functions": [
            {
              "add": false,
              "count": {
                "type": "minecraft:uniform",
                "max": 5.0,
                "min": 1.0
              },
              "function": "minecraft:set_count"
            }
          ],
          "name": "twilightforest:firefly",
          "weight": 75
        },
        {
          "type": "minecraft:item",
          "functions": [
            {
              "add": false,
              "count": {
                "type": "minecraft:uniform",
                "max": 12.0,
                "min": 1.0
              },
              "function": "minecraft:set_count"
            }
          ],
          "name": "twilightforest:experiment_115",
          "weight": 75
        },
        {
          "type": "minecraft:item",
          "functions": [
            {
              "add": false,
              "count": {
                "type": "minecraft:uniform",
                "max": 12.0,
                "min": 1.0
              },
              "function": "minecraft:set_count"
            }
          ],
          "name": "minecraft:glowstone_dust",
          "weight": 75
        },
        {
          "type": "minecraft:item",
          "functions": [
            {
              "add": false,
              "count": {
                "type": "minecraft:uniform",
                "max": 6.0,
                "min": 1.0
              },
              "function": "minecraft:set_count"
            }
          ],
          "name": "minecraft:redstone",
          "weight": 75
        }
      ],
      "rolls": 4.0
    },
    {
      "bonus_rolls": 0.0,
      "entries": [
        {
          "type": "minecraft:item",
          "functions": [
            {
              "add": false,
              "count": {
                "type": "minecraft:uniform",
                "max": 6.0,
                "min": 1.0
              },
              "function": "minecraft:set_count"
            }
          ],
          "name": "twilightforest:steeleaf_ingot"
        },
        {
          "type": "minecraft:item",
          "name": "twilightforest:charm_of_keeping_1"
        },
        {
          "type": "minecraft:item",
          "name": "twilightforest:steeleaf_helmet"
        },
        {
          "type": "minecraft:item",
          "name": "twilightforest:steeleaf_chestplate"
        },
        {
          "type": "minecraft:item",
          "name": "twilightforest:steeleaf_leggings"
        },
        {
          "type": "minecraft:item",
          "name": "twilightforest:steeleaf_boots"
        },
        {
          "type": "minecraft:item",
          "name": "twilightforest:ironwood_chestplate"
        }
      ],
      "rolls": 2.0
    },
    {
      "bonus_rolls": 0.0,
      "entries": [
        {
          "type": "minecraft:item",
          "name": "twilightforest:charm_of_life_1"
        },
        {
          "type": "minecraft:item",
          "functions": [
            {
              "enchantments": {
                "minecraft:feather_falling": 3
              },
              "function": "twilightforest:enchant"
            }
          ],
          "name": "minecraft:enchanted_book"
        },
        {
          "type": "minecraft:item",
          "functions": [
            {
              "enchantments": {
                "minecraft:knockback": 2
              },
              "function": "twilightforest:enchant"
            }
          ],
          "name": "minecraft:enchanted_book"
        },
        {
          "type": "minecraft:item",
          "functions": [
            {
              "enchantments": {
                "minecraft:efficiency": 3
              },
              "function": "twilightforest:enchant"
            }
          ],
          "name": "minecraft:enchanted_book"
        }
      ],
      "rolls": 1.0
    },
    {
      "bonus_rolls": 0.0,
      "entries": [
        {
          "type": "minecraft:item",
          "name": "twilightforest:tower_key"
        }
      ],
      "rolls": 1.0
    }
  ]
}