{
  "type": "guardvillagers:slot",
  "pools": [
    {
      "rolls": 1,
      "entries": [
        {
          "type": "minecraft:item",
          "name": "dungeons_gear:sword"
        },
        {
          "type": "minecraft:item",
          "name": "minecraft:crossbow"
        }
      ]
    }
  ]
}