{
  "replace": true,
  "key": "blaze_rod",
  "hidden": true,
  "hiddenOutcomes": true,
  "primary": 1,
  "secondary": 4,
  "tertiary": 2,
  "durability": 104,
  "integrityCost": 1,
  "integrityGain": 6,
  "magicCapacity": 108,
  "toolLevel": 0,
  "toolEfficiency": 0,
  "effects": {
    "fierySelf": [ 3, 0.1 ]
  },
  "tints": {
    "glyph": "blaze_rod_glyph",
    "texture": "blaze_rod"
  },
  "textures": [
    "metal",
    "default"
  ],
  "material": {
    "items": [ "minecraft:blaze_rod" ]
  },
  "requiredTools": {
    "hammer_dig": "minecraft:wood"
  }
}
