{
  "type": "minecraft:crafting_shaped",
  "pattern": [
    " # ",
    " # ",
    " / "
  ],
  "key": {
    "#": {
      "item": "${MATERIAL_ID}"
    },
    "/": {
      "tag": "forge:rods/wooden"
    }
  },
  "result": {
    "item": "tetra:modular_sword",
    "nbt": {
      "sword/blade": "sword/basic_blade",
      "sword/basic_blade_material": "basic_blade/${MATERIAL}",
      "sword/hilt": "sword/basic_hilt",
      "sword/basic_hilt_material": "basic_hilt/stick"
    }
  }
}