{
  "attributes": [
    {
      "attribute": "minecraft:generic.attack_damage",
      "amount": 8,
      "operation": 0
    },
    {
      "attribute": "minecraft:generic.attack_speed",
      "amount": -3.1,
      "operation": 0
    }
  ],
  "material": "dungeons_gear:generic",
  "built_in_enchantments": [{"enchantment": "dungeons_gear:shockwave", "level": 1}],
  "unique": true,
  "rarity": "RARE",
  "combo": 2
}