{
  "type": "minecraft:crafting_shaped",
  "pattern": [
    "## ",
    "#/ ",
    " / "
  ],
  "key": {
    "#": {
      "item": "${MATERIAL_ID}"
    },
    "/": {
      "tag": "forge:rods/wooden"
    }
  },
  "result": {
    "item": "tetra:modular_double",
    "nbt": {
      "double/head_right": "double/butt_right",
      "double/butt_right_material": "butt/${MATERIAL}",
      "double/head_left": "double/basic_axe_left",
      "double/basic_axe_left_material": "basic_axe/${MATERIAL}",
      "double/handle": "double/basic_handle",
      "double/basic_handle_material": "basic_handle/stick"
    }
  }
}