{
  "type": "minecraft:crafting_shaped",
  "pattern": [
    "###",
    " / ",
    " / "
  ],
  "key": {
    "#": {
      "item": "${MATERIAL_ID}"
    },
    "/": {
      "tag": "forge:rods/wooden"
    }
  },
  "result": {
    "item": "tetra:modular_double",
    "nbt": {
      "double/head_right": "double/basic_pickaxe_right",
      "double/basic_pickaxe_right_material": "basic_pickaxe/${MATERIAL}",
      "double/head_left": "double/basic_pickaxe_left",
      "double/basic_pickaxe_left_material": "basic_pickaxe/${MATERIAL}",
      "double/handle": "double/basic_handle",
      "double/basic_handle_material": "basic_handle/stick"
    }
  }
}