{
  "replace": true,
  "key": "fiery",
  "category": "metal",
  "primary": 8,
  "secondary": 5,
  "tertiary": 0,
  "durability": 2048,
  "integrityCost": 1,
  "integrityGain": 6,
  "magicCapacity": 90,
  "toolLevel": "minecraft:netherite",
  "toolEfficiency": 7,
  "tints": {
    "glyph": "ffa800",
    "texture": "ffa800"
  },
  "textures": [
    "metal",
    "default"
  ],
  "material": {
    "items": [ "twilightforest:fiery_ingot" ]
  },
  "improvements": {
    "safpatch.fireaspect": 1
  },
  "requiredTools": {
    "hammer_dig": "minecraft:wood"
  }
}
