{
  "name": "Target Dummy",
  "icon": "dummmmmmy:target_dummy",
  "category": "patchouli:notable_mods",
  "read_by_default": false,
  "pages": [
    {
      "type": "patchouli:text",
      "text": "Everyone's favorite Target Dummy is back! Craft this sucker and see how much damage your custom Tetra weapons do."
    },
    {
      "type": "patchouli:crafting",
      "recipe": "dummmmmmy:dummy_crafting"
    }
  ]
}