{
  "attributes": [
    {
      "attribute": "minecraft:generic.attack_damage",
      "amount": 3,
      "operation": 0
    },
    {
      "attribute": "minecraft:generic.attack_speed",
      "amount": -1.6,
      "operation": 0
    }
  ],
  "material": "dungeons_gear:generic",
  "built_in_enchantments": [{"enchantment": "dungeons_gear:rushdown", "level": 1}, {"enchantment": "dungeons_gear:freezing", "level": 1}],
  "unique": true,
  "rarity": "RARE",
  "combo": 3
}