{
  "attributes": [
    {
      "attribute": "minecraft:generic.attack_damage",
      "amount": 6,
      "operation": 0
    },
    {
      "attribute": "minecraft:generic.attack_speed",
      "amount": -2.6,
      "operation": 0
    }
  ],
  "material": "dungeons_gear:generic",
  "built_in_enchantments": [{"enchantment": "dungeons_gear:chains", "level": 1}],
  "unique": false,
  "rarity": "UNCOMMON",
  "disables_shield": true,
  "combo": 3
}