{
  "replace": true,
  "key": "socket_pristine_diamond",
  "hidden": true,
  "category": "socket",
  "primary": 0,
  "secondary": 0,
  "tertiary": 0,
  "durability": 512,
  "integrityCost": 1,
  "integrityGain": 0,
  "magicCapacity": 0,
  "toolLevel": 0,
  "toolEfficiency": 4,
  "attributes": {
    "**generic.attack_damage": 0.2
  },
  "tints": {
    "glyph": "diamond_glyph",
    "texture": "diamond"
  },
  "textures": ["pristine"],
  "experienceCost": 4,
  "material": {
    "items": [ "tetra:pristine_diamond" ]
  }
}
