{
  "attributes": [
    {
      "attribute": "minecraft:generic.attack_damage",
      "amount": 6,
      "operation": 0
    },
    {
      "attribute": "minecraft:generic.attack_speed",
      "amount": -2.7,
      "operation": 0
    },
    {
      "attribute": "dungeons_libraries:soul_gathering",
      "amount": 1,
      "operation": 0
    }
  ],
  "material": "dungeons_gear:generic",
  "built_in_enchantments": [],
  "unique": false,
  "rarity": "UNCOMMON",
  "combo": 2
}