{
  "attributes": [
    {
      "attribute": "minecraft:generic.attack_damage",
      "amount": 4,
      "operation": 0
    },
    {
      "attribute": "minecraft:generic.attack_speed",
      "amount": -2.0,
      "operation": 0
    }
  ],
  "material": "dungeons_gear:generic",
  "built_in_enchantments": [],
  "light": true,
  "unique": false,
  "rarity": "UNCOMMON",
  "combo": 6
}