{
	"required": true,
	"package": "com.cuddles.safpatch.mixin",
	"compatibilityLevel": "JAVA_17",
	"refmap": "safpatch.refmap.json",
	"mixins": [
		"MendingEnchantmentMixin",
		"EnchantmentMixin"
	],
	"client": [
	],
	"minVersion": "0.8"
}