initial: 0 0 88 20 
removing topmost v at <0,6>: 0 5 88 15 
removing leftmost z at <5,0>: 6 5 82 15 
removing rightmost $ at <88,11>: 6 5 79 15 
removing bottommost ^ at <45,20>: 6 5 79 12 
removing unused < at <6,5>: 6 5 79 12 
adding @ at <4,3>: 4 3 81 14 
adding % at <100,100>: 4 3 96 97 
adding space at <121,121>: 4 3 96 97 
removing % at <100,100>: 4 3 81 14 
adding * at <-2^32,-2^32>: -2147483648 -2147483648 2147483733 2147483665 
adding * at <2^32-1,2^32-1>: -2147483648 -2147483648 4294967295 4294967295 

