{
    "title": "TYPO3 Schema-org",
    "subtitle": "This extension is very easy to use. Simply install and include the delivered static template.",
    "logo": "../ext_icon.svg",
    "markdown": "../Readme.en.md",
    "meta": {
        "description": "TYPO3 Schema-org - This extension is very easy to use. Simply install and include the delivered static template.",
        "abstract": "Adds Schema.org information into your site.",
        "keywords": "TYPO3, extension, Schema, Schema.org, structured data",
        "og:title": "TYPO3 Schema-org",
        "og:description": "TYPO3 Schema-org - This extension is very easy to use. Simply install and include the delivered static template."
    },
    "features": [
        "Easy to use",
        "Simply install and link in the provided static template",
        "Configure schema data in Setup-TypoScript",
        "Add social media profiles",
        "Configure different opening hours on different days",
        "Insert video schema data for YouTube, Vimeo, etc"
    ],
    "links": {
        "product": {
            "link": "https://www.coding.ms/typo3-extensions/typo3-schemaorg",
            "name": "TYPO3 Schema.org Productdetails"
        },
        "schemaOrg": {
            "link": "http://schema.org/",
            "name": "Full documentation of Schema-Data"
        },
        "validation1": {
            "link": "https://search.google.com/structured-data/testing-tool",
            "name": "Google Testing-Tool"
        },
        "validation2": {
            "link": "https://search.google.com/test/rich-results",
            "name": "Google Rich Testing-Tool"
        },
        "structuredData": {
            "link": "https://developers.google.com/search/docs/guides/intro-structured-data",
            "name": "Google Structured-Data"
        }
    },
    "pages": [
        {
            "title": "Configuration",
            "pages": [
                {
                    "title": "Configuring the TYPO3 Schema-org Plugin for TYPO3",
                    "markdown": "Configuration/Configuration.en.md",
                    "meta": {
                        "description": "TYPO3 Schema-org - Configuration and setup of the extension.",
                        "abstract": "Configuration and setup of the extension",
                        "keywords": "TYPO3, extension, Configuration, setup",
                        "og:title": "TYPO3 Schema-org - Configuration and setup",
                        "og:description": "Configuration and setup of the extension."
                    }
                },
                {
                    "title": "Adding social media profiles",
                    "markdown": "Configuration/AddSocialMediaProfiles.en.md",
                    "meta": {
                        "description": "TYPO3 Schema-org - addition of social media profiles with the Schema-org extension for TYPO3.",
                        "abstract": "Add social media profiles",
                        "keywords": "TYPO3, extension, social media",
                        "og:title": "TYPO3 Schema-org - Add social media profiles",
                        "og:description": "Addition of social media profiles with the Schema-org extension for TYPO3."
                    }
                },
                {
                    "title": "Different opening hours on different days",
                    "markdown": "Configuration/DifferentOpeningHours.en.md",
                    "meta": {
                        "description": "TYPO3 Schema-org - Configuration of different opening hours on different days.",
                        "abstract": "Configuration of opening hours in the extension",
                        "keywords": "TYPO3, extension, configuration, opening hours",
                        "og:title": "TYPO3 Schema-org - Configuration of different opening hours on different days",
                        "og:description": "Configuration of opening hours in the extension."
                    }
                },
                {
                    "title": "Insert video schema data for YouTube, Vimeo, or other",
                    "markdown": "Configuration/VideoSchemaData.en.md",
                    "meta": {
                        "description": "TYPO3 Schema-org - Inserting video schema data for YouTube, Vimeo, or other.",
                        "abstract": "Inserting video schema data with the extension",
                        "keywords": "TYPO3, extension, video",
                        "og:title": "TYPO3 Schema-org - Insert video schema data for YouTube, Vimeo, or other",
                        "og:description": "Inserting video schema data for YouTube, Vimeo, or other."
                    }
                }
            ]
        }
    ]}
