{
    "title": "TYPO3 RSS-App",
    "subtitle": "Mit diesem Plugin kannst Du RSS-App-Feeds in TYPO3 anzeigen. Die RSS-App bietet viele verschiedene RSS-Feeds von Plattformen.",
    "logo": "../Resources/Public/Icons/Extension.svg",
    "markdown": "../Readme.de.md",
    "attention": "Diese TYPO3 Extension basiert auf RSS.app, der Nr. 1 Source zur Generierung von RSS-Feeds. Sie kann von fast jeder Website sowie Social Media Dienst einen RSS Feed erstellen.",
    "meta": {
        "description": "TYPO3 RSS-App - Mit diesem Plugin kannst Du RSS-App-Feeds in TYPO3 anzeigen.",
        "abstract": "Dieses Plugin ermöglicht die Anzeige von RSS.App-Feeds (Instagram, Twitter, Facebook und mehr) in TYPO3 - mehr Informationen auf https://rss.app",
        "keywords": "TYPO3, extension, RSS, Instagram, Twitter, Facebook, Youtube, Pinterest",
        "og:title": "TYPO3 RSS-App",
        "og:description": "TYPO3 RSS-App - Mit diesem Plugin kannst Du RSS-App-Feeds in TYPO3 anzeigen."
    },
    "features": [
        "Verwende die RSS-App-Erweiterung, um RSS-Feeds von von vielen verschiedenen Plattformen in TYPO3 anzuzeigen.",
        "Plattformen: Instagram, Twitter, Google News, Reddit, Facebook, YouTube, Telegram, Pinterest, eBay, Tumblr, imgur, Giphy, Unsplash, Scoop.it, NYTimes, CNN, USA Today, BBC, NPR, Washington Post, Vogue, ELLE, Harper's BAZAAR, Vanity Fair, Allure, WWD, Wired, MIT Technology Review, Glamour, InStyle, GQ, Entrepreneur, Fast Company, Fortune",
        "Erstelle RSS Feeds und überwache sie mit Deinem bevorzugtem RSS-Reader",
        "Importiere in einen beliebigen RSS-Reader oder exportiere alle Deine Feeds via OPML",
        "Die meisten Websites und sozialen Netzwerke werden unterstützt",
        "Auch die Kombination verschiedener Feeds ist möglich",
        "Die Darstellung erfolgt als Bild oder Carousel"
    ],
    "links": {
        "product": {
            "link": "https://www.coding.ms/de/typo3-extensions/typo3-rss-app/",
            "name": "TYPO3 RSS-App Produktdetails"
        },
        "documentation": {
            "link": "https://www.coding.ms/de/dokumentation/typo3-rss-app",
            "name": "TYPO3 RSS-App Dokumentation"
        },
        "website": {
            "link": "https://rss.app/",
            "name": "RSS.app Website"
        }
    },
    "pages": [
        {
            "title": "Configuration",
            "originalTitle": "Configuration",
            "pages": [
                {
                    "title": "Installation",
                    "originalTitle": "Installation",
                    "markdown": "Configuration/Installation.de.md",
                    "meta": {
                        "description": "TYPO3 RSS-App - Installation",
                        "abstract": "Installation und Einrichtung der TYPO3 RSS-App Extension",
                        "keywords": "TYPO3, Extension, Installation",
                        "og:title": "TYPO3 RSS-App",
                        "og:description": "Installation und Einrichtung der TYPO3 RSS-App Extension"
                    }
                },
                {
                    "title": "TypoScript-Konstanten Einstellungen",
                    "originalTitle": "TypoScript constants settings",
                    "markdown": "Configuration/Constants.de.md",
                    "meta": {
                        "description": "TypoScript-Konstanten zur Konfiguration der TYPO3 RSS-App",
                        "abstract": "Wie du die TYPO3 RSS-App mit TypoScript-Konstanten konfigurierst",
                        "keywords": "TYPO3, extension, TYPO3 RSS-App, Konfiguration, TypoScript, Konstanten",
                        "og:title": "TYPO3 RSS-App - TypoScript-Konstanten",
                        "og:description": "TypoScript-Konstanten zur Konfiguration der TYPO3 RSS-App"
                    }
                }
            ]
        }
    ]
}
