<?xml version="1.0" encoding="UTF-8" standalone="no"?>
<svg
   xmlns:dc="http://purl.org/dc/elements/1.1/"
   xmlns:cc="http://creativecommons.org/ns#"
   xmlns:rdf="http://www.w3.org/1999/02/22-rdf-syntax-ns#"
   xmlns:svg="http://www.w3.org/2000/svg"
   xmlns="http://www.w3.org/2000/svg"
   xmlns:sodipodi="http://sodipodi.sourceforge.net/DTD/sodipodi-0.dtd"
   xmlns:inkscape="http://www.inkscape.org/namespaces/inkscape"
   width="16"
   height="16"
   viewBox="0 0 16 16"
   version="1.1"
   id="svg4"
   sodipodi:docname="ext_icon.svg"
   inkscape:version="0.92.3 (2405546, 2018-03-11)">
  <metadata
     id="metadata10">
    <rdf:RDF>
      <cc:Work
         rdf:about="">
        <dc:format>image/svg+xml</dc:format>
        <dc:type
           rdf:resource="http://purl.org/dc/dcmitype/StillImage" />
        <dc:title></dc:title>
      </cc:Work>
    </rdf:RDF>
  </metadata>
  <defs
     id="defs8" />
  <sodipodi:namedview
     pagecolor="#ffffff"
     bordercolor="#666666"
     borderopacity="1"
     objecttolerance="10"
     gridtolerance="10"
     guidetolerance="10"
     inkscape:pageopacity="0"
     inkscape:pageshadow="2"
     inkscape:window-width="1002"
     inkscape:window-height="733"
     id="namedview6"
     showgrid="false"
     inkscape:zoom="9.8333333"
     inkscape:cx="12"
     inkscape:cy="12"
     inkscape:window-x="2610"
     inkscape:window-y="243"
     inkscape:window-maximized="0"
     inkscape:current-layer="svg4" />
  <path
     d="M 8,1.333333 C 11.676,1.333333 14.666667,4.324 14.666667,8 14.666667,11.676 11.676,14.666667 8,14.666667 4.324,14.666667 1.3333333,11.676 1.3333333,8 1.3333333,4.324 4.324,1.333333 8,1.333333 Z M 8,0 C 3.582,0 0,3.582 0,8 c 0,4.418 3.582,8 8,8 4.418,0 8,-3.582 8,-8 C 16,3.582 12.418,0 8,0 Z m 0.8333333,11.333333 c 0,0.46 -0.3726666,0.833334 -0.8333333,0.833334 -0.4593333,0 -0.8333333,-0.373334 -0.8333333,-0.833334 0,-0.46 0.374,-0.833333 0.8333333,-0.833333 0.4606667,0 0.8333333,0.373333 0.8333333,0.833333 z M 9.762,4.668 C 9.3566667,4.257333 8.752,4.031333 8.0613333,4.031333 6.608,4.031333 5.668,5.064667 5.668,6.664667 h 1.3406667 c 0,-0.990667 0.5526666,-1.342 1.0253333,-1.342 0.4226667,0 0.8713333,0.280666 0.9093333,0.817333 C 8.9846663,6.704667 8.6833333,6.991333 8.302,7.354 7.3606667,8.249333 7.3433333,8.682667 7.3473333,9.666 H 8.684 C 8.6753333,9.223333 8.704,8.864 9.3073333,8.214 9.7586667,7.727333 10.32,7.122 10.331333,6.199333 10.338667,5.583333 10.142,5.053333 9.762,4.668 Z"
     id="path2"
     inkscape:connector-curvature="0"
     style="stroke-width:0.66666669" />
</svg>
