{
    "title": "TYPO3 Portfolio",
    "subtitle": "This extension provides categorized portfolios and reference for a website.",
    "logo": "../Resources/Public/Icons/Extension.svg",
    "markdown": "../Readme.en.md",
    "meta": {
        "description": "TYPO3 Portfolio - This extension provides categorized portfolios for a website.",
        "abstract": "Portfolios TYPO3-Extension for displaying portfolios and references",
        "keywords": "TYPO3, extension, Portfolio, References",
        "og:title": "TYPO3 Portfolio",
        "og:description": "TYPO3 Portfolio - This extension provides categorized portfolios for a website."
    },
    "features": [
        "Displaying of portfolios/references/working examples",
        "Categories, tags ans tag-categories available",
        "Optimized for better search engine ranking",
        "Displaying of related portfolios/references",
        "Flexible list and detail view",
        "Teaser views possible",
        "Adding of many images and downloads in portfolio/reference possible",
        "Back and forward buttons in detail view, for a quick navigation to the next portfolio/references",
        "Radial search for finding portfolios/references close to the user"
    ],
    "links": {
        "product": {
            "link": "https://www.coding.ms/typo3-extensions/typo3-portfolios/",
            "name": "TYPO3 Portfolios Productdetails"
        },
        "documentation": {
            "link": "https://www.coding.ms/documentation/typo3-portfolios",
            "name": "TYPO3 Portfolios Documentation"
        },
        "drewes": {
            "link": "https://www.drewes-speth.de/tragwerke",
            "name": "Demo: Drewes+Speth"
        },
        "codingms": {
            "link": "https://www.coding.ms/de/portfolio",
            "name": "Demo: coding.ms"
        },
        "gebotherm": {
            "link": "https://www.gebotherm.com/unternehmen/referenzen/",
            "name": "Demo: Gebo-Therm"
        }
    },
    "pages": [
        {
            "title": "Configuration",
            "pages": [
                {
                    "title": "Human-readable URLs",
                    "markdown": "Configuration/HumanReadableUrls.en.md",
                    "meta": {
                        "description": "TYPO3 Portfolio - Setup and slug configuration using a code sample for human-readable URLs.",
                        "abstract": "setup of human-readable URLs",
                        "keywords": "TYPO3, extension, human-readable, URL, setup, configuration",
                        "og:title": "TYPO3 Portfolio - Human-readable URLs",
                        "og:description": "Setup and slug configuration using a code sample for human-readable URLs."
                    }
                },
                {
                    "title": "Sitemap XML",
                    "markdown": "Configuration/SitemapXml.en.md",
                    "meta": {
                        "description": "TYPO3 Portfolio - Configuration using a code example to generate a sitemap for the portfolio.",
                        "abstract": "Setting up a sitemap",
                        "keywords": "TYPO3, extension, setup, configuration, sitemap",
                        "og:title": "TYPO3 Portfolio - Sitemap XML",
                        "og:description": "Configuration using a code example to generate a sitemap for the portfolio."
                    }
                },
                {
                    "title": "TypoScript constants settings",
                    "markdown": "Configuration/Constants.en.md",
                    "meta": {
                        "description": "TypoScript constants for configuring the TYPO3 Portfolio",
                        "abstract": "How you can configure the TYPO3 Portfolio with TypoScript constants",
                        "keywords": "TYPO3, extension, TYPO3 Portfolio, Configuration, TypoScript, Constants",
                        "og:title": "TYPO3 Portfolio - TypoScript constants",
                        "og:description": "TypoScript constants for configuring the TYPO3 Portfolio"
                    }
                }
            ]
        },
        {
            "title": "HowTo",
            "pages": [
                {
                    "title": "Breadcrumb Menu",
                    "markdown": "HowTo/BreadcrumbMenu.en.md",
                    "meta": {
                        "description": "TYPO3 Portfolio - How to add an additional item to the breadcrumb menu on the glossary detail pages.",
                        "abstract": "Add item to breadcrumb menu",
                        "keywords": "TYPO3, extension, breadcrumb, menu, add",
                        "og:title": "TYPO3 Portfolio - Sitemap XML",
                        "og:description": "How to add an additional item to the breadcrumb menu on the glossary detail pages."
                    }
                }
            ]
        }
    ]
}
