<?xml version="1.0" encoding="UTF-8" standalone="no"?>
<svg width="16" height="16" viewBox="0 0 16 16" version="1.1" id="svg4" xmlns="http://www.w3.org/2000/svg"
     xmlns:svg="http://www.w3.org/2000/svg">
    <g fill="currentColor">
        <path d="M 7.392,5.7087736 C 7.433334,5.5467699 7.458666,5.4247672 7.482,5.3054311 L 6.7486666,5.1627612 6.676,5.4961021 c -0.2473334,-0.036668 -0.5113334,-0.040668 -0.7773334,-0.014 0.006,-0.1786708 0.016667,-0.3540081 0.032667,-0.5226786 h 0.819333 V 4.2647408 H 6.0293334 c 0.036,-0.1766707 0.066,-0.2826731 0.096,-0.3833421 l -0.716,-0.2146715 c -0.052666,0.1753373 -0.096,0.3473412 -0.1406668,0.5980136 H 4.452 V 4.9594232 H 5.18 C 5.160666,5.1834283 5.149334,5.4161003 5.146,5.6514389 4.3413334,5.946779 4,6.5101251 4,7.0201367 4,7.6228174 4.476,8.1534954 5.228,8.0854939 6.162,8.0001619 6.786,7.2948099 7.1513334,6.4274562 c 0.378,0.218005 0.5366666,0.5840133 0.394,0.923355 C 7.414,7.6648183 7.0253334,7.9634911 6.284,7.9481578 V 8.6955077 C 7.1066666,8.708175 7.916,8.3955009 8.234,7.6401508 8.5433336,6.902134 8.1893336,6.0954487 7.392,5.7087736 Z M 6.428,6.2194515 c -0.1166666,0.2580059 -0.27,0.5146787 -0.4653334,0.7166833 -0.03,-0.2153379 -0.050667,-0.4506773 -0.061333,-0.702683 0.178,-0.023331 0.358,-0.027331 0.5266664,-0.014 z M 5.1653334,6.460791 c 0.02,0.3153401 0.056,0.6060137 0.1053332,0.8653526 -0.6653332,0.1220028 -0.692,-0.5340121 -0.1053332,-0.8653526 z m -3.832,0.1073354 c 0,1.2486954 0.566,1.9620446 1.122,2.6287267 0.020666,0.6666811 0.056666,1.1120249 -0.222,2.1220479 C 3.3986666,10.946893 3.592,10.800223 4.2386666,10.40288 c 0.6666668,0.16267 0.9826668,0.254006 1.7406668,0.327341 -0.062666,0.472011 -0.054,0.850019 0.036666,1.348698 -0.5013334,-0.04 -1.0186667,-0.11867 -1.5533334,-0.24934 C 3.5313327,12.400926 1.4753327,12.979605 0.02999936,13.239611 0.57066666,12.176254 1.1686666,10.716221 1.1373334,9.6981975 0.41,8.8281777 0,7.7081523 0,6.5681264 0,3.3507201 3.146,1 6.6666666,1 10.158,1 13.318,3.3227194 13.332,6.5454589 12.902666,6.4287903 12.450666,6.3607887 11.984666,6.3361212 11.832,4.1094039 9.5093336,2.3333636 6.6666666,2.3333636 3.726,2.3333636 1.3333334,4.2334067 1.3333334,6.5681264 Z M 11.771334,10.187542 12.254666,11.57024 H 11.291334 Z M 16,11.298234 c 0,-2.105381 -2.059334,-3.6447499 -4.364,-3.6447499 -2.2906664,0 -4.364,1.5287017 -4.364,3.6447499 0,1.866709 1.7553336,3.628082 4.332,3.628082 0.466,0 0.96,-0.058 1.475334,-0.182671 0.609332,0.374009 1.955332,0.751351 2.901332,0.923355 C 15.627334,14.970317 15.236,14.014295 15.255334,13.347613 15.731334,12.778934 16,12.044918 16,11.298234 Z m -3.234,1.702038 -0.304,-0.846686 h -1.374666 l -0.300668,0.846686 H 10 l 1.399334,-3.6667498 h 0.734 l 1.394,3.6667498 z"/>
    </g>
</svg>
