{
    "title": "TYPO3 Parsedown Extra (Markdown)",
    "subtitle": "Rendert Markdown mit Hilfe der Parsedown-Extra Bibliothek in TYPO3.",
    "logo": "../ext_icon.svg",
    "markdown": "../Readme.de.md",
    "features": [
        "Parst E-Mailadressen Links mit der TYPO3 encryption",
        "Inhaltselement zur Auswahl von Markdown-Dateien, welche geparst im Frontend ausgegeben werden",
        "ViewHelper zum parsen von Markdown aus beliebigen Quellen",
        "Global definiertes Abkürzungs-Verzeichnis aus TypoScript",
        "SourceCode Syntax-Highlighting mit PrismJS",
        "Syntax-Highlighting für TypoScript"
    ],
    "links": {
        "product": {
            "link": "https://www.coding.ms/typo3-extensions/typo3-parsedown-extra/",
            "name": "TYPO3 Parsedown-Extra Productdetails"
        },
        "documentation": {
            "link": "https://www.coding.ms/de/dokumentation/typo3-parsedown-extra",
            "name": "TYPO3 Parsedown-Extra Dokumentation"
        },
        "markdown": {
            "link": "https://daringfireball.net/projects/markdown/syntax",
            "name": "Markdown Syntax"
        },
        "parsedown": {
            "link": "http://parsedown.org/",
            "name": "Parsedown Webseite"
        },
        "parsedown-extra": {
            "link": "https://michelf.ca/projects/php-markdown/extra/",
            "name": "Parsedown-Extra Webseite"
        }
    },
    "meta": {
        "description": "TYPO3 Parsedown Extra (Markdown) - Rendert Markdown mit Hilfe der Parsedown-Extra Bibliothek in TYPO3.",
        "abstract": "Parsedown Extra - Markdown",
        "keywords": "TYPO3, extension, Markdown",
        "og:title": "TYPO3 Parsedown Extra (Markdown)",
        "og:description": "TYPO3 Parsedown Extra (Markdown) - Rendert Markdown mit Hilfe der Parsedown-Extra Bibliothek in TYPO3."
    },
    "pages": [
        {
            "title": "Konfiguration",
            "originalTitle": "Configuration",
            "pages": [
                {
                    "title": "TypoScript-Konstanten Einstellungen",
                    "originalTitle": "TypoScript constants settings",
                    "markdown": "Configuration/Constants.de.md",
                    "meta": {
                        "description": "TypoScript-Konstanten zur Konfiguration der TYPO3 Parsedown Extra",
                        "abstract": "Wie du die TYPO3 Parsedown Extra mit TypoScript-Konstanten konfigurierst",
                        "keywords": "TYPO3, extension, TYPO3 Parsedown Extra, Konfiguration, TypoScript, Konstanten",
                        "og:title": "TYPO3 Parsedown Extra - TypoScript-Konstanten",
                        "og:description": "TypoScript-Konstanten zur Konfiguration der TYPO3 Parsedown Extra"
                    }
                }
            ]
        },
        {
            "title": "Verwendung",
            "originalTitle": "Usage",
            "pages": [
                {
                    "title": "Abkürzungen",
                    "originalTitle": "Abbreviations",
                    "markdown": "Usage/Abbreviations.de.md",
                    "meta": {
                        "description": "TYPO3 Parsedown Extra (Markdown) - Abkürzungen für Markdown für TYPO3 definieren.",
                        "abstract": "Parsedown Extra - Markdown",
                        "keywords": "TYPO3, extension, Markdown",
                        "og:title": "TYPO3 Parsedown Extra (Markdown)",
                        "og:description": "TYPO3 Parsedown Extra (Markdown) - Abkürzungen für Markdown für TYPO3 definieren."
                    }
                },
                {
                    "title": "Block-Zitate",
                    "originalTitle": "Blockquotes",
                    "markdown": "Usage/Blockquotes.de.md",
                    "meta": {
                        "description": "TYPO3 Parsedown Extra (Markdown) - Anzeigen von Warnungen, Notizen, Information mit Hilfe von Block Zitaten.",
                        "abstract": "Parsedown Extra - Markdown",
                        "keywords": "TYPO3, extension, Markdown",
                        "og:title": "TYPO3 Parsedown Extra (Markdown)",
                        "og:description": "TYPO3 Parsedown Extra (Markdown) - Anzeigen von Warnungen, Notizen, Information mit Hilfe von Block Zitaten."
                    }
                },
                {
                    "title": "HTML-Rendering",
                    "originalTitle": "HTML rendering",
                    "markdown": "Usage/Htmlrendering.de.md",
                    "meta": {
                        "description": "TYPO3 Parsedown Extra (Markdown) - Definition von CSS-Klassen für HTML Table-Tags.",
                        "abstract": "Parsedown Extra - Markdown",
                        "keywords": "TYPO3, extension, Markdown",
                        "og:title": "TYPO3 Parsedown Extra (Markdown)",
                        "og:description": "TYPO3 Parsedown Extra (Markdown) - Definition von CSS-Klassen für HTML Table-Tags."
                    }
                },
                {
                    "title": "Bilder",
                    "originalTitle": "Images",
                    "markdown": "Usage/Images.de.md",
                    "meta": {
                        "description": "TYPO3 Parsedown Extra (Markdown) - Verwendung von Bild-Definition als Referenz.",
                        "abstract": "Parsedown Extra - Markdown",
                        "keywords": "TYPO3, extension, Markdown",
                        "og:title": "TYPO3 Parsedown Extra (Markdown)",
                        "og:description": "TYPO3 Parsedown Extra (Markdown) - Verwendung von Bild-Definition als Referenz."
                    }
                },
                {
                    "title": "Links",
                    "originalTitle": "Links",
                    "markdown": "Usage/Links.de.md",
                    "meta": {
                        "description": "TYPO3 Parsedown Extra (Markdown) - Verwendung von Link-Definition als Referenz.",
                        "abstract": "Parsedown Extra - Markdown",
                        "keywords": "TYPO3, extension, Markdown",
                        "og:title": "TYPO3 Parsedown Extra (Markdown)",
                        "og:description": "TYPO3 Parsedown Extra (Markdown) - Verwendung von Link-Definition als Referenz."
                    }
                },
                {
                    "title": "Vorschläge",
                    "originalTitle": "Suggestions",
                    "markdown": "Usage/Suggestions.de.md",
                    "meta": {
                        "description": "TYPO3 Parsedown Extra (Markdown) - Anregungen für eine nachhaltige Dokumentation.",
                        "abstract": "Parsedown Extra - Markdown",
                        "keywords": "TYPO3, extension, Markdown",
                        "og:title": "TYPO3 Parsedown Extra (Markdown)",
                        "og:description": "TYPO3 Parsedown Extra (Markdown) - Anregungen für eine nachhaltige Dokumentation."
                    }
                },
                {
                    "title": "Styleguide",
                    "originalTitle": "Styleguide",
                    "markdown": "Usage/Styleguide.de.md",
                    "meta": {
                        "description": "TYPO3 Parsedown Extra (Markdown) - Die wichtigsten Komponenten mit dem Styleguide hervorheben.",
                        "abstract": "Parsedown Extra - Markdown",
                        "keywords": "TYPO3, extension, Markdown",
                        "og:title": "TYPO3 Parsedown Extra (Markdown)",
                        "og:description": "TYPO3 Parsedown Extra (Markdown) - Die wichtigsten Komponenten mit dem Styleguide hervorheben."
                    }
                }
            ]
        }
    ]
}
