<?xml version="1.0" encoding="UTF-8" standalone="no"?>
<svg
   width="24"
   height="24"
   viewBox="0 0 24 24"
   data-ev="3.1.1"
   version="1.1"
   id="svg6"
   xmlns="http://www.w3.org/2000/svg"
   xmlns:svg="http://www.w3.org/2000/svg">
    <g
            style="fill:#8DD02E;fill-opacity:1"
            id="g6"
            fill-rule="evenodd"
            fill="none">
        <path
                style="fill:#8DD02E;fill-opacity:1"
                id="path8"
                fill="#6DAAE0"
                d="M0 0h64v64H0z" />
    </g>
  <g
     fill="currentColor"
     id="g4"
     transform="matrix(0.83333333,0,0,0.83333333,2,2)"
     style="fill:#ffffff">
    <path
       d="M 6,6 H 0 V 0 H 6 Z M 24,0 H 8 V 24 H 24 Z M 6,9 H 0 v 6 h 6 z m 0,9 H 0 v 6 h 6 z"
       id="path2"
       style="fill:#ffffff" />
  </g>
</svg>
