<?xml version="1.0" encoding="UTF-8" standalone="no"?>
<svg
   xmlns:dc="http://purl.org/dc/elements/1.1/"
   xmlns:cc="http://creativecommons.org/ns#"
   xmlns:rdf="http://www.w3.org/1999/02/22-rdf-syntax-ns#"
   xmlns:svg="http://www.w3.org/2000/svg"
   xmlns="http://www.w3.org/2000/svg"
   xmlns:sodipodi="http://sodipodi.sourceforge.net/DTD/sodipodi-0.dtd"
   xmlns:inkscape="http://www.inkscape.org/namespaces/inkscape"
   width="24"
   height="24"
   viewBox="0 0 24 24"
   id="svg2"
   version="1.1"
   inkscape:version="0.48.4 r9939"
   sodipodi:docname="glossary.svg">
  <metadata
     id="metadata10">
    <rdf:RDF>
      <cc:Work
         rdf:about="">
        <dc:format>image/svg+xml</dc:format>
        <dc:type
           rdf:resource="http://purl.org/dc/dcmitype/StillImage" />
        <dc:title></dc:title>
      </cc:Work>
    </rdf:RDF>
  </metadata>
  <defs
     id="defs8" />
  <sodipodi:namedview
     pagecolor="#ffffff"
     bordercolor="#666666"
     borderopacity="1"
     objecttolerance="10"
     gridtolerance="10"
     guidetolerance="10"
     inkscape:pageopacity="0"
     inkscape:pageshadow="2"
     inkscape:window-width="1363"
     inkscape:window-height="1001"
     id="namedview6"
     showgrid="false"
     inkscape:zoom="9.8333333"
     inkscape:cx="11.440678"
     inkscape:cy="20.135593"
     inkscape:window-x="323"
     inkscape:window-y="59"
     inkscape:window-maximized="0"
     inkscape:current-layer="layer3" />
  <path
     d="M 5.495,2 22,2 22,0 5,0 C 3.344,0 2,1.343 2,3 l 0,18 c 0,1.657 1.344,3 3,3 L 22,24 22,4 5.495,4 C 4.119,4 4.119,2 5.495,2 z M 6,6 20,6 20,22 6,22 z"
     id="path4"
     inkscape:connector-curvature="0"
     sodipodi:nodetypes="sccssssccssccccc" />
  <g
     inkscape:groupmode="layer"
     id="layer2"
     inkscape:label="Ebene#1"
     style="display:inline">
    <text
       xml:space="preserve"
       style="font-size:53.87257767px;font-style:normal;font-weight:normal;line-height:125%;letter-spacing:0px;word-spacing:0px;fill:#000000;fill-opacity:1;stroke:none;font-family:Sans"
       x="8.2397833"
       y="17.676355"
       id="text3015"
       sodipodi:linespacing="125%"><tspan
         sodipodi:role="line"
         id="tspan3017"
         x="8.2397833"
         y="17.676355"
         style="font-size:13.46814442px;font-style:normal;font-variant:normal;font-weight:normal;font-stretch:normal;font-family:Droid Sans;-inkscape-font-specification:Droid Sans">G</tspan></text>
  </g>
  <g
     inkscape:groupmode="layer"
     id="layer3"
     inkscape:label="Kette"
     style="display:inline">
    <path
       style="display:inline;stroke:#ffffff;stroke-opacity:1;opacity:1"
       inkscape:connector-curvature="0"
       d="m 16.147359,22.760125 -1.2977,-2.26e-4 c -0.832477,-2.09e-4 -1.50602,-0.673799 -1.50599,-1.506096 -3.46e-4,-0.402307 0.1566,-0.780342 0.440992,-1.064714 0.284393,-0.284373 0.662438,-0.441291 1.064745,-0.441278 l 1.749262,2.41e-4 c 0.846677,3.1e-5 1.50566,0.692495 1.505811,1.505918 -6e-6,0.162864 -0.02931,0.320514 -0.07875,0.470254 l -0.572541,-2e-4 c 0.07784,-0.142548 0.123867,-0.303613 0.123693,-0.470252 1.8e-5,-0.52059 -0.434989,-0.97792 -0.97751,-0.977938 l -5.4e-4,1.79e-4 -1.749441,-4.22e-4 c -0.539105,-1.98e-4 -0.9781,0.438765 -0.977938,0.97787 -1.9e-5,0.545398 0.443977,0.978998 0.978229,0.978298 l 0.871665,2.1e-4 c 0.127442,0.229561 0.261723,0.38218 0.426016,0.528156 z m 3.070258,-3.012159 -1.285297,3.14e-4 c 0.161241,0.143276 0.297495,0.297516 0.42602,0.527792 l 0.859621,7.49e-4 c 0.539285,-7e-4 0.977888,0.438653 0.97805,0.977759 -1.99e-4,0.545576 -0.444586,0.978787 -0.978299,0.978229 l -1.736858,-6.1e-5 -9.08e-4,-1.91e-4 c -0.516806,-1.88e-4 -0.977521,-0.419589 -0.977322,-0.978108 1.86e-4,-0.170235 0.04621,-0.328424 0.123513,-0.467197 l -0.02732,-0.0029 -0.545038,-3.78e-4 c -0.04962,0.150277 -0.07911,0.307389 -0.07911,0.470253 -2.9e-5,0.807131 0.652482,1.506067 1.505991,1.506098 l 1.737038,2.41e-4 c 0.832297,-3.3e-4 1.506068,-0.673335 1.505737,-1.505991 7.48e-4,-0.833735 -0.674772,-1.506427 -1.505811,-1.506637 z"
       id="path2989"
       inkscape:transform-center-y="-1.5063775" />
  </g>
  <g
     inkscape:groupmode="layer"
     id="layer4"
     inkscape:label="Kette vorne"
     style="display:inline">
    <path
       style="stroke:none;display:inline"
       inkscape:connector-curvature="0"
       d="m 16.096858,22.760174 -1.2977,-2.26e-4 c -0.832477,-2.09e-4 -1.50602,-0.673799 -1.50599,-1.506096 -3.46e-4,-0.402307 0.1566,-0.780342 0.440992,-1.064714 0.284393,-0.284373 0.662438,-0.441291 1.064745,-0.441278 l 1.749262,2.41e-4 c 0.846677,3.1e-5 1.50566,0.692495 1.505811,1.505918 -6e-6,0.162864 -0.02931,0.320514 -0.07875,0.470254 l -0.572541,-2e-4 c 0.07784,-0.142548 0.123867,-0.303613 0.123693,-0.470252 1.8e-5,-0.52059 -0.434989,-0.97792 -0.97751,-0.977938 l -5.4e-4,1.79e-4 -1.749441,-4.22e-4 c -0.539105,-1.98e-4 -0.9781,0.438765 -0.977938,0.97787 -1.9e-5,0.545398 0.443977,0.978998 0.978229,0.978298 l 0.871665,2.1e-4 c 0.127442,0.229561 0.261723,0.38218 0.426016,0.528156 z m 3.070258,-3.012159 -1.285297,3.14e-4 c 0.161241,0.143276 0.297495,0.297516 0.42602,0.527792 l 0.859621,7.49e-4 c 0.539285,-7e-4 0.977888,0.438653 0.97805,0.977759 -1.99e-4,0.545576 -0.444586,0.978787 -0.978299,0.978229 l -1.736858,-6.1e-5 -9.08e-4,-1.91e-4 c -0.516806,-1.88e-4 -0.977521,-0.419589 -0.977322,-0.978108 1.86e-4,-0.170235 0.04621,-0.328424 0.123513,-0.467197 l -0.02732,-0.0029 -0.545038,-3.78e-4 c -0.04962,0.150277 -0.07911,0.307389 -0.07911,0.470253 -2.9e-5,0.807131 0.652482,1.506067 1.505991,1.506098 l 1.737038,2.41e-4 c 0.832297,-3.3e-4 1.506068,-0.673335 1.505737,-1.505991 7.48e-4,-0.833735 -0.674772,-1.506427 -1.505811,-1.506637 z"
       id="path2989-0"
       inkscape:transform-center-y="-1.5063775" />
  </g>
</svg>
