<?xml version="1.0" encoding="UTF-8" standalone="no"?>
<svg
   xmlns:dc="http://purl.org/dc/elements/1.1/"
   xmlns:cc="http://creativecommons.org/ns#"
   xmlns:rdf="http://www.w3.org/1999/02/22-rdf-syntax-ns#"
   xmlns:svg="http://www.w3.org/2000/svg"
   xmlns="http://www.w3.org/2000/svg"
   xmlns:sodipodi="http://sodipodi.sourceforge.net/DTD/sodipodi-0.dtd"
   xmlns:inkscape="http://www.inkscape.org/namespaces/inkscape"
   width="24"
   height="24"
   viewBox="0 0 24 24"
   id="svg2"
   version="1.1"
   inkscape:version="0.48.4 r9939"
   sodipodi:docname="glossarycategory.svg">
  <metadata
     id="metadata10">
    <rdf:RDF>
      <cc:Work
         rdf:about="">
        <dc:format>image/svg+xml</dc:format>
        <dc:type
           rdf:resource="http://purl.org/dc/dcmitype/StillImage" />
        <dc:title></dc:title>
      </cc:Work>
    </rdf:RDF>
  </metadata>
  <defs
     id="defs8" />
  <sodipodi:namedview
     pagecolor="#ffffff"
     bordercolor="#666666"
     borderopacity="1"
     objecttolerance="10"
     gridtolerance="10"
     guidetolerance="10"
     inkscape:pageopacity="0"
     inkscape:pageshadow="2"
     inkscape:window-width="1363"
     inkscape:window-height="1001"
     id="namedview6"
     showgrid="false"
     inkscape:zoom="9.8333333"
     inkscape:cx="11.440678"
     inkscape:cy="20.135593"
     inkscape:window-x="323"
     inkscape:window-y="59"
     inkscape:window-maximized="0"
     inkscape:current-layer="layer2" />
  <path
     d="M 5.495,2 22,2 22,0 5,0 C 3.344,0 2,1.343 2,3 l 0,18 c 0,1.657 1.344,3 3,3 L 22,24 22,4 5.495,4 C 4.119,4 4.119,2 5.495,2 z M 6,6 20,6 20,22 6,22 z"
     id="path4"
     inkscape:connector-curvature="0"
     sodipodi:nodetypes="sccssssccssccccc" />
  <g
     inkscape:groupmode="layer"
     id="layer2"
     inkscape:label="Ebene#1"
     style="display:inline">
    <text
       xml:space="preserve"
       style="font-size:53.87257767px;font-style:normal;font-weight:normal;line-height:125%;letter-spacing:0px;word-spacing:0px;fill:#000000;fill-opacity:1;stroke:none;font-family:Sans"
       x="8.2397833"
       y="17.676355"
       id="text3015"
       sodipodi:linespacing="125%"><tspan
         sodipodi:role="line"
         id="tspan3017"
         x="8.2397833"
         y="17.676355"
         style="font-size:13.46814442px;font-style:normal;font-variant:normal;font-weight:normal;font-stretch:normal;font-family:Droid Sans;-inkscape-font-specification:Droid Sans">G</tspan></text>
  </g>
  <g
     inkscape:groupmode="layer"
     id="layer3"
     inkscape:label="Kette"
     style="display:none">
    <path
       style="display:inline"
       inkscape:connector-curvature="0"
       d="m 11.878684,5.5560934 -0.91774,0.917485 c -0.588777,0.588523 -1.541344,0.588523 -2.129867,0 -0.284728,-0.28422 -0.441075,-0.662502 -0.441075,-1.06468 0,-0.402178 0.156347,-0.780459 0.44082,-1.064934 l 1.237042,-1.236788 c 0.598692,-0.598691 1.55431,-0.575049 2.129614,0 0.115162,0.115163 0.205919,0.247358 0.276847,0.388197 l -0.404975,0.40472 C 12.02359,3.7442564 11.942239,3.5978244 11.824281,3.4801204 11.456168,3.1120074 10.82519,3.0962454 10.44157,3.4798664 l -2.55e-4,5.08e-4 -1.237296,1.236787 c -0.381332,0.381078 -0.381332,1.001888 0,1.382965 0.385655,0.385655 1.006209,0.378282 1.383474,0 l 0.616487,-0.616233 c 0.252442,0.0722 0.455311,0.08516 0.674704,0.0722 z m 0.04093,-4.30092 -0.908588,0.909096 c 0.215326,-0.01271 0.420737,0 0.67445,0.07194 l 0.608352,-0.607336 c 0.380824,-0.38184 1.001632,-0.381332 1.382965,-2.54e-4 0.385654,0.385908 0.377773,1.006463 0,1.383474 l -1.228144,1.228144 -7.77e-4,5.08e-4 c -0.365557,0.365317 -0.987892,0.394552 -1.382698,-5.08e-4 -0.120247,-0.120501 -0.199564,-0.264899 -0.243036,-0.417686 l -0.02135,0.01729 -0.385654,0.385146 c 0.07118,0.141346 0.16143,0.273288 0.276593,0.38845 0.570727,0.570728 1.526346,0.603522 2.129868,0 l 1.228399,-1.228144 c 0.588268,-0.588777 0.588777,-1.541091 -2.55e-4,-2.129613 -0.589031,-0.59004801 -1.542361,-0.58801501 -2.130122,-5.09e-4 z"
       id="path2989" />
  </g>
</svg>
