%!PS-Adobe-3.0 EPSF
%%Creator: Adobe Illustrator exported by sK1
%%BoundingBox: 42 42 346 127
%%HiResBoundingBox: 42.7988 42.1172 345.852 126.291
%AI5_FileFormat 3
%%EndComments
%%BeginProlog
%%EndProlog
%%BeginSetup
%%EndSetup
1 XR
%AI5_BeginLayer
1 1 1 1 0 0 -1 49 80 161 Lb
(New Layer) Ln
u
u
0.620000 0.580000 0.435000 0.996000 k
*u
330.909 42.1172 m
326.578 42.1172 320.129 43.4379 319.322 43.627 C
319.322 50.0711 L
321.451 49.6332 326.931 48.723 330.825 48.723 C
335.326 48.723 338.253 52.5449 338.253 59.3621 C
338.253 67.4012 336.935 71.6484 330.652 71.6484 C
323.396 71.6484 L
323.396 78.1113 L
329.759 78.1113 L
336.935 78.1113 337.273 85.4512 337.273 88.984 C
337.273 95.9742 335.071 98.807 330.652 98.807 C
326.763 98.807 322.329 97.834 319.773 97.3012 C
319.773 103.755 L
320.74 103.935 325.967 105.262 330.47 105.262 C
339.575 105.262 344.802 101.37 344.802 88.1871 C
344.802 82.1719 342.67 76.8762 337.982 75.1848 C
343.38 74.8301 345.852 68.907 345.852 60.2422 C
345.852 47.0621 340.726 42.1172 330.909 42.1172 C
F
290.231 98.807 m
282.278 98.807 279.62 93.4066 279.62 73.9492 C
279.62 54.943 282.278 48.566 290.231 48.566 C
298.185 48.566 300.842 54.943 300.842 73.9492 C
300.842 93.4066 298.185 98.807 290.231 98.807 C
F
290.231 42.1172 m
275.644 42.1172 271.75 52.7281 271.75 74.3887 C
271.75 95.1777 275.644 105.262 290.231 105.262 C
304.818 105.262 308.709 95.1777 308.709 74.3887 C
308.709 52.7281 304.818 42.1172 290.231 42.1172 C
F
246.182 98.8902 m
241.322 98.8902 237.872 98.359 237.872 98.359 C
237.872 72.5438 L
246.182 72.5438 L
251.138 72.5438 254.591 75.8113 254.591 85.4512 C
254.591 94.298 252.459 98.8902 246.182 98.8902 C
F
245.301 66.0801 m
237.872 66.0801 L
237.872 42.7301 L
230.174 42.7301 L
230.174 104.637 L
230.174 104.637 237.787 105.262 245.13 105.262 C
258.567 105.262 262.461 96.9457 262.461 86.0664 C
262.461 72.627 257.857 66.0801 245.301 66.0801 C
F
205.333 71.4773 m
205.333 42.7301 L
197.367 42.7301 L
197.367 71.4773 L
181.542 104.637 L
190.027 104.637 L
201.695 79.6172 L
213.371 104.637 L
221.424 104.637 L
205.333 71.4773 L
f
164.054 97.9172 m
164.054 42.7301 L
156.363 42.7301 L
156.363 97.9172 L
142.741 97.9172 L
142.741 104.637 L
177.675 104.637 L
177.675 97.9172 L
164.054 97.9172 L
F
*U
0.004000 0.561000 0.969000 0.008000 k
105.67 68.2844 m
104.423 67.916 103.428 67.7781 102.123 67.7781 C
91.432 67.7781 75.7344 105.137 75.7344 117.571 C
75.7344 122.148 76.8176 123.676 78.3477 124.986 C
65.2633 123.459 49.5637 118.657 44.5434 112.553 C
43.4578 111.024 42.7988 108.627 42.7988 105.572 C
42.7988 86.1621 63.5168 42.1172 78.1309 42.1172 C
84.893 42.1172 96.2926 53.2309 105.67 68.2844 C
F
0.004000 0.561000 0.969000 0.008000 k
98.8469 126.291 m
112.367 126.291 125.896 124.111 125.896 116.479 C
125.896 100.996 116.077 82.2324 111.064 82.2324 C
102.123 82.2324 90.9988 107.099 90.9988 119.533 C
90.9988 125.203 93.1793 126.291 98.8469 126.291 C
F
U
U
LB
%AI5_EndLayer--
%AI5_BeginLayer
1 1 1 1 0 0 -1 49 80 161 Lb
(MasterLayer 1) Ln
LB
%AI5_EndLayer--
%%Trailer
%%EOF
