{
    "title": "TYPO3 Ace-Editor",
    "subtitle": "Diese Erweiterung integriert den ACE-Editor in das TYPO3-Backend.",
    "logo": "../ext_icon.svg",
    "markdown": "../Readme.de.md",
    "features": [
        "Komfortable Bearbeitung von Source-Dateien innerhalb der Filelist",
        "Eigenes Backendmodul zur besseren Übersichtlichkeit",
        "Umfangreiche Editing-Features wie z.B. Syntax-Highlighting"
    ],
    "meta": {
        "description": "TYPO3 Ace-Editor - Diese Erweiterung integriert den ACE-Editor in das TYPO3-Backend.",
        "abstract": "ACE editor for file list",
        "keywords": "TYPO3, extension, Editor",
        "og:title": "TYPO3 Ace-Editor",
        "og:description": "TYPO3 Ace-Editor - Diese Erweiterung integriert den ACE-Editor in das TYPO3-Backend."
    },
    "links": {
        "product": {
            "link": "https://www.coding.ms/de/typo3-extensions/typo3-ace-editor/",
            "name": "TYPO3 Ace-Editor Produktdetails"
        },
        "documentation": {
            "link": "https://www.coding.ms/de/dokumentation/typo3-ace-editor",
            "name": "TYPO3 Ace-Editor Dokumentation"
        },
        "download": {
            "link": "https://extensions.typo3.org/extension/ace_editor/",
            "name": "TYPO3 Extension Ace Editor Download"
        },
        "website": {
            "link": "https://ace.c9.io/",
            "name": "Ace Editor Website"
        }
    },
    "pages": [
        {
            "title": "Ace-Editor für TYPO3",
            "originalTitle": "Ace-Editor for TYPO3",
            "markdown": "General.de.md",
            "meta": {
                "description": "TYPO3 Ace-Editor - Die ACE-Editor-Erweiterung ersetzt den standardmäßigen TYPO3-Quellcode-Editor in Fileadmin und ermöglicht Ihnen eine einfachere Bearbeitung Ihrer Dateien.",
                "abstract": "ACE editor for file list",
                "keywords": "TYPO3, extension, Editor",
                "og:title": "TYPO3 Ace-Editor",
                "og:description": "TYPO3 Ace-Editor - Die ACE-Editor-Erweiterung ersetzt den standardmäßigen TYPO3-Quellcode-Editor in Fileadmin und ermöglicht Ihnen eine einfachere Bearbeitung Ihrer Dateien."
            }
        }
    ]
}
