{
  "properties": [
    {
      "name": "dummyRest.fixedDelay",
      "type": "java.lang.Long",
      "description": "Fixed delay for calling rest"
    },
    {
      "name": "dummyRest.uri",
      "type": "java.lang.String",
      "description": "Rest address to call."
    }
  ]
}