{
  "log" : {
    "version" : "1.2",
    "pages" : [ ],
    "entries" : [ {
      "startedDateTime" : "2023-08-03T03:44:14.415Z",
      "request" : {
        "method" : "PATCH",
        "url" : "https://restful-booker.herokuapp.com/booking/3",
        "httpVersion" : "",
        "cookies" : [ ],
        "headers" : [ {
          "name" : "Content-Type",
          "value" : "application/json"
        }, {
          "name" : "Accept",
          "value" : "application/json"
        }, {
          "name" : "Cookie",
          "value" : "token=<token_value>"
        }, {
          "name" : "Authorization",
          "value" : "Basic YWRtaW46cGFzc3dvcmQxMjM="
        } ],
        "queryString" : [ ],
        "postData" : {
          "mimeType" : "application/json",
          "text" : "{\n    \"firstname\" : \"Rizky\",\n    \"lastname\" : \"Bond\"\n}",
          "comment" : ""
        },
        "headersSize" : 0,
        "bodySize" : 0,
        "comment" : ""
      },
      "response" : {
        "status" : 200,
        "statusText" : "",
        "httpVersion" : "",
        "cookies" : [ ],
        "headers" : [ {
          "name" : "Server",
          "value" : "Cowboy"
        }, {
          "name" : "Etag",
          "value" : "W/\"a9-DiDuHqxyxjAQHAQs/ogMPCgj6xY\""
        }, {
          "name" : "Connection",
          "value" : "keep-alive"
        }, {
          "name" : "#status#",
          "value" : "HTTP/1.1 200 OK"
        }, {
          "name" : "Content-Length",
          "value" : "169"
        }, {
          "name" : "Date",
          "value" : "Thu, 03 Aug 2023 03:44:15 GMT"
        }, {
          "name" : "X-Powered-By",
          "value" : "Express"
        }, {
          "name" : "Content-Type",
          "value" : "application/json; charset=utf-8"
        }, {
          "name" : "Via",
          "value" : "1.1 vegur"
        } ],
        "content" : {
          "size" : 169,
          "mimeType" : "application/json; charset=utf-8",
          "text" : "{\"firstname\":\"Rizky\",\"lastname\":\"Bond\",\"totalprice\":111,\"depositpaid\":true,\"bookingdates\":{\"checkin\":\"2018-01-01\",\"checkout\":\"2019-01-01\"},\"additionalneeds\":\"Breakfast\"}",
          "comment" : ""
        },
        "redirectURL" : "",
        "headersSize" : 194,
        "bodySize" : 169,
        "comment" : ""
      },
      "cache" : { },
      "timings" : {
        "comment" : "",
        "ssl" : -1,
        "connect" : 0,
        "blocked" : -1,
        "dns" : -1,
        "send" : 0,
        "wait" : 0,
        "receive" : 0
      },
      "comment" : "",
      "_katalonRequestInformation" : {
        "name" : "7",
        "testObjectId" : "Object Repository/Booking/PartialUpdateBooking",
        "harId" : "a324680d-22e2-4513-9aac-ddc4f25c615b",
        "reportFolder" : null
      },
      "time" : 0
    } ],
    "comment" : ""
  }
}