{
    "global_config": {
        "db_type": "mysql",
        "useAI": {
            "enabled": false,
            "model": "gpt-4o-mini",
            "apiKey": "${CHATGPT_APIKEY}"
        },
        "database": {
            "host": "localhost",
            "user": "quizz_user",
            "password": "${QUIZ_DB_PASS}",
            "database": "quizz", 
            "port": 3306
        },
        "template": "python",
        "out_folder": "C:\\DevCodigo\\python\\quizz\\quizz4",
        "skip_these_tables": [],
        "only_these_tables": [],
        "packageBaseName": "quizz4"
    },
    "processors": [
        { "name": "django_model" },
        { "name": "django_controller" },
        { "name": "django_import_models" },
        { "name": "django_controller_path" },
        { "name": "postman", "extra_config": { "with_base_api": true } }
    ]
}