{
    "global_config": {
        "db_type": "mysql",
        "useAI": {
            "enabled": false,
            "model": "gpt-4o-mini",
            "apiKey": "${CHATGPT_APIKEY}"
        },
        "database": {
            "host": "localhost",
            "user": "quiz_user",
            "password": "${QUIZ_DB_PASS}",
            "database": "quiz", 
            "port": 3306
        },
        "template": "php",
        "packageBaseName": "MyApp",
        "out_folder": "./out",
        "skip_these_tables": [],
        "only_these_tables": [ "lessons" ]
    },
    "processors": [
        { "name": "pdo_dao", "generate": true, "parameter_prefix": "_" },
        { "name": "model", "generate": true, "parameter_prefix": "_" }
    ]
}