%YAML 1.1
%TAG !u! tag:unity3d.com,2011:
--- !u!162 &1
EditorUserSettings:
  m_ObjectHideFlags: 0
  serializedVersion: 4
  m_ConfigSettings:
    GraphicsSettingsInspector_UserSettings:
      value: 18134705175a055722080a3115371d4a0d55006876786860616b0471b8b9656dacb72ba5a52a362c3c0ee63201181433fe3e101bf3250b06144ca74c24f1190708e016c213c61a52f91c12cac80fd8edd298e1e4d1fde2cacddeacbcc1fee7eef0e3b6faa69af9ceaeaaec81a6d2c2c8c8c4b2e5dfd5ccd3f8cf
      flags: 0
    RecentlyUsedSceneGuid-0:
      value: 5309525257535a035e56082147250e44404e4c282d297167787d4566e0b43260
      flags: 0
    RecentlyUsedSceneGuid-1:
      value: 54520d5e5c515c0c5b0b097b43770d1315161a7e7d2b2060797a4460e0e1623c
      flags: 0
    RecentlyUsedSceneGuid-2:
      value: 0155515007010a0b0c0f582347770c13124f4d797e2a27697e2f1b61b7b53568
      flags: 0
    RecentlyUsedSceneGuid-3:
      value: 5106565207535a085a0b5a7a16775d4445154b2f2a7172327d7a1c31e7b2356c
      flags: 0
    RecentlyUsedSceneGuid-4:
      value: 5706060207045e0a0f5b597747770d15424f482c757e7432287b4865e3e53168
      flags: 0
    RecentlyUsedSceneGuid-5:
      value: 520305075650580b09585f7416775a4710151a2f282c74657f2f1f63e3e1653b
      flags: 0
    RecentlyUsedSceneGuid-6:
      value: 01060c075d5359035859547315740b441716497e7d2975637e284537b1e3376e
      flags: 0
    RecentlyUsedSceneGuid-7:
      value: 0754035e5454585d545e5f7345775e494e164e7b7b2a71687b2d4e65e3b36768
      flags: 0
    RecentlyUsedSceneGuid-8:
      value: 00080756500d0d0355580a7049770a44454e19732f7b7f3575794566b2b6376a
      flags: 0
    RecentlyUsedSceneGuid-9:
      value: 5b520d0503545b0d0c0c0a2715770748154f4d2c7d7d7e627a7d4a35b4e1646a
      flags: 0
    UnityEditor.ShaderGraph.Blackboard:
      value: 18135939215a0a5004000b0e15254b524c030a3f2964643d120d1230e9e93a3fd6e826abbd2e2d293c4ead313b08042de6030a0afa240c0d020be94c4bac5e435d8715fa32c70d15d11612dacc11fee5d3c5d1fe9ab1b7968e93e2ffcbc3e7e2f0b3ffe0e8b0be9afbf6adffff8e85dd8390e3949c8899daa7
      flags: 0
    UnityEditor.ShaderGraph.FloatingWindowsLayout2:
      value: 181344140043005e1a220d3b1f364b524c0c5a27130c293326201334cee5322ca0bd30e8eb293a707b0fd0180b3d0a36fc0d3d04e649500d1002ee0b5dbd1d2c27c00ad113cb1e10e41f1addc80993b98d9884a69ae6d8f0d1cda9e8fbfefaf9f9dea3fdb9ade882f0f7b0e1e380cafbf2c3adc18e9cd285a2908b82ec869c8395949c9483d68a8e97ddbd90bf
      flags: 0
    UnityEditor.ShaderGraph.InspectorWindow:
      value: 18135939215a0a5004000b0e15254b524c1119263f2d6a722016393ce1eb3d36e5d339f9a5602b2e2c07a37e0901373ae01e0008f707250d171df81a53a5405d41895ac825e0100ec20313c0d91cddccd3d0c7efcca9bd88908fecb0f9cfddf1eff4e7a1b1eae482f0fcaee1e1928b86d888ed9798978797a7cf
      flags: 0
    UnityEditor.ShaderGraph.ToggleSettings:
      value: 18135d1527590858060c032302276919051e1a26296a7c243f3c187fa0e92708f0e220e0e22d09352a0bed30017c5b2be01f0c47b40219221f1ded0b12eb1f0127cc0bcc18c41a5e911f1dc2de189da1d6d9d8e5cadbf5d7c8d6a4f7e6b2b4baa9dfaaf5aff6bedd
      flags: 0
    lightmappingBakingProfile:
      value: 51
      flags: 0
    vcSharedLogLevel:
      value: 0d5e400f0650
      flags: 0
  m_VCAutomaticAdd: 1
  m_VCDebugCom: 0
  m_VCDebugCmd: 0
  m_VCDebugOut: 0
  m_SemanticMergeMode: 2
  m_DesiredImportWorkerCount: 3
  m_StandbyImportWorkerCount: 2
  m_IdleImportWorkerShutdownDelay: 60000
  m_VCShowFailedCheckout: 1
  m_VCOverwriteFailedCheckoutAssets: 1
  m_VCProjectOverlayIcons: 1
  m_VCHierarchyOverlayIcons: 1
  m_VCOtherOverlayIcons: 1
  m_VCAllowAsyncUpdate: 1
  m_VCScanLocalPackagesOnConnect: 1
  m_ArtifactGarbageCollection: 1
  m_CompressAssetsOnImport: 1
