%YAML 1.1
%TAG !u! tag:unity3d.com,2011:
--- !u!1001 &3316370969665246566
PrefabInstance:
  m_ObjectHideFlags: 0
  serializedVersion: 2
  m_Modification:
    m_TransformParent: {fileID: 0}
    m_Modifications:
    - target: {fileID: 1101803969641932397, guid: cd9a72b13ecae1a4aa5c1e19277d5811,
        type: 3}
      propertyPath: m_Points.m_Paths.Array.data[0].Array.size
      value: 15
      objectReference: {fileID: 0}
    - target: {fileID: 1101803969641932397, guid: cd9a72b13ecae1a4aa5c1e19277d5811,
        type: 3}
      propertyPath: m_Points.m_Paths.Array.data[0].Array.data[0].x
      value: 0.83402634
      objectReference: {fileID: 0}
    - target: {fileID: 1101803969641932397, guid: cd9a72b13ecae1a4aa5c1e19277d5811,
        type: 3}
      propertyPath: m_Points.m_Paths.Array.data[0].Array.data[0].y
      value: 2.0249481
      objectReference: {fileID: 0}
    - target: {fileID: 1101803969641932397, guid: cd9a72b13ecae1a4aa5c1e19277d5811,
        type: 3}
      propertyPath: m_Points.m_Paths.Array.data[0].Array.data[1].x
      value: -2.7254858
      objectReference: {fileID: 0}
    - target: {fileID: 1101803969641932397, guid: cd9a72b13ecae1a4aa5c1e19277d5811,
        type: 3}
      propertyPath: m_Points.m_Paths.Array.data[0].Array.data[1].y
      value: 2.5176938
      objectReference: {fileID: 0}
    - target: {fileID: 1101803969641932397, guid: cd9a72b13ecae1a4aa5c1e19277d5811,
        type: 3}
      propertyPath: m_Points.m_Paths.Array.data[0].Array.data[2].x
      value: -2.7797318
      objectReference: {fileID: 0}
    - target: {fileID: 1101803969641932397, guid: cd9a72b13ecae1a4aa5c1e19277d5811,
        type: 3}
      propertyPath: m_Points.m_Paths.Array.data[0].Array.data[2].y
      value: 2.4726431
      objectReference: {fileID: 0}
    - target: {fileID: 1101803969641932397, guid: cd9a72b13ecae1a4aa5c1e19277d5811,
        type: 3}
      propertyPath: m_Points.m_Paths.Array.data[0].Array.data[3].x
      value: -2.7308617
      objectReference: {fileID: 0}
    - target: {fileID: 1101803969641932397, guid: cd9a72b13ecae1a4aa5c1e19277d5811,
        type: 3}
      propertyPath: m_Points.m_Paths.Array.data[0].Array.data[3].y
      value: 2.4239728
      objectReference: {fileID: 0}
    - target: {fileID: 1101803969641932397, guid: cd9a72b13ecae1a4aa5c1e19277d5811,
        type: 3}
      propertyPath: m_Points.m_Paths.Array.data[0].Array.data[4].x
      value: -1.8984795
      objectReference: {fileID: 0}
    - target: {fileID: 1101803969641932397, guid: cd9a72b13ecae1a4aa5c1e19277d5811,
        type: 3}
      propertyPath: m_Points.m_Paths.Array.data[0].Array.data[4].y
      value: 2.3101423
      objectReference: {fileID: 0}
    - target: {fileID: 1101803969641932397, guid: cd9a72b13ecae1a4aa5c1e19277d5811,
        type: 3}
      propertyPath: m_Points.m_Paths.Array.data[0].Array.data[5].x
      value: -1.8712883
      objectReference: {fileID: 0}
    - target: {fileID: 1101803969641932397, guid: cd9a72b13ecae1a4aa5c1e19277d5811,
        type: 3}
      propertyPath: m_Points.m_Paths.Array.data[0].Array.data[5].y
      value: 2.0660589
      objectReference: {fileID: 0}
    - target: {fileID: 1101803969641932397, guid: cd9a72b13ecae1a4aa5c1e19277d5811,
        type: 3}
      propertyPath: m_Points.m_Paths.Array.data[0].Array.data[6].x
      value: -1.6854172
      objectReference: {fileID: 0}
    - target: {fileID: 1101803969641932397, guid: cd9a72b13ecae1a4aa5c1e19277d5811,
        type: 3}
      propertyPath: m_Points.m_Paths.Array.data[0].Array.data[6].y
      value: 1.7975551
      objectReference: {fileID: 0}
    - target: {fileID: 1101803969641932397, guid: cd9a72b13ecae1a4aa5c1e19277d5811,
        type: 3}
      propertyPath: m_Points.m_Paths.Array.data[0].Array.data[7].x
      value: -1.545217
      objectReference: {fileID: 0}
    - target: {fileID: 1101803969641932397, guid: cd9a72b13ecae1a4aa5c1e19277d5811,
        type: 3}
      propertyPath: m_Points.m_Paths.Array.data[0].Array.data[7].y
      value: 1.5559765
      objectReference: {fileID: 0}
    - target: {fileID: 1101803969641932397, guid: cd9a72b13ecae1a4aa5c1e19277d5811,
        type: 3}
      propertyPath: m_Points.m_Paths.Array.data[0].Array.data[8].x
      value: 0.9307457
      objectReference: {fileID: 0}
    - target: {fileID: 1101803969641932397, guid: cd9a72b13ecae1a4aa5c1e19277d5811,
        type: 3}
      propertyPath: m_Points.m_Paths.Array.data[0].Array.data[8].y
      value: 1.2487421
      objectReference: {fileID: 0}
    - target: {fileID: 1101803969641932397, guid: cd9a72b13ecae1a4aa5c1e19277d5811,
        type: 3}
      propertyPath: m_Points.m_Paths.Array.data[0].Array.data[9].x
      value: 1.1326485
      objectReference: {fileID: 0}
    - target: {fileID: 1101803969641932397, guid: cd9a72b13ecae1a4aa5c1e19277d5811,
        type: 3}
      propertyPath: m_Points.m_Paths.Array.data[0].Array.data[9].y
      value: 1.2635171
      objectReference: {fileID: 0}
    - target: {fileID: 1101803969641932397, guid: cd9a72b13ecae1a4aa5c1e19277d5811,
        type: 3}
      propertyPath: m_Points.m_Paths.Array.data[0].Array.data[10].x
      value: 2.153881
      objectReference: {fileID: 0}
    - target: {fileID: 1101803969641932397, guid: cd9a72b13ecae1a4aa5c1e19277d5811,
        type: 3}
      propertyPath: m_Points.m_Paths.Array.data[0].Array.data[10].y
      value: 1.4883463
      objectReference: {fileID: 0}
    - target: {fileID: 1101803969641932397, guid: cd9a72b13ecae1a4aa5c1e19277d5811,
        type: 3}
      propertyPath: m_Points.m_Paths.Array.data[0].Array.data[11].x
      value: 2.336773
      objectReference: {fileID: 0}
    - target: {fileID: 1101803969641932397, guid: cd9a72b13ecae1a4aa5c1e19277d5811,
        type: 3}
      propertyPath: m_Points.m_Paths.Array.data[0].Array.data[11].y
      value: 1.5650545
      objectReference: {fileID: 0}
    - target: {fileID: 1101803969641932397, guid: cd9a72b13ecae1a4aa5c1e19277d5811,
        type: 3}
      propertyPath: m_Points.m_Paths.Array.data[0].Array.data[12].x
      value: 2.0779572
      objectReference: {fileID: 0}
    - target: {fileID: 1101803969641932397, guid: cd9a72b13ecae1a4aa5c1e19277d5811,
        type: 3}
      propertyPath: m_Points.m_Paths.Array.data[0].Array.data[12].y
      value: 2.1665323
      objectReference: {fileID: 0}
    - target: {fileID: 1101803969641932397, guid: cd9a72b13ecae1a4aa5c1e19277d5811,
        type: 3}
      propertyPath: m_Points.m_Paths.Array.data[0].Array.data[13].x
      value: 2.2098732
      objectReference: {fileID: 0}
    - target: {fileID: 1101803969641932397, guid: cd9a72b13ecae1a4aa5c1e19277d5811,
        type: 3}
      propertyPath: m_Points.m_Paths.Array.data[0].Array.data[13].y
      value: 2.1886919
      objectReference: {fileID: 0}
    - target: {fileID: 1101803969641932397, guid: cd9a72b13ecae1a4aa5c1e19277d5811,
        type: 3}
      propertyPath: m_Points.m_Paths.Array.data[0].Array.data[14].x
      value: 2.1267347
      objectReference: {fileID: 0}
    - target: {fileID: 1101803969641932397, guid: cd9a72b13ecae1a4aa5c1e19277d5811,
        type: 3}
      propertyPath: m_Points.m_Paths.Array.data[0].Array.data[14].y
      value: 2.2634525
      objectReference: {fileID: 0}
    - target: {fileID: 8302815513321324935, guid: cd9a72b13ecae1a4aa5c1e19277d5811,
        type: 3}
      propertyPath: m_Name
      value: brokenBridgeRight Variant
      objectReference: {fileID: 0}
    - target: {fileID: 8302815514663020112, guid: cd9a72b13ecae1a4aa5c1e19277d5811,
        type: 3}
      propertyPath: m_RootOrder
      value: 0
      objectReference: {fileID: 0}
    - target: {fileID: 8302815514663020112, guid: cd9a72b13ecae1a4aa5c1e19277d5811,
        type: 3}
      propertyPath: m_LocalPosition.x
      value: 2.47
      objectReference: {fileID: 0}
    - target: {fileID: 8302815514663020112, guid: cd9a72b13ecae1a4aa5c1e19277d5811,
        type: 3}
      propertyPath: m_LocalPosition.y
      value: -3.329
      objectReference: {fileID: 0}
    - target: {fileID: 8302815514663020112, guid: cd9a72b13ecae1a4aa5c1e19277d5811,
        type: 3}
      propertyPath: m_LocalPosition.z
      value: 0
      objectReference: {fileID: 0}
    - target: {fileID: 8302815514663020112, guid: cd9a72b13ecae1a4aa5c1e19277d5811,
        type: 3}
      propertyPath: m_LocalRotation.w
      value: 1
      objectReference: {fileID: 0}
    - target: {fileID: 8302815514663020112, guid: cd9a72b13ecae1a4aa5c1e19277d5811,
        type: 3}
      propertyPath: m_LocalRotation.x
      value: 0
      objectReference: {fileID: 0}
    - target: {fileID: 8302815514663020112, guid: cd9a72b13ecae1a4aa5c1e19277d5811,
        type: 3}
      propertyPath: m_LocalRotation.y
      value: 0
      objectReference: {fileID: 0}
    - target: {fileID: 8302815514663020112, guid: cd9a72b13ecae1a4aa5c1e19277d5811,
        type: 3}
      propertyPath: m_LocalRotation.z
      value: 0
      objectReference: {fileID: 0}
    - target: {fileID: 8302815514663020112, guid: cd9a72b13ecae1a4aa5c1e19277d5811,
        type: 3}
      propertyPath: m_LocalEulerAnglesHint.x
      value: 0
      objectReference: {fileID: 0}
    - target: {fileID: 8302815514663020112, guid: cd9a72b13ecae1a4aa5c1e19277d5811,
        type: 3}
      propertyPath: m_LocalEulerAnglesHint.y
      value: 0
      objectReference: {fileID: 0}
    - target: {fileID: 8302815514663020112, guid: cd9a72b13ecae1a4aa5c1e19277d5811,
        type: 3}
      propertyPath: m_LocalEulerAnglesHint.z
      value: 0
      objectReference: {fileID: 0}
    - target: {fileID: 8600435011208402676, guid: cd9a72b13ecae1a4aa5c1e19277d5811,
        type: 3}
      propertyPath: m_Layer
      value: 0
      objectReference: {fileID: 0}
    m_RemovedComponents: []
  m_SourcePrefab: {fileID: 100100000, guid: cd9a72b13ecae1a4aa5c1e19277d5811, type: 3}
