%YAML 1.1
%TAG !u! tag:unity3d.com,2011:
--- !u!29 &1
OcclusionCullingSettings:
  m_ObjectHideFlags: 0
  serializedVersion: 2
  m_OcclusionBakeSettings:
    smallestOccluder: 5
    smallestHole: 0.25
    backfaceThreshold: 100
  m_SceneGUID: 00000000000000000000000000000000
  m_OcclusionCullingData: {fileID: 0}
--- !u!104 &2
RenderSettings:
  m_ObjectHideFlags: 0
  serializedVersion: 9
  m_Fog: 0
  m_FogColor: {r: 0.5, g: 0.5, b: 0.5, a: 1}
  m_FogMode: 3
  m_FogDensity: 0.01
  m_LinearFogStart: 0
  m_LinearFogEnd: 300
  m_AmbientSkyColor: {r: 0.212, g: 0.227, b: 0.259, a: 1}
  m_AmbientEquatorColor: {r: 0.114, g: 0.125, b: 0.133, a: 1}
  m_AmbientGroundColor: {r: 0.047, g: 0.043, b: 0.035, a: 1}
  m_AmbientIntensity: 1
  m_AmbientMode: 3
  m_SubtractiveShadowColor: {r: 0.42, g: 0.478, b: 0.627, a: 1}
  m_SkyboxMaterial: {fileID: 0}
  m_HaloStrength: 0.5
  m_FlareStrength: 1
  m_FlareFadeSpeed: 3
  m_HaloTexture: {fileID: 0}
  m_SpotCookie: {fileID: 10001, guid: 0000000000000000e000000000000000, type: 0}
  m_DefaultReflectionMode: 0
  m_DefaultReflectionResolution: 128
  m_ReflectionBounces: 1
  m_ReflectionIntensity: 1
  m_CustomReflection: {fileID: 0}
  m_Sun: {fileID: 0}
  m_IndirectSpecularColor: {r: 0, g: 0, b: 0, a: 1}
  m_UseRadianceAmbientProbe: 0
--- !u!157 &3
LightmapSettings:
  m_ObjectHideFlags: 0
  serializedVersion: 12
  m_GIWorkflowMode: 1
  m_GISettings:
    serializedVersion: 2
    m_BounceScale: 1
    m_IndirectOutputScale: 1
    m_AlbedoBoost: 1
    m_EnvironmentLightingMode: 0
    m_EnableBakedLightmaps: 0
    m_EnableRealtimeLightmaps: 0
  m_LightmapEditorSettings:
    serializedVersion: 12
    m_Resolution: 2
    m_BakeResolution: 40
    m_AtlasSize: 1024
    m_AO: 0
    m_AOMaxDistance: 1
    m_CompAOExponent: 1
    m_CompAOExponentDirect: 0
    m_ExtractAmbientOcclusion: 0
    m_Padding: 2
    m_LightmapParameters: {fileID: 0}
    m_LightmapsBakeMode: 1
    m_TextureCompression: 1
    m_FinalGather: 0
    m_FinalGatherFiltering: 1
    m_FinalGatherRayCount: 256
    m_ReflectionCompression: 2
    m_MixedBakeMode: 2
    m_BakeBackend: 0
    m_PVRSampling: 1
    m_PVRDirectSampleCount: 32
    m_PVRSampleCount: 500
    m_PVRBounces: 2
    m_PVREnvironmentSampleCount: 500
    m_PVREnvironmentReferencePointCount: 2048
    m_PVRFilteringMode: 2
    m_PVRDenoiserTypeDirect: 0
    m_PVRDenoiserTypeIndirect: 0
    m_PVRDenoiserTypeAO: 0
    m_PVRFilterTypeDirect: 0
    m_PVRFilterTypeIndirect: 0
    m_PVRFilterTypeAO: 0
    m_PVREnvironmentMIS: 0
    m_PVRCulling: 1
    m_PVRFilteringGaussRadiusDirect: 1
    m_PVRFilteringGaussRadiusIndirect: 5
    m_PVRFilteringGaussRadiusAO: 2
    m_PVRFilteringAtrousPositionSigmaDirect: 0.5
    m_PVRFilteringAtrousPositionSigmaIndirect: 2
    m_PVRFilteringAtrousPositionSigmaAO: 1
    m_ExportTrainingData: 0
    m_TrainingDataDestination: TrainingData
    m_LightProbeSampleCountMultiplier: 4
  m_LightingDataAsset: {fileID: 0}
  m_LightingSettings: {fileID: 4890085278179872738, guid: bfaa5ce1d8da4164596201dce8c029bd, type: 2}
--- !u!196 &4
NavMeshSettings:
  serializedVersion: 2
  m_ObjectHideFlags: 0
  m_BuildSettings:
    serializedVersion: 2
    agentTypeID: 0
    agentRadius: 0.5
    agentHeight: 2
    agentSlope: 45
    agentClimb: 0.4
    ledgeDropHeight: 0
    maxJumpAcrossDistance: 0
    minRegionArea: 2
    manualCellSize: 0
    cellSize: 0.16666667
    manualTileSize: 0
    tileSize: 256
    accuratePlacement: 0
    maxJobWorkers: 0
    preserveTilesOutsideBounds: 0
    debug:
      m_Flags: 0
  m_NavMeshData: {fileID: 0}
--- !u!1001 &9093761771005885818
PrefabInstance:
  m_ObjectHideFlags: 0
  serializedVersion: 2
  m_Modification:
    m_TransformParent: {fileID: 0}
    m_Modifications:
    - target: {fileID: 2399254019466573693, guid: 7c750a70a80c4a64da2aa5fd1f8e56de, type: 3}
      propertyPath: m_AnchorMax.y
      value: 1
      objectReference: {fileID: 0}
    - target: {fileID: 2399254019578182619, guid: 7c750a70a80c4a64da2aa5fd1f8e56de, type: 3}
      propertyPath: m_AnchorMax.y
      value: 1
      objectReference: {fileID: 0}
    - target: {fileID: 2399254019924398999, guid: 7c750a70a80c4a64da2aa5fd1f8e56de, type: 3}
      propertyPath: m_AnchorMax.y
      value: 1
      objectReference: {fileID: 0}
    - target: {fileID: 2399254019966801379, guid: 7c750a70a80c4a64da2aa5fd1f8e56de, type: 3}
      propertyPath: m_AnchorMax.y
      value: 1
      objectReference: {fileID: 0}
    - target: {fileID: 2399254020054959013, guid: 7c750a70a80c4a64da2aa5fd1f8e56de, type: 3}
      propertyPath: m_AnchorMax.y
      value: 1
      objectReference: {fileID: 0}
    - target: {fileID: 2399254020372173888, guid: 7c750a70a80c4a64da2aa5fd1f8e56de, type: 3}
      propertyPath: m_AnchorMax.y
      value: 1
      objectReference: {fileID: 0}
    - target: {fileID: 2399254020537507305, guid: 7c750a70a80c4a64da2aa5fd1f8e56de, type: 3}
      propertyPath: m_AnchorMax.y
      value: 1
      objectReference: {fileID: 0}
    - target: {fileID: 2399254020676526769, guid: 7c750a70a80c4a64da2aa5fd1f8e56de, type: 3}
      propertyPath: m_AnchorMax.y
      value: 1
      objectReference: {fileID: 0}
    - target: {fileID: 2399254020992514345, guid: 7c750a70a80c4a64da2aa5fd1f8e56de, type: 3}
      propertyPath: m_AnchorMax.y
      value: 1
      objectReference: {fileID: 0}
    - target: {fileID: 4900119350274791136, guid: 7c750a70a80c4a64da2aa5fd1f8e56de, type: 3}
      propertyPath: m_AnchorMax.x
      value: 0
      objectReference: {fileID: 0}
    - target: {fileID: 4900119350274791136, guid: 7c750a70a80c4a64da2aa5fd1f8e56de, type: 3}
      propertyPath: m_AnchorMax.y
      value: 0
      objectReference: {fileID: 0}
    - target: {fileID: 5936318232579410134, guid: 7c750a70a80c4a64da2aa5fd1f8e56de, type: 3}
      propertyPath: m_Enabled
      value: 1
      objectReference: {fileID: 0}
    - target: {fileID: 5936318232579410154, guid: 7c750a70a80c4a64da2aa5fd1f8e56de, type: 3}
      propertyPath: m_IsActive
      value: 1
      objectReference: {fileID: 0}
    - target: {fileID: 5985449662030458429, guid: 7c750a70a80c4a64da2aa5fd1f8e56de, type: 3}
      propertyPath: m_IsActive
      value: 1
      objectReference: {fileID: 0}
    - target: {fileID: 5986158291469684612, guid: 7c750a70a80c4a64da2aa5fd1f8e56de, type: 3}
      propertyPath: m_Enabled
      value: 1
      objectReference: {fileID: 0}
    - target: {fileID: 5986158291469684613, guid: 7c750a70a80c4a64da2aa5fd1f8e56de, type: 3}
      propertyPath: m_IsActive
      value: 0
      objectReference: {fileID: 0}
    - target: {fileID: 5986158291787109404, guid: 7c750a70a80c4a64da2aa5fd1f8e56de, type: 3}
      propertyPath: m_Enabled
      value: 1
      objectReference: {fileID: 0}
    - target: {fileID: 5986158291787109405, guid: 7c750a70a80c4a64da2aa5fd1f8e56de, type: 3}
      propertyPath: m_IsActive
      value: 0
      objectReference: {fileID: 0}
    - target: {fileID: 5986158291924822852, guid: 7c750a70a80c4a64da2aa5fd1f8e56de, type: 3}
      propertyPath: m_Enabled
      value: 1
      objectReference: {fileID: 0}
    - target: {fileID: 5986158291924822853, guid: 7c750a70a80c4a64da2aa5fd1f8e56de, type: 3}
      propertyPath: m_IsActive
      value: 0
      objectReference: {fileID: 0}
    - target: {fileID: 5986158291956720364, guid: 7c750a70a80c4a64da2aa5fd1f8e56de, type: 3}
      propertyPath: m_IsActive
      value: 1
      objectReference: {fileID: 0}
    - target: {fileID: 5986158291956720365, guid: 7c750a70a80c4a64da2aa5fd1f8e56de, type: 3}
      propertyPath: m_Enabled
      value: 1
      objectReference: {fileID: 0}
    - target: {fileID: 5986158292360782670, guid: 7c750a70a80c4a64da2aa5fd1f8e56de, type: 3}
      propertyPath: m_Enabled
      value: 1
      objectReference: {fileID: 0}
    - target: {fileID: 5986158292360782671, guid: 7c750a70a80c4a64da2aa5fd1f8e56de, type: 3}
      propertyPath: m_IsActive
      value: 1
      objectReference: {fileID: 0}
    - target: {fileID: 5986158292406973704, guid: 7c750a70a80c4a64da2aa5fd1f8e56de, type: 3}
      propertyPath: m_Enabled
      value: 1
      objectReference: {fileID: 0}
    - target: {fileID: 5986158292406973705, guid: 7c750a70a80c4a64da2aa5fd1f8e56de, type: 3}
      propertyPath: m_IsActive
      value: 0
      objectReference: {fileID: 0}
    - target: {fileID: 5986158292553262394, guid: 7c750a70a80c4a64da2aa5fd1f8e56de, type: 3}
      propertyPath: m_Enabled
      value: 1
      objectReference: {fileID: 0}
    - target: {fileID: 5986158292553262395, guid: 7c750a70a80c4a64da2aa5fd1f8e56de, type: 3}
      propertyPath: m_IsActive
      value: 0
      objectReference: {fileID: 0}
    - target: {fileID: 5986158292764872054, guid: 7c750a70a80c4a64da2aa5fd1f8e56de, type: 3}
      propertyPath: m_Enabled
      value: 1
      objectReference: {fileID: 0}
    - target: {fileID: 5986158292764872055, guid: 7c750a70a80c4a64da2aa5fd1f8e56de, type: 3}
      propertyPath: m_IsActive
      value: 0
      objectReference: {fileID: 0}
    - target: {fileID: 5986158292997194192, guid: 7c750a70a80c4a64da2aa5fd1f8e56de, type: 3}
      propertyPath: m_Enabled
      value: 1
      objectReference: {fileID: 0}
    - target: {fileID: 5986158292997194193, guid: 7c750a70a80c4a64da2aa5fd1f8e56de, type: 3}
      propertyPath: m_IsActive
      value: 0
      objectReference: {fileID: 0}
    - target: {fileID: 6668512469240173358, guid: 7c750a70a80c4a64da2aa5fd1f8e56de, type: 3}
      propertyPath: m_Enabled
      value: 1
      objectReference: {fileID: 0}
    - target: {fileID: 7421523497331940855, guid: 7c750a70a80c4a64da2aa5fd1f8e56de, type: 3}
      propertyPath: m_AnchorMax.x
      value: 0
      objectReference: {fileID: 0}
    - target: {fileID: 7421523497331940855, guid: 7c750a70a80c4a64da2aa5fd1f8e56de, type: 3}
      propertyPath: m_AnchorMax.y
      value: 0
      objectReference: {fileID: 0}
    - target: {fileID: 7887153023495636051, guid: 7c750a70a80c4a64da2aa5fd1f8e56de, type: 3}
      propertyPath: m_IsActive
      value: 0
      objectReference: {fileID: 0}
    - target: {fileID: 7887153024460238395, guid: 7c750a70a80c4a64da2aa5fd1f8e56de, type: 3}
      propertyPath: m_IsActive
      value: 1
      objectReference: {fileID: 0}
    - target: {fileID: 8960190028130662737, guid: 7c750a70a80c4a64da2aa5fd1f8e56de, type: 3}
      propertyPath: m_AnchorMax.y
      value: 1
      objectReference: {fileID: 0}
    - target: {fileID: 8960190028268652041, guid: 7c750a70a80c4a64da2aa5fd1f8e56de, type: 3}
      propertyPath: m_AnchorMax.y
      value: 1
      objectReference: {fileID: 0}
    - target: {fileID: 8960190028513205649, guid: 7c750a70a80c4a64da2aa5fd1f8e56de, type: 3}
      propertyPath: m_AnchorMax.y
      value: 1
      objectReference: {fileID: 0}
    - target: {fileID: 8960190028653569821, guid: 7c750a70a80c4a64da2aa5fd1f8e56de, type: 3}
      propertyPath: m_AnchorMax.y
      value: 1
      objectReference: {fileID: 0}
    - target: {fileID: 8960190028699791707, guid: 7c750a70a80c4a64da2aa5fd1f8e56de, type: 3}
      propertyPath: m_AnchorMax.y
      value: 0
      objectReference: {fileID: 0}
    - target: {fileID: 8960190029102018808, guid: 7c750a70a80c4a64da2aa5fd1f8e56de, type: 3}
      propertyPath: m_AnchorMax.y
      value: 0
      objectReference: {fileID: 0}
    - target: {fileID: 8960190029201855429, guid: 7c750a70a80c4a64da2aa5fd1f8e56de, type: 3}
      propertyPath: m_AnchorMax.y
      value: 1
      objectReference: {fileID: 0}
    - target: {fileID: 8960190029364977507, guid: 7c750a70a80c4a64da2aa5fd1f8e56de, type: 3}
      propertyPath: m_AnchorMax.y
      value: 1
      objectReference: {fileID: 0}
    - target: {fileID: 8960190029581055791, guid: 7c750a70a80c4a64da2aa5fd1f8e56de, type: 3}
      propertyPath: m_AnchorMax.y
      value: 1
      objectReference: {fileID: 0}
    - target: {fileID: 8960190029731683123, guid: 7c750a70a80c4a64da2aa5fd1f8e56de, type: 3}
      propertyPath: m_AnchorMax.y
      value: 0
      objectReference: {fileID: 0}
    - target: {fileID: 9093761769839592050, guid: 7c750a70a80c4a64da2aa5fd1f8e56de, type: 3}
      propertyPath: m_AnchoredPosition.x
      value: 13.72
      objectReference: {fileID: 0}
    - target: {fileID: 9093761769839592050, guid: 7c750a70a80c4a64da2aa5fd1f8e56de, type: 3}
      propertyPath: m_AnchoredPosition.y
      value: 6.21
      objectReference: {fileID: 0}
    - target: {fileID: 9093761769941661330, guid: 7c750a70a80c4a64da2aa5fd1f8e56de, type: 3}
      propertyPath: m_IsActive
      value: 0
      objectReference: {fileID: 0}
    - target: {fileID: 9093761769944186373, guid: 7c750a70a80c4a64da2aa5fd1f8e56de, type: 3}
      propertyPath: m_Name
      value: Tutorial level
      objectReference: {fileID: 0}
    - target: {fileID: 9093761769944186618, guid: 7c750a70a80c4a64da2aa5fd1f8e56de, type: 3}
      propertyPath: m_RootOrder
      value: 0
      objectReference: {fileID: 0}
    - target: {fileID: 9093761769944186618, guid: 7c750a70a80c4a64da2aa5fd1f8e56de, type: 3}
      propertyPath: m_LocalPosition.x
      value: 36.52805
      objectReference: {fileID: 0}
    - target: {fileID: 9093761769944186618, guid: 7c750a70a80c4a64da2aa5fd1f8e56de, type: 3}
      propertyPath: m_LocalPosition.y
      value: 7.595336
      objectReference: {fileID: 0}
    - target: {fileID: 9093761769944186618, guid: 7c750a70a80c4a64da2aa5fd1f8e56de, type: 3}
      propertyPath: m_LocalPosition.z
      value: -66.213776
      objectReference: {fileID: 0}
    - target: {fileID: 9093761769944186618, guid: 7c750a70a80c4a64da2aa5fd1f8e56de, type: 3}
      propertyPath: m_LocalRotation.w
      value: 1
      objectReference: {fileID: 0}
    - target: {fileID: 9093761769944186618, guid: 7c750a70a80c4a64da2aa5fd1f8e56de, type: 3}
      propertyPath: m_LocalRotation.x
      value: 0
      objectReference: {fileID: 0}
    - target: {fileID: 9093761769944186618, guid: 7c750a70a80c4a64da2aa5fd1f8e56de, type: 3}
      propertyPath: m_LocalRotation.y
      value: 0
      objectReference: {fileID: 0}
    - target: {fileID: 9093761769944186618, guid: 7c750a70a80c4a64da2aa5fd1f8e56de, type: 3}
      propertyPath: m_LocalRotation.z
      value: 0
      objectReference: {fileID: 0}
    - target: {fileID: 9093761769944186618, guid: 7c750a70a80c4a64da2aa5fd1f8e56de, type: 3}
      propertyPath: m_LocalEulerAnglesHint.x
      value: 0
      objectReference: {fileID: 0}
    - target: {fileID: 9093761769944186618, guid: 7c750a70a80c4a64da2aa5fd1f8e56de, type: 3}
      propertyPath: m_LocalEulerAnglesHint.y
      value: 0
      objectReference: {fileID: 0}
    - target: {fileID: 9093761769944186618, guid: 7c750a70a80c4a64da2aa5fd1f8e56de, type: 3}
      propertyPath: m_LocalEulerAnglesHint.z
      value: 0
      objectReference: {fileID: 0}
    - target: {fileID: 9093761771270765032, guid: 7c750a70a80c4a64da2aa5fd1f8e56de, type: 3}
      propertyPath: m_AnchoredPosition.x
      value: 21.09
      objectReference: {fileID: 0}
    - target: {fileID: 9093761771270765032, guid: 7c750a70a80c4a64da2aa5fd1f8e56de, type: 3}
      propertyPath: m_AnchoredPosition.y
      value: 10.17
      objectReference: {fileID: 0}
    - target: {fileID: 9093761771270765035, guid: 7c750a70a80c4a64da2aa5fd1f8e56de, type: 3}
      propertyPath: m_IsActive
      value: 0
      objectReference: {fileID: 0}
    - target: {fileID: 9093761771322388010, guid: 7c750a70a80c4a64da2aa5fd1f8e56de, type: 3}
      propertyPath: m_LocalPosition.x
      value: 5.11
      objectReference: {fileID: 0}
    - target: {fileID: 9093761771322388010, guid: 7c750a70a80c4a64da2aa5fd1f8e56de, type: 3}
      propertyPath: m_LocalPosition.y
      value: 7.07
      objectReference: {fileID: 0}
    m_RemovedComponents: []
  m_SourcePrefab: {fileID: 100100000, guid: 7c750a70a80c4a64da2aa5fd1f8e56de, type: 3}
