# This file uses centimeters as units for non-parametric coordinates.

mtllib CeilingFan.mtl
g default
v 6.306319 -0.002879 -3.425344
v 6.107686 0.066894 -3.772890
v 6.333819 0.317683 -3.376706
v 6.135186 0.387456 -3.724251
v 0.831759 0.261663 -0.040866
v 0.461693 0.433375 -0.690460
v 0.810995 -0.058899 -0.077837
v 0.440929 0.112813 -0.727431
v 3.111745 0.135935 -2.534040
v 3.139245 0.456497 -2.485401
v 3.745351 0.243592 -1.424906
v 3.717851 -0.076970 -1.473545
v -6.119595 -0.002879 -3.748760
v -6.321261 0.066894 -3.402966
v -6.091222 0.317683 -3.796895
v -6.292889 0.387456 -3.451101
v -0.451270 0.261663 -0.699891
v -0.828802 0.433375 -0.054608
v -0.472907 -0.058899 -0.663424
v -0.850439 0.112813 -0.018140
v -3.750416 0.135935 -1.427830
v -3.722043 0.456497 -1.475965
v -3.106680 0.243592 -2.531116
v -3.135053 -0.076970 -2.482981
v -0.186724 -0.002879 7.174105
v 0.213576 0.066894 7.175856
v -0.242596 0.317683 7.173601
v 0.157703 0.387456 7.175352
v -0.380489 0.261663 0.740757
v 0.367109 0.433375 0.745067
v -0.338088 -0.058899 0.741261
v 0.409510 0.112813 0.745571
v 0.638671 0.135935 3.961870
v 0.582798 0.456497 3.961366
v -0.638671 0.243592 3.956022
v -0.582798 -0.076970 3.956526
v 0.500000 -0.381302 -0.866025
v -0.500000 -0.381302 -0.866026
v -1.000000 -0.381302 -0.000000
v -0.500000 -0.381302 0.866025
v 0.500000 -0.381302 0.866025
v 1.000000 -0.381302 0.000000
v 0.500000 1.087600 -0.866025
v -0.500000 1.087600 -0.866026
v -1.000000 1.087600 -0.000000
v -0.500000 1.087600 0.866025
v 0.500000 1.087600 0.866025
v 1.000000 1.087600 0.000000
v 0.000000 1.087600 0.000000
vt 0.375000 0.000000
vt 0.625000 0.000000
vt 0.375000 0.250000
vt 0.625000 0.250000
vt 0.375000 0.500000
vt 0.625000 0.500000
vt 0.375000 0.750000
vt 0.625000 0.750000
vt 0.875000 0.000000
vt 0.875000 0.250000
vt 0.125000 0.000000
vt 0.125000 0.250000
vt 0.750000 0.000000
vt 0.625000 0.375000
vt 0.750000 0.250000
vt 0.250000 0.250000
vt 0.375000 0.375000
vt 0.250000 0.000000
vt 0.375000 0.000000
vt 0.625000 0.000000
vt 0.625000 0.250000
vt 0.375000 0.250000
vt 0.625000 0.375000
vt 0.375000 0.375000
vt 0.375000 0.500000
vt 0.625000 0.500000
vt 0.625000 0.750000
vt 0.375000 0.750000
vt 0.750000 0.000000
vt 0.750000 0.250000
vt 0.250000 0.000000
vt 0.250000 0.250000
vt 0.875000 0.000000
vt 0.875000 0.250000
vt 0.125000 0.000000
vt 0.125000 0.250000
vt 0.375000 0.000000
vt 0.625000 0.000000
vt 0.625000 0.250000
vt 0.375000 0.250000
vt 0.625000 0.375000
vt 0.375000 0.375000
vt 0.375000 0.500000
vt 0.625000 0.500000
vt 0.625000 0.750000
vt 0.375000 0.750000
vt 0.750000 0.000000
vt 0.750000 0.250000
vt 0.250000 0.000000
vt 0.250000 0.250000
vt 0.875000 0.000000
vt 0.875000 0.250000
vt 0.125000 0.000000
vt 0.125000 0.250000
vt 0.375000 0.312500
vt 0.416667 0.312500
vt 0.416667 0.688440
vt 0.375000 0.688440
vt 0.458333 0.312500
vt 0.458333 0.688440
vt 0.500000 0.312500
vt 0.500000 0.688440
vt 0.541667 0.312500
vt 0.541667 0.688440
vt 0.583333 0.312500
vt 0.583333 0.688440
vt 0.625000 0.312500
vt 0.625000 0.688440
vt 0.578125 0.979066
vt 0.421875 0.979066
vt 0.500000 0.837500
vt 0.343750 0.843750
vt 0.421875 0.708434
vt 0.578125 0.708434
vt 0.656250 0.843750
vn 0.868272 0.000785 -0.496087
vn 0.868272 0.000785 -0.496087
vn 0.868272 0.000785 -0.496087
vn 0.868272 0.000785 -0.496087
vn 0.084512 0.985147 0.149476
vn 0.084512 0.985147 0.149476
vn 0.089867 0.983132 0.159297
vn 0.089860 0.983135 0.159285
vn -0.868983 -0.000786 0.494842
vn -0.868983 -0.000786 0.494842
vn -0.868983 -0.000786 0.494842
vn -0.868983 -0.000786 0.494842
vn -0.373185 0.170388 -0.911977
vn -0.464920 0.161616 -0.870477
vn -0.465284 0.161577 -0.870289
vn -0.373184 0.170388 -0.911977
vn 0.513682 -0.161539 0.842636
vn 0.596379 -0.170187 0.784454
vn 0.596379 -0.170187 0.784455
vn 0.514028 -0.161577 0.842418
vn -0.553047 0.151042 -0.819345
vn -0.553047 0.151042 -0.819345
vn 0.094084 0.981452 0.167032
vn 0.094084 0.981452 0.167032
vn 0.425240 -0.151171 0.892367
vn 0.425240 -0.151171 0.892366
vn -0.863760 0.000784 -0.503903
vn -0.863760 0.000784 -0.503903
vn -0.863760 0.000784 -0.503903
vn -0.863760 0.000784 -0.503903
vn 0.087194 0.985147 -0.147928
vn 0.087194 0.985147 -0.147928
vn 0.093022 0.983132 -0.157475
vn 0.093015 0.983135 -0.157464
vn 0.863037 -0.000786 0.505141
vn 0.863037 -0.000786 0.505141
vn 0.863037 -0.000786 0.505141
vn 0.863037 -0.000786 0.505141
vn -0.603203 0.170387 0.779176
vn -0.521395 0.161616 0.837871
vn -0.521051 0.161577 0.838093
vn -0.603203 0.170387 0.779176
vn 0.472903 -0.161538 -0.866180
vn 0.381168 -0.170186 -0.908707
vn 0.381168 -0.170186 -0.908707
vn 0.472541 -0.161577 -0.866371
vn -0.433050 0.151042 0.888625
vn -0.433050 0.151042 0.888625
vn 0.097612 0.981452 -0.164995
vn 0.097612 0.981452 -0.164995
vn 0.560192 -0.151171 -0.814452
vn 0.560192 -0.151171 -0.814452
vn -0.004512 0.000785 0.999990
vn -0.004512 0.000785 0.999990
vn -0.004512 0.000785 0.999990
vn -0.004512 0.000785 0.999990
vn -0.171706 0.985147 -0.001548
vn -0.171706 0.985147 -0.001548
vn -0.182889 0.983132 -0.001822
vn -0.182875 0.983135 -0.001821
vn 0.005946 -0.000786 -0.999982
vn 0.005946 -0.000786 -0.999982
vn 0.005946 -0.000786 -0.999982
vn 0.005946 -0.000786 -0.999982
vn 0.976387 0.170388 0.132801
vn 0.986315 0.161616 0.032606
vn 0.986335 0.161577 0.032197
vn 0.976387 0.170388 0.132801
vn -0.986586 -0.161539 0.023544
vn -0.977547 -0.170186 0.124252
vn -0.977547 -0.170186 0.124252
vn -0.986569 -0.161577 0.023953
vn 0.986097 0.151042 -0.069280
vn 0.986097 0.151042 -0.069280
vn -0.191696 0.981452 -0.002037
vn -0.191696 0.981452 -0.002037
vn -0.985432 -0.151171 -0.077914
vn -0.985432 -0.151171 -0.077914
vn 0.000000 0.000000 -1.000000
vn 0.000000 0.000000 -1.000000
vn 0.000000 0.000000 -1.000000
vn 0.000000 0.000000 -1.000000
vn -0.866025 0.000000 -0.500000
vn -0.866025 0.000000 -0.500000
vn -0.866025 0.000000 -0.500000
vn -0.866025 0.000000 -0.500000
vn -0.866026 0.000000 0.500000
vn -0.866026 0.000000 0.500000
vn -0.866026 0.000000 0.500000
vn -0.866026 0.000000 0.500000
vn -0.000000 0.000000 1.000000
vn -0.000000 0.000000 1.000000
vn -0.000000 0.000000 1.000000
vn -0.000000 0.000000 1.000000
vn 0.866025 0.000000 0.500000
vn 0.866025 0.000000 0.500000
vn 0.866025 0.000000 0.500000
vn 0.866025 0.000000 0.500000
vn 0.866026 0.000000 -0.500000
vn 0.866026 0.000000 -0.500000
vn 0.866026 0.000000 -0.500000
vn 0.866026 0.000000 -0.500000
vn 0.000000 1.000000 0.000000
vn 0.000000 1.000000 0.000000
vn 0.000000 1.000000 0.000000
vn 0.000000 1.000000 -0.000000
vn 0.000000 1.000000 -0.000000
vn 0.000000 1.000000 0.000000
vn 0.000000 1.000000 0.000000
s off
g CeilingFan
usemtl initialShadingGroup
f 1/1/1 2/2/2 4/4/3 3/3/4
s 1
f 3/3/5 4/4/6 10/14/7 11/17/8
s off
f 5/5/9 6/6/10 8/8/11 7/7/12
s 2
f 2/2/13 9/13/14 10/15/15 4/4/16
s 3
f 12/18/17 1/1/18 3/3/19 11/16/20
s 2
f 9/13/14 8/9/21 6/10/22 10/15/15
s 1
f 11/17/8 10/14/7 6/6/23 5/5/24
s 3
f 7/11/25 12/18/17 11/16/20 5/12/26
s off
f 13/19/27 14/20/28 16/21/29 15/22/30
s 4
f 15/22/31 16/21/32 22/23/33 23/24/34
s off
f 17/25/35 18/26/36 20/27/37 19/28/38
s 5
f 14/20/39 21/29/40 22/30/41 16/21/42
s 6
f 24/31/43 13/19/44 15/22/45 23/32/46
s 5
f 21/29/40 20/33/47 18/34/48 22/30/41
s 4
f 23/24/34 22/23/33 18/26/49 17/25/50
s 6
f 19/35/51 24/31/43 23/32/46 17/36/52
s off
f 25/37/53 26/38/54 28/39/55 27/40/56
s 7
f 27/40/57 28/39/58 34/41/59 35/42/60
s off
f 29/43/61 30/44/62 32/45/63 31/46/64
s 8
f 26/38/65 33/47/66 34/48/67 28/39/68
s 9
f 36/49/69 25/37/70 27/40/71 35/50/72
s 8
f 33/47/66 32/51/73 30/52/74 34/48/67
s 7
f 35/42/60 34/41/59 30/44/75 29/43/76
s 9
f 31/53/77 36/49/69 35/50/72 29/54/78
s off
f 37/55/79 38/56/80 44/57/81 43/58/82
f 38/56/83 39/59/84 45/60/85 44/57/86
f 39/59/87 40/61/88 46/62/89 45/60/90
f 40/61/91 41/63/92 47/64/93 46/62/94
f 41/63/95 42/65/96 48/66/97 47/64/98
f 42/65/99 37/67/100 43/68/101 48/66/102
s 10
f 43/69/103 44/70/104 49/71/105
f 44/70/104 45/72/106 49/71/105
f 45/72/106 46/73/107 49/71/105
f 46/73/107 47/74/108 49/71/105
f 47/74/108 48/75/109 49/71/105
f 48/75/109 43/69/103 49/71/105
