%YAML 1.1
%TAG !u! tag:unity3d.com,2011:
--- !u!162 &1
EditorUserSettings:
  m_ObjectHideFlags: 0
  serializedVersion: 4
  m_ConfigSettings:
    RecentlyUsedSceneGuid-0:
      value: 5509030301540b0d0e0d0d7542725944104e4c79292d7f6629704c31bbb8316e
      flags: 0
    RecentlyUsedSceneGuid-1:
      value: 06570657030d0a02585a082613270a44404f492b782d75367a7a486bb2b9353e
      flags: 0
    RecentlyUsedScenePath-0:
      value: 22424703114646643e0d092c153010201a1601192f2d2835633c133af6f9
      flags: 0
    RecentlyUsedScenePath-1:
      value: 22424703114646643e0d092c1530102302160a3e1f2b343528275326ece92021
      flags: 0
    vcSharedLogLevel:
      value: 0d5e400f0650
      flags: 0
  m_VCAutomaticAdd: 1
  m_VCDebugCom: 0
  m_VCDebugCmd: 0
  m_VCDebugOut: 0
  m_SemanticMergeMode: 2
  m_DesiredImportWorkerCount: 2
  m_StandbyImportWorkerCount: 2
  m_IdleImportWorkerShutdownDelay: 60000
  m_VCShowFailedCheckout: 1
  m_VCOverwriteFailedCheckoutAssets: 1
  m_VCProjectOverlayIcons: 1
  m_VCHierarchyOverlayIcons: 1
  m_VCOtherOverlayIcons: 1
  m_VCAllowAsyncUpdate: 1
  m_ArtifactGarbageCollection: 1
