{
  "HeatMap": null,
  "Difficulty": 0,
  "Dimensions": {
    "x": 1536.0,
    "y": 2048.0
  },
  "Obstacles": [
    {
      "Name": "Sheeep",
      "SheepzWorldPosition": {
        "x": 822.000061,
        "y": 1443.0
      },
      "Gravity": {
        "Range": 0.9,
        "Mass": 1.0,
        "StrengthOfAttraction": 6.0
      },
      "Polarity": 1,
      "IsAttractable": false,
      "IsAttractive": true,
      "Rotation": {
        "x": 0.0,
        "y": 1.0,
        "z": 0.0,
        "w": -4.371139E-08,
        "eulerAngles": {
          "x": 0.0,
          "y": 180.0,
          "z": 0.0
        }
      }
    },
    {
      "Name": "Zaun",
      "SheepzWorldPosition": {
        "x": 795.0,
        "y": 1521.0
      },
      "Gravity": null,
      "Polarity": 2,
      "IsAttractable": false,
      "IsAttractive": false,
      "Rotation": {
        "x": 0.707106769,
        "y": 0.0,
        "z": 0.0,
        "w": -0.707106769,
        "eulerAngles": {
          "x": 270.0,
          "y": 0.0,
          "z": 0.0
        }
      }
    },
    {
      "Name": "Sheeep (1)",
      "SheepzWorldPosition": {
        "x": 768.0,
        "y": 1031.00012
      },
      "Gravity": {
        "Range": 0.9,
        "Mass": 1.0,
        "StrengthOfAttraction": 8.0
      },
      "Polarity": 1,
      "IsAttractable": false,
      "IsAttractive": true,
      "Rotation": {
        "x": 0.0,
        "y": 1.0,
        "z": 0.0,
        "w": -4.371139E-08,
        "eulerAngles": {
          "x": 0.0,
          "y": 180.0,
          "z": 0.0
        }
      }
    },
    {
      "Name": "Wolf",
      "SheepzWorldPosition": {
        "x": 1169.0,
        "y": 691.0
      },
      "Gravity": {
        "Range": 1.3,
        "Mass": 1.0,
        "StrengthOfAttraction": 6.14
      },
      "Polarity": 0,
      "IsAttractable": false,
      "IsAttractive": true,
      "Rotation": {
        "x": 0.0,
        "y": 1.0,
        "z": 0.0,
        "w": -4.371139E-08,
        "eulerAngles": {
          "x": 0.0,
          "y": 180.0,
          "z": 0.0
        }
      }
    }
  ],
  "Sheep": {
    "Name": "PlayerSheep",
    "SheepzWorldPosition": {
      "x": 768.0,
      "y": 60.00006
    },
    "Gravity": null,
    "Polarity": 0,
    "IsAttractable": true,
    "IsAttractive": false,
    "Rotation": {
      "x": 0.0,
      "y": 0.0,
      "z": 0.0,
      "w": 1.0,
      "eulerAngles": {
        "x": 0.0,
        "y": 0.0,
        "z": 0.0
      }
    }
  },
  "GoalSheepzWorldPosition": {
    "x": 437.0,
    "y": 1294.0
  },
  "GoalRotation": {
    "x": 0.0,
    "y": 0.0,
    "z": 0.0,
    "w": 1.0,
    "eulerAngles": {
      "x": 0.0,
      "y": 0.0,
      "z": 0.0
    }
  }
}