{
  "Difficulty": 0,
  "Dimensions": {
    "x": 1536.0,
    "y": 2048.0
  },
  "Obstacles": [
    {
      "Name": "Sheeep(Clone)",
      "SheepzWorldPosition": {
        "x": 836.4746,
        "y": 724.8843
      },
      "Gravity": {
        "Range": 1.20313978,
        "Mass": 11.1395464,
        "StrengthOfAttraction": 1.45806468
      },
      "Polarity": 1,
      "IsAttractable": false,
      "IsAttractive": true,
      "Rotation": {
        "x": 0.0,
        "y": 1.0,
        "z": 0.0,
        "w": -4.371139E-08,
        "eulerAngles": {
          "x": 0.0,
          "y": 180.0,
          "z": 0.0
        }
      }
    },
    {
      "Name": "Sheeep(Clone)",
      "SheepzWorldPosition": {
        "x": 606.474243,
        "y": 1483.88464
      },
      "Gravity": {
        "Range": 1.0,
        "Mass": 18.754591,
        "StrengthOfAttraction": 2.245614
      },
      "Polarity": 1,
      "IsAttractable": false,
      "IsAttractive": true,
      "Rotation": {
        "x": 0.0,
        "y": 1.0,
        "z": 0.0,
        "w": -4.371139E-08,
        "eulerAngles": {
          "x": 0.0,
          "y": 180.0,
          "z": 0.0
        }
      }
    },
    {
      "Name": "Wolf",
      "SheepzWorldPosition": {
        "x": 493.474182,
        "y": 531.8842
      },
      "Gravity": {
        "Range": 1.6,
        "Mass": 1.0,
        "StrengthOfAttraction": 6.14
      },
      "Polarity": 0,
      "IsAttractable": false,
      "IsAttractive": true,
      "Rotation": {
        "x": 0.0,
        "y": 1.0,
        "z": 0.0,
        "w": -4.371139E-08,
        "eulerAngles": {
          "x": 0.0,
          "y": 180.0,
          "z": 0.0
        }
      }
    },
    {
      "Name": "Wolf (1)",
      "SheepzWorldPosition": {
        "x": 1025.47449,
        "y": 1217.88428
      },
      "Gravity": {
        "Range": 1.6,
        "Mass": 1.0,
        "StrengthOfAttraction": 6.14
      },
      "Polarity": 0,
      "IsAttractable": false,
      "IsAttractive": true,
      "Rotation": {
        "x": 0.0,
        "y": 1.0,
        "z": 0.0,
        "w": -4.371139E-08,
        "eulerAngles": {
          "x": 0.0,
          "y": 180.0,
          "z": 0.0
        }
      }
    },
    {
      "Name": "Zaun (1)",
      "SheepzWorldPosition": {
        "x": 1290.00012,
        "y": 756.0
      },
      "Gravity": null,
      "Polarity": 2,
      "IsAttractable": false,
      "IsAttractive": false,
      "Rotation": {
        "x": 0.707106769,
        "y": 0.0,
        "z": 0.0,
        "w": -0.707106769,
        "eulerAngles": {
          "x": 270.0,
          "y": 0.0,
          "z": 0.0
        }
      }
    },
    {
      "Name": "Zaun (2)",
      "SheepzWorldPosition": {
        "x": 1545.99988,
        "y": 756.0
      },
      "Gravity": null,
      "Polarity": 2,
      "IsAttractable": false,
      "IsAttractive": false,
      "Rotation": {
        "x": 0.707106769,
        "y": 0.0,
        "z": 0.0,
        "w": -0.707106769,
        "eulerAngles": {
          "x": 270.0,
          "y": 0.0,
          "z": 0.0
        }
      }
    }
  ],
  "Sheep": {
    "Name": "PlayerSheep",
    "SheepzWorldPosition": {
      "x": 768.0,
      "y": 60.00006
    },
    "Gravity": null,
    "Polarity": 0,
    "IsAttractable": true,
    "IsAttractive": false,
    "Rotation": {
      "x": 0.0,
      "y": 0.0,
      "z": 0.0,
      "w": 1.0,
      "eulerAngles": {
        "x": 0.0,
        "y": 0.0,
        "z": 0.0
      }
    }
  },
  "GoalSheepzWorldPosition": {
    "x": 437.0,
    "y": 1294.0
  },
  "GoalRotation": {
    "x": 0.0,
    "y": 0.0,
    "z": 0.0,
    "w": 1.0,
    "eulerAngles": {
      "x": 0.0,
      "y": 0.0,
      "z": 0.0
    }
  }
}