
G21
G90
G94
F20.00
G00 Z0.1000
M03 S1000
G4 P1
G00 X0.3900Y19.0350
G01 Z-0.5000
G01 X0.3900Y0.3900
G01 X30.4650Y0.3900
G00 X30.4650Y0.3900
G01 Z-1.0000
G01 X0.3900Y0.3900
G01 X0.3900Y19.0350
G00 X0.3900Y19.0350
G01 Z-1.5000
G01 X0.3900Y0.3900
G01 X30.4650Y0.3900
G00 Z0.1000
G00 X31.7650Y0.3900
G01 Z-0.5000
G01 X61.8400Y0.3900
G01 X61.8400Y19.0350
G00 X61.8400Y19.0350
G01 Z-1.0000
G01 X61.8400Y0.3900
G01 X31.7650Y0.3900
G00 X31.7650Y0.3900
G01 Z-1.5000
G01 X61.8400Y0.3900
G01 X61.8400Y19.0350
G00 Z0.1000
G00 X61.8400Y20.3350
G01 Z-0.5000
G01 X61.8400Y38.9800
G01 X31.7650Y38.9800
G00 X31.7650Y38.9800
G01 Z-1.0000
G01 X61.8400Y38.9800
G01 X61.8400Y20.3350
G00 X61.8400Y20.3350
G01 Z-1.5000
G01 X61.8400Y38.9800
G01 X31.7650Y38.9800
G00 Z0.1000
G00 X30.4650Y38.9800
G01 Z-0.5000
G01 X0.3900Y38.9800
G01 X0.3900Y20.3350
G00 X0.3900Y20.3350
G01 Z-1.0000
G01 X0.3900Y38.9800
G01 X30.4650Y38.9800
G00 X30.4650Y38.9800
G01 Z-1.5000
G01 X0.3900Y38.9800
G01 X0.3900Y20.3350
G00 Z0.1000
G00 Z0.1000
G00 X0Y0
M05
