EESchema Schematic File Version 4
EELAYER 26 0
EELAYER END
$Descr A4 11693 8268
encoding utf-8
Sheet 1 1
Title ""
Date ""
Rev ""
Comp ""
Comment1 ""
Comment2 ""
Comment3 ""
Comment4 ""
$EndDescr
$Comp
L fab:CAP-US1206FAB C1
U 1 1 5E5EC930
P 7750 2900
F 0 "C1" H 7800 3154 45  0000 C CNN
F 1 "1uF" H 7800 3070 45  0000 C CNN
F 2 "fab1:fab-C1206FAB" H 7780 3050 20  0001 C CNN
F 3 "" H 7750 2900 50  0001 C CNN
	1    7750 2900
	1    0    0    -1  
$EndComp
$Comp
L fab:LEDFAB1206 D1
U 1 1 5E5ECAF7
P 7400 2300
F 0 "D1" H 7477 2392 45  0000 L CNN
F 1 "LEDFAB1206" H 7477 2308 45  0000 L CNN
F 2 "fab1:fab-LED1206FAB" H 7430 2450 20  0001 C CNN
F 3 "" H 7400 2300 50  0001 C CNN
	1    7400 2300
	0    -1   -1   0   
$EndComp
$Comp
L MCU_Microchip_ATmega:ATmega328P-AU U1
U 1 1 5E5ECBF7
P 3200 3000
F 0 "U1" H 3200 1414 50  0000 C CNN
F 1 "ATmega328P-AU" H 3200 1323 50  0000 C CNN
F 2 "fab1:fab-TQFP32-08THIN" H 3200 3000 50  0001 C CIN
F 3 "http://ww1.microchip.com/downloads/en/DeviceDoc/ATmega328_P%20AVR%20MCU%20with%20picoPower%20Technology%20Data%20Sheet%2040001984A.pdf" H 3200 3000 50  0001 C CNN
	1    3200 3000
	1    0    0    -1  
$EndComp
$Comp
L Connector:Conn_01x06_Female J3
U 1 1 5E5ECE73
P 1600 2600
F 0 "J3" H 1494 2075 50  0000 C CNN
F 1 "Conn_01x06_Female" H 1494 2166 50  0000 C CNN
F 2 "fab1:fab-1X06SMD" H 1600 2600 50  0001 C CNN
F 3 "~" H 1600 2600 50  0001 C CNN
	1    1600 2600
	-1   0    0    1   
$EndComp
$Comp
L Connector:Conn_01x06_Female J1
U 1 1 5E5ED170
P 7200 2800
F 0 "J1" H 7094 2275 50  0000 C CNN
F 1 "Conn_01x06_Female" H 7094 2366 50  0000 C CNN
F 2 "fab1:fab-1X06SMD" H 7200 2800 50  0001 C CNN
F 3 "~" H 7200 2800 50  0001 C CNN
	1    7200 2800
	-1   0    0    1   
$EndComp
$Comp
L fab:RES-US1206FAB R2
U 1 1 5E5ED3E7
P 7100 3200
F 0 "R2" H 7100 3394 45  0000 C CNN
F 1 "10 Kohm" H 7100 3310 45  0000 C CNN
F 2 "fab1:fab-R1206FAB" H 7130 3350 20  0001 C CNN
F 3 "" H 7100 3200 50  0001 C CNN
	1    7100 3200
	-1   0    0    1   
$EndComp
$Comp
L fab:RES-US1206FAB R1
U 1 1 5E5ED6AC
P 6600 2300
F 0 "R1" H 6600 2494 45  0000 C CNN
F 1 "R-LED-10 Kohm" H 6600 2410 45  0000 C CNN
F 2 "fab1:fab-R1206FAB" H 6630 2450 20  0001 C CNN
F 3 "" H 6600 2300 50  0001 C CNN
	1    6600 2300
	-1   0    0    1   
$EndComp
$Comp
L fab:6MM_SWITCH6MM_SWITCH S1
U 1 1 5E5ED771
P 7000 4000
F 0 "S1" H 7153 4042 45  0000 L CNN
F 1 "6MM_SWITCH6MM_SWITCH" V 7153 3958 45  0000 L CNN
F 2 "fab1:fab-6MM_SWITCH" H 7030 4150 20  0001 C CNN
F 3 "" H 7000 4000 50  0001 C CNN
	1    7000 4000
	0    1    1    0   
$EndComp
Wire Wire Line
	2100 2400 2100 1300
Wire Wire Line
	2100 1300 3900 1300
Wire Wire Line
	3900 1300 3900 1900
Wire Wire Line
	3800 1900 3900 1900
Wire Wire Line
	1950 1150 4100 1150
Wire Wire Line
	4100 1150 4100 2000
Wire Wire Line
	4100 2000 3800 2000
Wire Wire Line
	1800 2500 2250 2500
Wire Wire Line
	2250 2500 2250 1400
Wire Wire Line
	2250 1400 3850 1400
Wire Wire Line
	3850 1400 3850 1800
Wire Wire Line
	3850 1800 3800 1800
Wire Wire Line
	2100 2400 1800 2400
Wire Wire Line
	1950 1150 1950 2300
Wire Wire Line
	1950 2300 1800 2300
Wire Wire Line
	1800 2600 2250 2600
Wire Wire Line
	2250 2600 2250 4600
Wire Wire Line
	2250 4600 3900 4600
Wire Wire Line
	3900 4600 3900 4200
Wire Wire Line
	3900 4200 3800 4200
Wire Wire Line
	1800 2700 2150 2700
Wire Wire Line
	2150 2700 2150 4750
Wire Wire Line
	2150 4750 4050 4750
Wire Wire Line
	4050 4750 4050 4100
Wire Wire Line
	4050 4100 3800 4100
Wire Wire Line
	1800 2800 1950 2800
Wire Wire Line
	1950 2800 1950 4850
Wire Wire Line
	1950 4850 4200 4850
Wire Wire Line
	4200 4850 4200 4000
Wire Wire Line
	4200 4000 3800 4000
Wire Wire Line
	4450 3300 4300 3300
Wire Wire Line
	4350 3900 4350 3600
Wire Wire Line
	4350 3600 3800 3600
Wire Wire Line
	4400 3800 4400 3500
Wire Wire Line
	4400 3500 3800 3500
Wire Wire Line
	4650 3700 4650 3250
Wire Wire Line
	7650 1500 3300 1500
Wire Wire Line
	2500 1500 2500 1800
Connection ~ 3200 1500
Wire Wire Line
	3200 1500 2500 1500
Connection ~ 3300 1500
Wire Wire Line
	3300 1500 3200 1500
Wire Wire Line
	2500 1800 2600 1800
Connection ~ 2600 1800
Wire Wire Line
	2600 1800 2650 1800
Connection ~ 7650 2900
Wire Wire Line
	7650 2900 7650 1500
Wire Wire Line
	3200 4500 5600 4500
Wire Wire Line
	8150 4500 8150 4100
Wire Wire Line
	8150 2300 7500 2300
Wire Wire Line
	7200 2300 6800 2300
Wire Wire Line
	3800 3700 4550 3700
Wire Wire Line
	4550 3700 4550 3600
Connection ~ 5600 4500
Wire Wire Line
	5600 4500 8150 4500
Wire Wire Line
	4700 3500 4700 3300
Connection ~ 5600 3300
Wire Wire Line
	5600 3300 5600 4500
Wire Wire Line
	4650 3250 6200 3250
Wire Wire Line
	7300 3200 7650 3200
Wire Wire Line
	4450 3300 4450 3200
Wire Wire Line
	4450 3200 6650 3200
Wire Wire Line
	4700 3300 5600 3300
Wire Wire Line
	7200 4000 7200 4100
Wire Wire Line
	7200 4100 8150 4100
Connection ~ 7200 4100
Connection ~ 8150 4100
Wire Wire Line
	8150 4100 8150 2900
Wire Wire Line
	6800 4100 6800 4000
Wire Wire Line
	6800 4000 6650 4000
Connection ~ 6800 4000
Connection ~ 5600 2900
Wire Wire Line
	5600 2900 5600 3300
Wire Wire Line
	6650 3000 7400 3000
Wire Wire Line
	5600 2900 7400 2900
Wire Wire Line
	7400 2800 6200 2800
Wire Wire Line
	6200 2800 6200 3250
Wire Wire Line
	6200 3250 7650 3250
Wire Wire Line
	6350 2700 6350 2300
Wire Wire Line
	3800 2300 6350 2300
Connection ~ 6350 2300
Wire Wire Line
	6350 2300 6400 2300
Wire Wire Line
	7400 2600 6050 2600
Wire Wire Line
	6050 2600 6050 2200
Wire Wire Line
	6050 2200 3800 2200
Wire Wire Line
	7400 2500 6150 2500
Wire Wire Line
	6150 2500 6150 2050
Wire Wire Line
	3800 2050 3800 2100
Wire Wire Line
	3800 2050 6150 2050
Wire Wire Line
	7950 2900 8150 2900
Connection ~ 8150 2900
Wire Wire Line
	8150 2900 8150 2300
Wire Wire Line
	4700 3600 4550 3600
Wire Wire Line
	4700 3700 4650 3700
Wire Wire Line
	4700 3800 4400 3800
$Comp
L fab:CAP-US1206FAB C2
U 1 1 5E5EC1F8
P 4400 4000
F 0 "C2" H 4450 4254 45  0000 C CNN
F 1 "0.1uF" H 4450 4170 45  0000 C CNN
F 2 "fab1:fab-C1206FAB" H 4430 4150 20  0001 C CNN
F 3 "" H 4400 4000 50  0001 C CNN
	1    4400 4000
	1    0    0    -1  
$EndComp
Wire Wire Line
	4700 3900 4350 3900
Connection ~ 7650 3200
Wire Wire Line
	7650 3200 7650 2900
Wire Wire Line
	7650 3250 7650 3200
Wire Wire Line
	7400 2700 6350 2700
Connection ~ 6200 3250
$Comp
L fab:FTDI-SMD-HEADER M1
U 1 1 5E5ED236
P 4700 4000
F 0 "M1" H 4700 4000 45  0001 C CNN
F 1 "FTDI-SMD-HEADER" H 4700 4000 45  0001 C CNN
F 2 "fab1:fab-1X06SMD" H 4730 4150 20  0001 C CNN
F 3 "" H 4700 4000 50  0001 C CNN
	1    4700 4000
	1    0    0    -1  
$EndComp
Wire Wire Line
	4600 4000 4700 4000
Wire Wire Line
	4300 4000 4300 3300
Connection ~ 4300 3300
Wire Wire Line
	4300 3300 3800 3300
$Comp
L fab:RESONATOR Res1
U 1 1 5E6B73D8
P 5600 2350
F 0 "Res1" H 5600 2604 45  0000 C CNN
F 1 "RESONATOR" H 5600 2520 45  0000 C CNN
F 2 "" H 5630 2500 20  0001 C CNN
F 3 "" H 5600 2350 50  0001 C CNN
	1    5600 2350
	1    0    0    -1  
$EndComp
Wire Wire Line
	5600 2650 5600 2900
Wire Wire Line
	6650 3000 6650 3200
Connection ~ 6650 3200
Wire Wire Line
	6650 3200 6900 3200
Wire Wire Line
	6650 3200 6650 4000
Wire Wire Line
	5300 2350 5300 2500
Wire Wire Line
	5300 2500 3800 2500
Wire Wire Line
	3800 2400 5900 2400
Wire Wire Line
	5900 2400 5900 2350
$EndSCHEMATC
