EESchema Schematic File Version 4
LIBS:electronics design-cache
EELAYER 26 0
EELAYER END
$Descr A4 11693 8268
encoding utf-8
Sheet 1 1
Title ""
Date ""
Rev ""
Comp ""
Comment1 ""
Comment2 ""
Comment3 ""
Comment4 ""
$EndDescr
$Comp
L electronics-design-rescue:CAP-US1206FAB-fab C1
U 1 1 5E5EC1FB
P 10250 3900
F 0 "C1" H 10300 4154 45  0000 C CNN
F 1 "1uF" H 10300 4070 45  0000 C CNN
F 2 "fab:fab-C1206FAB" H 10280 4050 20  0001 C CNN
F 3 "" H 10250 3900 50  0001 C CNN
	1    10250 3900
	1    0    0    -1  
$EndComp
$Comp
L electronics-design-rescue:CAP-US1206FAB-fab C2
U 1 1 5E5EC316
P 6450 4750
F 0 "C2" H 6500 5004 45  0000 C CNN
F 1 "0.1 uF" H 6500 4920 45  0000 C CNN
F 2 "fab:fab-C1206FAB" H 6480 4900 20  0001 C CNN
F 3 "" H 6450 4750 50  0001 C CNN
	1    6450 4750
	1    0    0    -1  
$EndComp
$Comp
L electronics-design-rescue:LEDFAB1206-fab D1
U 1 1 5E5EC393
P 10100 3150
F 0 "D1" H 10177 3242 45  0000 L CNN
F 1 "LEDFAB1206" H 10177 3158 45  0000 L CNN
F 2 "fab:fab-LED1206FAB" H 10130 3300 20  0001 C CNN
F 3 "" H 10100 3150 50  0001 C CNN
	1    10100 3150
	0    -1   -1   0   
$EndComp
$Comp
L electronics-design-rescue:ATmega328P-AU-MCU_Microchip_ATmega IC1
U 1 1 5E5EC5BE
P 4750 3550
F 0 "IC1" H 4750 1964 50  0000 C CNN
F 1 "ATmega328P-AU" H 4750 1873 50  0000 C CNN
F 2 "fab:fab-TQFP32-08THIN" H 4750 3550 50  0001 C CIN
F 3 "http://ww1.microchip.com/downloads/en/DeviceDoc/ATmega328_P%20AVR%20MCU%20with%20picoPower%20Technology%20Data%20Sheet%2040001984A.pdf" H 4750 3550 50  0001 C CNN
	1    4750 3550
	1    0    0    -1  
$EndComp
$Comp
L electronics-design-rescue:Conn_01x06_Female-Connector J1
U 1 1 5E5EC740
P 9550 4250
F 0 "J1" H 9577 4226 50  0000 L CNN
F 1 "Conn_01x06_Female" H 9577 4135 50  0000 L CNN
F 2 "fab:fab-1X06SMD" H 9550 4250 50  0001 C CNN
F 3 "~" H 9550 4250 50  0001 C CNN
	1    9550 4250
	-1   0    0    1   
$EndComp
$Comp
L electronics-design-rescue:Conn_01x06_Female-Connector J3
U 1 1 5E5EC79D
P 2350 3050
F 0 "J3" H 2377 3026 50  0000 L CNN
F 1 "Conn_01x06_Female" H 2377 2935 50  0000 L CNN
F 2 "fab:fab-1X06SMD" H 2350 3050 50  0001 C CNN
F 3 "~" H 2350 3050 50  0001 C CNN
	1    2350 3050
	-1   0    0    1   
$EndComp
$Comp
L electronics-design-rescue:FTDI-SMD-HEADER-fab M1
U 1 1 5E5EC842
P 6750 4750
F 0 "M1" H 6750 4750 45  0001 C CNN
F 1 "FTDI-SMD-HEADER" H 6750 4750 45  0001 C CNN
F 2 "fab:fab-1X06SMD" H 6780 4900 20  0001 C CNN
F 3 "" H 6750 4750 50  0001 C CNN
	1    6750 4750
	1    0    0    -1  
$EndComp
$Comp
L electronics-design-rescue:RES-US1206FAB-fab R2
U 1 1 5E5EC877
P 9600 4850
F 0 "R2" H 9600 5044 45  0000 C CNN
F 1 "10 Kohm" H 9600 4960 45  0000 C CNN
F 2 "fab:fab-R1206FAB" H 9630 5000 20  0001 C CNN
F 3 "" H 9600 4850 50  0001 C CNN
	1    9600 4850
	1    0    0    -1  
$EndComp
$Comp
L electronics-design-rescue:RES-US1206FAB-fab R1
U 1 1 5E5EC8FE
P 8450 3150
F 0 "R1" H 8450 3344 45  0000 C CNN
F 1 "R-LED-10 Kohm" H 8450 3260 45  0000 C CNN
F 2 "fab:fab-R1206FAB" H 8480 3300 20  0001 C CNN
F 3 "" H 8450 3150 50  0001 C CNN
	1    8450 3150
	1    0    0    -1  
$EndComp
$Comp
L electronics-design-rescue:6MM_SWITCH6MM_SWITCH-fab S1
U 1 1 5E5EC9D5
P 9400 5300
F 0 "S1" H 9553 5342 45  0000 L CNN
F 1 "6MM_SWITCH6MM_SWITCH" H 9553 5258 45  0000 L CNN
F 2 "fab:fab-6MM_SWITCH" H 9430 5450 20  0001 C CNN
F 3 "" H 9400 5300 50  0001 C CNN
	1    9400 5300
	0    1    1    0   
$EndComp
$Comp
L electronics-design-rescue:RESONATOR-fab XTAL1
U 1 1 5E5ECA52
P 6500 3250
F 0 "XTAL1" H 6500 3504 45  0000 C CNN
F 1 "RESONATOR" H 6500 3420 45  0000 C CNN
F 2 "fab:fab-EFOBM" H 6530 3400 20  0001 C CNN
F 3 "" H 6500 3250 50  0001 C CNN
	1    6500 3250
	1    0    0    -1  
$EndComp
Wire Wire Line
	2550 2750 2800 2750
Wire Wire Line
	2800 2750 2800 800 
Wire Wire Line
	2800 800  6000 800 
Wire Wire Line
	2550 2850 3000 2850
Wire Wire Line
	3000 2850 3000 1000
Wire Wire Line
	3000 1000 5600 1000
Wire Wire Line
	5600 1000 5600 2450
Wire Wire Line
	5600 2450 5350 2450
Wire Wire Line
	6000 800  6000 2550
Wire Wire Line
	6000 2550 5350 2550
Wire Wire Line
	2550 2950 3350 2950
Wire Wire Line
	3350 2950 3350 1300
Wire Wire Line
	3350 1300 5400 1300
Wire Wire Line
	5400 1300 5400 2350
Wire Wire Line
	5400 2350 5350 2350
Wire Wire Line
	2550 3250 2800 3250
Wire Wire Line
	2800 3250 2800 6750
Wire Wire Line
	2800 6750 6300 6750
Wire Wire Line
	6300 6750 6300 4550
Wire Wire Line
	6300 4550 5350 4550
Wire Wire Line
	2550 3150 3200 3150
Wire Wire Line
	3200 3150 3200 6300
Wire Wire Line
	3200 6300 5950 6300
Wire Wire Line
	5950 6300 5950 4650
Wire Wire Line
	5950 4650 5350 4650
Wire Wire Line
	2550 3050 3350 3050
Wire Wire Line
	3350 3050 3350 6000
Wire Wire Line
	3350 6000 5600 6000
Wire Wire Line
	5600 6000 5600 4750
Wire Wire Line
	5600 4750 5350 4750
Wire Wire Line
	9750 3950 9750 2650
Wire Wire Line
	9750 2650 5350 2650
Wire Wire Line
	9450 4050 9450 2750
Wire Wire Line
	9450 2750 5350 2750
Wire Wire Line
	9450 4050 9750 4050
Wire Wire Line
	9750 4150 9300 4150
Wire Wire Line
	9300 4150 9300 2850
Wire Wire Line
	9300 2850 8050 2850
Wire Wire Line
	5350 2950 6900 2950
Wire Wire Line
	6900 2950 6900 3250
Wire Wire Line
	6900 3250 6800 3250
Wire Wire Line
	5350 3050 6200 3050
Wire Wire Line
	6200 3050 6200 3250
Wire Wire Line
	6500 3550 6500 3750
Wire Wire Line
	8050 3150 8050 2850
Connection ~ 8050 2850
Wire Wire Line
	8050 2850 5350 2850
Wire Wire Line
	9900 3150 8650 3150
Wire Wire Line
	8050 3150 8250 3150
Wire Wire Line
	10200 3150 10450 3150
Wire Wire Line
	10450 3150 10450 3900
Wire Wire Line
	3800 1550 3800 2350
Wire Wire Line
	3800 2350 4150 2350
Wire Wire Line
	4750 2050 4750 1550
Wire Wire Line
	3800 1550 4750 1550
Connection ~ 4750 1550
Wire Wire Line
	4750 1550 4850 1550
Wire Wire Line
	4850 2050 4850 1550
Wire Wire Line
	10150 3900 10150 1550
Wire Wire Line
	10150 1550 4850 1550
Connection ~ 4850 1550
Wire Wire Line
	10150 3900 10150 4850
Wire Wire Line
	10150 4850 9800 4850
Connection ~ 10150 3900
Wire Wire Line
	10450 3900 10700 3900
Wire Wire Line
	10700 3900 10700 5400
Connection ~ 10450 3900
Wire Wire Line
	9600 5300 9600 5400
Wire Wire Line
	9200 5400 9200 5300
Wire Wire Line
	9600 5400 10700 5400
Connection ~ 9600 5400
Connection ~ 10700 5400
Wire Wire Line
	10700 5400 10700 5600
Wire Wire Line
	9200 5300 9200 4850
Connection ~ 9200 5300
Wire Wire Line
	6750 4250 6500 4250
Connection ~ 6500 4250
Wire Wire Line
	6500 4250 6500 5250
Wire Wire Line
	6750 4650 6350 4650
Wire Wire Line
	6350 4650 6350 4150
Wire Wire Line
	6350 4150 5350 4150
Wire Wire Line
	5350 4050 6100 4050
Wire Wire Line
	6100 4050 6100 4400
Wire Wire Line
	6100 4400 6650 4400
Wire Wire Line
	6650 4400 6650 4550
Wire Wire Line
	6650 4550 6750 4550
Wire Wire Line
	5350 4250 6000 4250
Wire Wire Line
	6000 4250 6000 4350
Wire Wire Line
	6000 4350 6750 4350
Wire Wire Line
	6650 4750 6750 4750
Wire Wire Line
	9200 4450 9750 4450
Wire Wire Line
	8100 4850 8100 3850
Wire Wire Line
	6350 4750 6150 4750
Wire Wire Line
	6150 4750 6150 3850
Wire Wire Line
	5350 3850 6150 3850
Connection ~ 6150 3850
Wire Wire Line
	6150 3850 8100 3850
Wire Wire Line
	8100 4850 9200 4850
Connection ~ 9200 4850
Wire Wire Line
	9200 4850 9200 4450
Wire Wire Line
	9200 4850 9400 4850
Wire Wire Line
	10150 4850 10150 4900
Wire Wire Line
	10150 4900 7850 4900
Wire Wire Line
	7850 4050 6400 4050
Wire Wire Line
	6400 4050 6400 4450
Wire Wire Line
	6400 4450 6750 4450
Connection ~ 10150 4850
Wire Wire Line
	9750 4350 8350 4350
Wire Wire Line
	8350 4350 8350 3750
Wire Wire Line
	8350 3750 6500 3750
Connection ~ 6500 3750
Wire Wire Line
	6500 3750 6500 4250
Wire Wire Line
	9750 4250 7850 4250
Wire Wire Line
	7850 4050 7850 4250
Connection ~ 7850 4250
Wire Wire Line
	7850 4250 7850 4900
Wire Wire Line
	4750 5050 4750 5600
Wire Wire Line
	6550 5250 6500 5250
Wire Wire Line
	4750 5600 6550 5600
Wire Wire Line
	6550 5250 6550 5600
Connection ~ 6550 5600
Wire Wire Line
	6550 5600 10700 5600
$EndSCHEMATC
