
G21
G90
G94
F20.00
G00 Z0.1000
M03 S1000
G4 P1
G00 X1.9140Y22.5901
G01 Z-0.5000
G01 X1.9140Y1.9140
G01 X32.6240Y1.9140
G00 X32.6240Y1.9140
G01 Z-1.0000
G01 X1.9140Y1.9140
G01 X1.9140Y22.5901
G00 X1.9140Y22.5901
G01 Z-1.5000
G01 X1.9140Y1.9140
G01 X32.6240Y1.9140
G00 Z0.1000
G00 X33.9240Y1.9140
G01 Z-0.5000
G01 X64.6340Y1.9140
G01 X64.6340Y22.5901
G00 X64.6340Y22.5901
G01 Z-1.0000
G01 X64.6340Y1.9140
G01 X33.9240Y1.9140
G00 X33.9240Y1.9140
G01 Z-1.5000
G01 X64.6340Y1.9140
G01 X64.6340Y22.5901
G00 Z0.1000
G00 X64.6340Y23.8901
G01 Z-0.5000
G01 X64.6340Y44.5662
G01 X33.9240Y44.5662
G00 X33.9240Y44.5662
G01 Z-1.0000
G01 X64.6340Y44.5662
G01 X64.6340Y23.8901
G00 X64.6340Y23.8901
G01 Z-1.5000
G01 X64.6340Y44.5662
G01 X33.9240Y44.5662
G00 Z0.1000
G00 X32.6240Y44.5662
G01 Z-0.5000
G01 X1.9140Y44.5662
G01 X1.9140Y23.8901
G00 X1.9140Y23.8901
G01 Z-1.0000
G01 X1.9140Y44.5662
G01 X32.6240Y44.5662
G00 X32.6240Y44.5662
G01 Z-1.5000
G01 X1.9140Y44.5662
G01 X1.9140Y23.8901
G00 Z0.1000
G00 Z0.1000
G00 X0Y0
M05
