{
  "layout_5fd2fcaf11871": {
    "key": "layout_5fd2fcaf11871",
    "name": "counters",
    "label": "Counters",
    "display": "block",
    "sub_fields": [
      {
        "key": "field_5fd314bc766fh",
        "label": "Preview",
        "name": "",
        "type": "tab",
        "instructions": "",
        "required": 0,
        "conditional_logic": 0,
        "wrapper": {
          "width": "",
          "class": "",
          "id": ""
        },
        "placement": "top",
        "endpoint": 0
      },
      {
        "key": "field_5fd314bc766ee",
        "label": "Preview Image",
        "name": "",
        "type": "message",
        "instructions": "",
        "required": 0,
        "conditional_logic": 0,
        "wrapper": {
          "width": "",
          "class": "",
          "id": ""
        },
        "message": "<div class=\"js-custom-preview-block\" data-block=\"counters\"></div>",
        "new_lines": "wpautop",
        "esc_html": 0
      },
      {
        "key": "field_5fd314bc766ed",
        "label": "Content",
        "name": "",
        "type": "tab",
        "instructions": "",
        "required": 0,
        "conditional_logic": 0,
        "wrapper": {
          "width": "",
          "class": "",
          "id": ""
        },
        "placement": "top",
        "endpoint": 0
      },
      {
        "key": "field_5fkhoab9121df",
        "label": "Title",
        "name": "title",
        "type": "text",
        "instructions": "",
        "required": 0,
        "conditional_logic": 0,
        "wrapper": {
          "width": "",
          "class": "",
          "id": ""
        },
        "default_value": "",
        "placeholder": "",
        "prepend": "",
        "append": "",
        "maxlength": ""
      },
      {
        "key": "field_5fda5dhieu1af",
        "label": "Description",
        "name": "description",
        "type": "wysiwyg",
        "instructions": "",
        "required": 0,
        "conditional_logic": 0,
        "wrapper": {
          "width": "",
          "class": "",
          "id": ""
        },
        "default_value": "",
        "tabs": "all",
        "toolbar": "full",
        "media_upload": 0,
        "delay": 0
      },
      {
        "key": "field_5fd314bc766ef",
        "label": "Counters",
        "name": "counters",
        "type": "repeater",
        "instructions": "",
        "required": 1,
        "conditional_logic": 0,
        "wrapper": {
          "width": "",
          "class": "",
          "id": ""
        },
        "collapsed": "",
        "min": 0,
        "max": 6,
        "layout": "block",
        "button_label": "Add Item",
        "sub_fields": [
          {
            "key": "field_5fd314e84f628",
            "label": "Icon Type",
            "name": "icon_type",
            "type": "radio",
            "instructions": "",
            "required": 1,
            "conditional_logic": 0,
            "wrapper": {
              "width": "",
              "class": "",
              "id": ""
            },
            "choices": {
              "image": "Image",
              "svg": "SVG"
            },
            "allow_null": 0,
            "other_choice": 0,
            "default_value": "image",
            "layout": "horizontal",
            "return_format": "value",
            "save_other_choice": 0
          },
          {
            "key": "field_5fd314e84f629",
            "label": "SVG",
            "name": "icon_svg",
            "type": "textarea",
            "instructions": "Copy svg",
            "required": 0,
            "conditional_logic": [
              [
                {
                  "field": "field_5fd314e84f628",
                  "operator": "==",
                  "value": "svg"
                }
              ]
            ],
            "wrapper": {
              "width": "",
              "class": "",
              "id": ""
            },
            "return_format": "array",
            "preview_size": "medium",
            "library": "all",
            "min_width": "",
            "min_height": "",
            "min_size": "",
            "max_width": "",
            "max_height": "",
            "max_size": "",
            "mime_types": ""
          },
          {
            "key": "field_5fd314e84f630",
            "label": "Icon Image",
            "name": "icon_image",
            "type": "image",
            "instructions": "",
            "required": 0,
            "conditional_logic": [
              [
                {
                  "field": "field_5fd314e84f628",
                  "operator": "==",
                  "value": "image"
                }
              ]
            ],
            "wrapper": {
              "width": "",
              "class": "",
              "id": ""
            },
            "return_format": "array",
            "preview_size": "medium",
            "library": "all",
            "min_width": "",
            "min_height": "",
            "min_size": "",
            "max_width": "",
            "max_height": "",
            "max_size": "",
            "mime_types": ""
          },
          {
            "key": "field_counter5fd31f631",
            "label": "Count",
            "name": "count",
            "type": "number",
            "instructions": "",
            "required": 0,
            "conditional_logic": 0,
            "wrapper": {
              "width": "50",
              "class": "",
              "id": ""
            },
            "default_value": "",
            "placeholder": "",
            "prepend": "",
            "append": "",
            "min": "",
            "max": "",
            "step": ""
          },
          {
            "key": "field_5fd315624f632",
            "label": "Unit",
            "name": "unit",
            "type": "text",
            "instructions": "",
            "required": 0,
            "conditional_logic": 0,
            "wrapper": {
              "width": "50",
              "class": "",
              "id": ""
            },
            "default_value": "",
            "placeholder": "",
            "prepend": "",
            "append": "",
            "maxlength": ""
          },
          {
            "key": "field_5fd315704f633",
            "label": "Title",
            "name": "title",
            "type": "text",
            "instructions": "",
            "required": 0,
            "conditional_logic": 0,
            "wrapper": {
              "width": "50",
              "class": "",
              "id": ""
            },
            "default_value": "",
            "placeholder": "",
            "prepend": "",
            "append": "",
            "maxlength": ""
          },
          {
            "key": "field_5fd3157b4f634",
            "label": "Description",
            "name": "description",
            "type": "text",
            "instructions": "",
            "required": 0,
            "conditional_logic": 0,
            "wrapper": {
              "width": "50",
              "class": "",
              "id": ""
            },
            "default_value": "",
            "placeholder": "",
            "prepend": "",
            "append": "",
            "maxlength": ""
          }
        ]
      },
      {
        "key": "field_600fc66449eba",
        "label": "Settings",
        "name": "",
        "type": "tab",
        "instructions": "",
        "required": 0,
        "conditional_logic": 0,
        "wrapper": {
          "width": "",
          "class": "",
          "id": ""
        },
        "placement": "top",
        "endpoint": 0
      },
      {
        "key": "field_600fc66449ebb",
        "label": "Class",
        "name": "class",
        "type": "text",
        "instructions": "",
        "required": 0,
        "conditional_logic": 0,
        "wrapper": {
          "width": "25",
          "class": "",
          "id": ""
        },
        "default_value": "",
        "placeholder": "",
        "prepend": "",
        "append": "",
        "maxlength": ""
      },
      {
        "key": "field_600fc66749ebc",
        "label": "Anchor Name",
        "name": "anchor_name",
        "type": "text",
        "instructions": "",
        "required": 0,
        "conditional_logic": 0,
        "wrapper": {
          "width": "25",
          "class": "",
          "id": ""
        },
        "default_value": "",
        "placeholder": "",
        "prepend": "",
        "append": "",
        "maxlength": ""
      },
      {
        "key": "field_5fd3170a9e8c8",
        "label": "Background Type",
        "name": "background_type",
        "type": "select",
        "instructions": "",
        "required": 0,
        "conditional_logic": 0,
        "wrapper": {
          "width": "25",
          "class": "",
          "id": ""
        },
        "choices": {},
        "default_value": false,
        "allow_null": 0,
        "multiple": 0,
        "ui": 0,
        "return_format": "value",
        "ajax": 0,
        "placeholder": ""
      },
      {
        "key": "field_counters4a94a9",
        "label": "Background Contract",
        "name": "background_contract",
        "type": "select",
        "instructions": "",
        "required": 0,
        "conditional_logic": 0,
        "wrapper": {
          "width": "25",
          "class": "",
          "id": ""
        },
        "choices": {},
        "default_value": false,
        "allow_null": 0,
        "multiple": 0,
        "ui": 0,
        "return_format": "value",
        "ajax": 0,
        "placeholder": ""
      },
      {
        "key": "field_counters4a94g0",
        "label": "Background Image",
        "name": "background_image",
        "type": "image",
        "instructions": "",
        "required": 0,
        "conditional_logic": 0,
        "wrapper": {
          "width": "",
          "class": "",
          "id": ""
        },
        "return_format": "array",
        "preview_size": "medium",
        "library": "all",
        "min_width": "",
        "min_height": "",
        "min_size": "",
        "max_width": "",
        "max_height": "",
        "max_size": "",
        "mime_types": ""
      },
      {
        "key": "field_5fcdb85501f7e",
        "label": "Columns",
        "name": "columns",
        "type": "select",
        "instructions": "",
        "required": 1,
        "conditional_logic": "",
        "wrapper": {
          "width": "25",
          "class": "",
          "id": ""
        },
        "choices": {
          "2": "2 columns",
          "3": "3 columns",
          "4": "4 columns",
          "5": "5 columns",
          "6": "6 columns"
        },
        "allow_null": 0,
        "other_choice": 0,
        "default_value": "3",
        "layout": "horizontal",
        "return_format": "value",
        "save_other_choice": 0
      },
      {
        "key": "field_5fcdoi8386ebc",
        "label": "Header Alignment",
        "name": "header_alignment",
        "type": "select",
        "instructions": "",
        "required": 0,
        "conditional_logic": 0,
        "wrapper": {
          "width": "25",
          "class": "",
          "id": ""
        },
        "choices": {},
        "allow_null": 0,
        "other_choice": 0,
        "default_value": "center",
        "layout": "horizontal",
        "return_format": "value",
        "save_other_choice": 0
      },
      {
        "key": "field_5fd327ff799ac",
        "label": "Content Alignment",
        "name": "content_alignment",
        "type": "select",
        "instructions": "",
        "required": 0,
        "conditional_logic": 0,
        "wrapper": {
          "width": "25",
          "class": "",
          "id": ""
        },
        "choices": {},
        "allow_null": 0,
        "other_choice": 0,
        "default_value": "",
        "layout": "horizontal",
        "return_format": "value",
        "save_other_choice": 0
      },
      {
        "key": "field_5fthathao4db8",
        "label": "Item Layout",
        "name": "layout_items",
        "type": "select",
        "instructions": "",
        "required": 0,
        "conditional_logic": 0,
        "wrapper": {
          "width": "25",
          "class": "",
          "id": ""
        },
        "choices": {
          "row": "Left Number - Right Content",
          "column": "Top Number - Bottom Content"
        },
        "allow_null": 0,
        "other_choice": 0,
        "default_value": "column",
        "layout": "horizontal",
        "return_format": "value",
        "save_other_choice": 0
      }
    ],
    "min": "",
    "max": ""
  }
}
