__  __  __
\ \ \ \ \/
 \ \/\ \
  \/  \/

The humans.txt file explains the team, technology,
and graphic assets behind this site humanstxt.org.

_______________________________________________________________________________

DESIGNER | 

Dharmendra Boddeda
Hand crafted design & web development

Design tools:
Figma
Photoshop
Blender

twitter.com/dharmendramw
github.com/dharmendramw

_______________________________________________________________________________

TECHNOLOGY | テクノロジー

React
Next.js
Three.js
Framer Motion

_______________________________________________________________________________

FONTS | フォント

Gotham
Hiragino Kaku Gothic
