[
    {
        "identifier": "b9c0e2b9-d0ee-42c9-9076-9979092db086",
        "description": "Transfer funds - Nia Schimmel",
        "amount": -1688,
        "dateOfRequest": "2021-01-13 04:10:38"
    },
    {
        "identifier": "1c8c2d11-6c2b-4636-a07d-323fb453a28e",
        "description": "Transfer funds - Keith Harvey",
        "amount": -5047,
        "dateOfRequest": "2021-01-12 07:15:38"
    },
    {
        "identifier": "87845b0e-7295-47f3-beef-b6f9fa452833",
        "description": "Transfer funds - Dejah Sipes I",
        "amount": 7169,
        "dateOfRequest": "2021-01-11 08:28:38"
    },
    {
        "identifier": "016e0ab4-5e4f-45ab-9237-d08262e2f3d1",
        "description": "Transfer funds - Leif Lehner",
        "amount": -3164,
        "dateOfRequest": "2021-01-10 04:32:38"
    },
    {
        "identifier": "7d57bc92-59eb-4a1e-bf79-96466262ab1d",
        "description": "Transfer funds - Walker Ernser",
        "amount": -3327,
        "dateOfRequest": "2021-01-09 07:14:38"
    },
    {
        "identifier": "205c99b1-342b-4e0f-962d-16dcb10d2ca5",
        "description": "Transfer funds - Dr. Dayne Schulist",
        "amount": -335,
        "dateOfRequest": "2021-01-08 04:16:38"
    },
    {
        "identifier": "e340049f-5077-4c34-a79b-d5a630bb092d",
        "description": "Transfer funds - Maurine Flatley III",
        "amount": 113,
        "dateOfRequest": "2021-01-07 03:56:38"
    },
    {
        "identifier": "683dd72a-8f38-4da6-8e07-b417764f802d",
        "description": "Transfer funds - Cole Swaniawski",
        "amount": 6860,
        "dateOfRequest": "2021-01-06 11:55:38"
    },
    {
        "identifier": "dcc3d672-e5f9-4200-88ab-21547dfe5c52",
        "description": "Transfer funds - Henry Price",
        "amount": 1591,
        "dateOfRequest": "2021-01-05 09:49:38"
    },
    {
        "identifier": "f79744b1-29b7-4adc-bcd0-ab45c72d2005",
        "description": "Transfer funds - Ofelia Hoppe I",
        "amount": 5539,
        "dateOfRequest": "2021-01-04 09:14:38"
    },
    {
        "identifier": "a9c44b89-b79b-421b-a9f6-fd2f424f0204",
        "description": "Transfer funds - Armando Doyle",
        "amount": 4361,
        "dateOfRequest": "2021-01-03 09:46:38"
    },
    {
        "identifier": "ea4ebc97-2f0d-48b3-87ab-7f871ccb8304",
        "description": "Transfer funds - Kameron Dicki",
        "amount": 2104,
        "dateOfRequest": "2021-01-02 05:03:38"
    },
    {
        "identifier": "6727908a-8959-41f2-9d37-6129af2c1aaa",
        "description": "Transfer funds - Jacquelyn Russel",
        "amount": 5576,
        "dateOfRequest": "2021-01-01 07:31:38"
    },
    {
        "identifier": "870e0105-8572-462c-9bda-ec232d5c6996",
        "description": "Transfer funds - Miss Britney Klein Sr.",
        "amount": -1105,
        "dateOfRequest": "2020-12-31 11:02:38"
    },
    {
        "identifier": "3ed571f8-c2ae-4216-8b5b-21b491ae72c6",
        "description": "Transfer funds - Rogelio Zulauf",
        "amount": -5610,
        "dateOfRequest": "2020-12-30 10:17:38"
    },
    {
        "identifier": "097ca0ca-208d-4ea5-990f-ea30efca8ef9",
        "description": "Transfer funds - Mrs. Zoe Auer Sr.",
        "amount": -1367,
        "dateOfRequest": "2020-12-29 06:05:38"
    },
    {
        "identifier": "780627ad-dd9e-4170-83a2-8cadcbb9df39",
        "description": "Transfer funds - Eino Zboncak",
        "amount": 4502,
        "dateOfRequest": "2020-12-28 07:45:38"
    },
    {
        "identifier": "5151321a-a193-4231-9919-e5830429cd54",
        "description": "Transfer funds - Rusty Rohan",
        "amount": 3150,
        "dateOfRequest": "2020-12-27 04:01:38"
    },
    {
        "identifier": "92c1c997-387c-412e-9ae8-c541f4bbc8c9",
        "description": "Transfer funds - Antonette Homenick",
        "amount": -6167,
        "dateOfRequest": "2020-12-26 07:10:38"
    },
    {
        "identifier": "344f6595-b6c4-41cf-a6bd-863dccfed1a1",
        "description": "Transfer funds - Prof. Pansy Harvey III",
        "amount": 732,
        "dateOfRequest": "2020-12-25 12:10:38"
    },
    {
        "identifier": "938fea38-f918-406b-8357-c396e3f96d18",
        "description": "Transfer funds - Mrs. Alta Sporer PhD",
        "amount": -981,
        "dateOfRequest": "2020-12-24 07:49:38"
    },
    {
        "identifier": "167dd744-b0f9-4c6b-a077-2bbf969955c0",
        "description": "Transfer funds - Kylee Mertz",
        "amount": -3929,
        "dateOfRequest": "2020-12-23 09:35:38"
    },
    {
        "identifier": "6b4fe8cc-6f7c-434b-8dbe-ea0ee7011f37",
        "description": "Transfer funds - Ike Mayert",
        "amount": 6450,
        "dateOfRequest": "2020-12-22 06:52:38"
    },
    {
        "identifier": "546b4d7b-e371-453e-bd74-d395ebd99e45",
        "description": "Transfer funds - Kenny Hirthe DVM",
        "amount": 8293,
        "dateOfRequest": "2020-12-21 05:52:38"
    },
    {
        "identifier": "34c994ea-2cf0-4440-a0ac-290c755b901b",
        "description": "Transfer funds - Marques Dicki",
        "amount": 6395,
        "dateOfRequest": "2020-12-20 04:28:38"
    },
    {
        "identifier": "457f05a6-166e-4471-bd51-dd75d29cd22b",
        "description": "Transfer funds - Destiny Cummings",
        "amount": 7274,
        "dateOfRequest": "2020-12-19 06:10:38"
    },
    {
        "identifier": "00907c62-e4f9-4816-9d65-7d7dfd324700",
        "description": "Transfer funds - Prof. Percy Rodriguez",
        "amount": 8068,
        "dateOfRequest": "2020-12-18 10:07:38"
    },
    {
        "identifier": "03a38821-2f1f-4b50-bd69-2ef9f1248e3b",
        "description": "Transfer funds - Sylvan Little",
        "amount": -7311,
        "dateOfRequest": "2020-12-17 03:43:38"
    },
    {
        "identifier": "799e73e8-d105-4b86-9c33-7f5596dbe62e",
        "description": "Transfer funds - Prof. Jaron Zieme DDS",
        "amount": 8094,
        "dateOfRequest": "2020-12-16 08:18:38"
    },
    {
        "identifier": "b61f2ef9-2a45-41dd-9d36-e4d2f9c7739e",
        "description": "Transfer funds - Leopoldo Collins",
        "amount": 6038,
        "dateOfRequest": "2020-12-15 09:22:38"
    },
    {
        "identifier": "20fcdede-06e1-4a07-96a6-7839f4509d30",
        "description": "Transfer funds - Rollin Bernier",
        "amount": 8336,
        "dateOfRequest": "2020-12-14 04:07:38"
    },
    {
        "identifier": "82634360-df74-40c5-a15d-927853d1a4a7",
        "description": "Transfer funds - Jaylin Olson Jr.",
        "amount": 456,
        "dateOfRequest": "2020-12-13 05:46:38"
    },
    {
        "identifier": "ec066589-6988-4c00-ab74-0ba1f219c1da",
        "description": "Transfer funds - Ferne Farrell",
        "amount": -5733,
        "dateOfRequest": "2020-12-12 04:11:38"
    },
    {
        "identifier": "23afcac1-8868-4cf9-92da-f1ee2e6fa27d",
        "description": "Transfer funds - Mrs. Twila Hermann III",
        "amount": -2428,
        "dateOfRequest": "2020-12-11 04:48:38"
    },
    {
        "identifier": "a9ef3ead-67c5-42d9-ad1d-d4d7becacf00",
        "description": "Transfer funds - Ms. Eda Hudson PhD",
        "amount": 1643,
        "dateOfRequest": "2020-12-10 06:07:38"
    },
    {
        "identifier": "ae8843df-5396-4122-9ca3-387c6b2bebf4",
        "description": "Transfer funds - Gabe Sanford",
        "amount": -7465,
        "dateOfRequest": "2020-12-09 03:48:38"
    },
    {
        "identifier": "ec3569a7-5a12-4344-996c-88d852409f86",
        "description": "Transfer funds - Kailyn Bode",
        "amount": 9403,
        "dateOfRequest": "2020-12-08 10:32:38"
    },
    {
        "identifier": "4ff82e19-e17e-4520-8c12-f308b328ba65",
        "description": "Transfer funds - Ms. Aubrey Goodwin",
        "amount": -1301,
        "dateOfRequest": "2020-12-07 11:12:38"
    },
    {
        "identifier": "da25377a-5e65-4087-95d3-89020b9800e1",
        "description": "Transfer funds - Aglae Aufderhar",
        "amount": 6577,
        "dateOfRequest": "2020-12-06 03:35:38"
    },
    {
        "identifier": "66be40a1-3100-4174-b7c3-c332e1f69610",
        "description": "Transfer funds - Alexa Hyatt",
        "amount": 6463,
        "dateOfRequest": "2020-12-05 10:47:38"
    },
    {
        "identifier": "b7e93015-587f-4862-a4c7-efdf1729e262",
        "description": "Transfer funds - Prof. Greta Howe I",
        "amount": -6862,
        "dateOfRequest": "2020-12-04 09:33:38"
    },
    {
        "identifier": "c1319c8b-4de2-4863-8e12-3969121e76e4",
        "description": "Transfer funds - Louisa Douglas",
        "amount": 764,
        "dateOfRequest": "2020-12-03 10:40:38"
    },
    {
        "identifier": "9a45be29-9e31-4d40-b550-d471cece4415",
        "description": "Transfer funds - Prof. Valentin Hudson",
        "amount": -4617,
        "dateOfRequest": "2020-12-02 06:34:38"
    },
    {
        "identifier": "c005c673-e5be-4ad3-a63e-70ebae5b2e5c",
        "description": "Transfer funds - Mr. Salvador Strosin DDS",
        "amount": 5743,
        "dateOfRequest": "2020-12-01 09:16:38"
    },
    {
        "identifier": "f9da6a4e-f278-4797-8cc0-af6248ce6274",
        "description": "Transfer funds - Eudora Swift",
        "amount": -1598,
        "dateOfRequest": "2020-11-30 04:35:38"
    },
    {
        "identifier": "8a6a0b10-bf88-4c5d-84fa-5ae07116132b",
        "description": "Transfer funds - Sandrine Blick",
        "amount": -7554,
        "dateOfRequest": "2020-11-29 07:32:38"
    },
    {
        "identifier": "21807778-83ca-41da-9873-c0e1e19e21c1",
        "description": "Transfer funds - Karolann Mertz",
        "amount": 693,
        "dateOfRequest": "2020-11-28 03:31:38"
    },
    {
        "identifier": "2acc4f86-f8b9-4d87-b087-2d2cae25da49",
        "description": "Transfer funds - Monserrate Zboncak",
        "amount": -6402,
        "dateOfRequest": "2020-11-27 07:17:38"
    },
    {
        "identifier": "97b6f618-505d-4cef-8498-61a8d90c8235",
        "description": "Transfer funds - Dr. Maud Smitham DVM",
        "amount": -6986,
        "dateOfRequest": "2020-11-26 06:04:38"
    },
    {
        "identifier": "731c43da-eb03-4bdb-bd56-21868c4ead87",
        "description": "Transfer funds - Prof. Joel Swift",
        "amount": -9762,
        "dateOfRequest": "2020-11-25 04:31:38"
    },
    {
        "identifier": "2db87fb4-feab-47ca-a26d-94f3830773b9",
        "description": "Transfer funds - Domenico Runte",
        "amount": 4096,
        "dateOfRequest": "2021-01-13 08:36:38"
    },
    {
        "identifier": "356fe100-0813-48f5-b6af-df369649c132",
        "description": "Transfer funds - Alvera Aufderhar II",
        "amount": 9203,
        "dateOfRequest": "2021-01-12 04:03:38"
    },
    {
        "identifier": "c60433d0-2c74-4e17-a2d1-8efade072798",
        "description": "Transfer funds - Ilene Schulist",
        "amount": -3976,
        "dateOfRequest": "2021-01-11 08:12:38"
    },
    {
        "identifier": "f28d9f85-429f-4ffd-8d6a-702fe4a0ee4c",
        "description": "Transfer funds - Edna Grant",
        "amount": -8098,
        "dateOfRequest": "2021-01-10 11:45:38"
    },
    {
        "identifier": "b773a36d-7860-411d-a107-e7712db6755a",
        "description": "Transfer funds - Immanuel Murray V",
        "amount": -2717,
        "dateOfRequest": "2021-01-09 07:46:38"
    },
    {
        "identifier": "8fa73129-1ab7-45cb-8084-5355a52c2015",
        "description": "Transfer funds - Priscilla King",
        "amount": -555,
        "dateOfRequest": "2021-01-08 06:35:38"
    },
    {
        "identifier": "dd4f0b5c-a263-47fd-bc80-0414f64ed46b",
        "description": "Transfer funds - Sidney Fadel",
        "amount": 40,
        "dateOfRequest": "2021-01-07 03:39:38"
    },
    {
        "identifier": "087bdb26-36f4-4bbd-b211-5a61da7305af",
        "description": "Transfer funds - Frida Herman",
        "amount": -7837,
        "dateOfRequest": "2021-01-06 12:14:38"
    },
    {
        "identifier": "d80d3da9-51f0-4f0b-961f-7e268fb56a17",
        "description": "Transfer funds - Henry Kihn II",
        "amount": -4979,
        "dateOfRequest": "2021-01-05 09:37:38"
    },
    {
        "identifier": "c6d171b3-edbf-462d-ae84-787766948e73",
        "description": "Transfer funds - Lucius Weissnat DVM",
        "amount": 735,
        "dateOfRequest": "2021-01-04 07:00:38"
    },
    {
        "identifier": "400518ce-df74-4b0b-a8e4-4cb6e514b02c",
        "description": "Transfer funds - Camden Bauch",
        "amount": 8336,
        "dateOfRequest": "2021-01-03 09:34:38"
    },
    {
        "identifier": "72679401-68a7-4e0f-a065-429721b503a0",
        "description": "Transfer funds - Prof. Jessy Lowe",
        "amount": 7418,
        "dateOfRequest": "2021-01-02 08:15:38"
    },
    {
        "identifier": "9bbe8c74-6399-43b6-8de1-5fa8043f966a",
        "description": "Transfer funds - Tressa Blanda",
        "amount": -6639,
        "dateOfRequest": "2021-01-01 09:44:38"
    },
    {
        "identifier": "6a84effe-43b8-4f71-b3e5-122281940cd4",
        "description": "Transfer funds - Miss Rosina Rolfson Jr.",
        "amount": -3383,
        "dateOfRequest": "2020-12-31 07:50:38"
    },
    {
        "identifier": "8ec9829d-987b-4d37-bffa-99370947e616",
        "description": "Transfer funds - Prof. Marcel Monahan",
        "amount": -3449,
        "dateOfRequest": "2020-12-30 09:45:38"
    },
    {
        "identifier": "4123fc12-5891-491c-b664-072fd66a9af7",
        "description": "Transfer funds - Emmie Swift",
        "amount": 4857,
        "dateOfRequest": "2020-12-29 07:00:38"
    },
    {
        "identifier": "84399567-4630-4b46-813a-c719d115b142",
        "description": "Transfer funds - Lexus Tromp",
        "amount": -8478,
        "dateOfRequest": "2020-12-28 10:09:38"
    },
    {
        "identifier": "5d9c46a5-0d96-428c-8bce-65dc3dbf5a4a",
        "description": "Transfer funds - Faye Nikolaus",
        "amount": -4050,
        "dateOfRequest": "2020-12-27 10:01:38"
    },
    {
        "identifier": "6493778e-7124-486a-b9e5-9b743f96e923",
        "description": "Transfer funds - Ellsworth McClure",
        "amount": -3723,
        "dateOfRequest": "2020-12-26 08:15:38"
    },
    {
        "identifier": "2bf028de-6843-4f64-933a-62266c7972af",
        "description": "Transfer funds - Mr. Abner Hodkiewicz",
        "amount": -1413,
        "dateOfRequest": "2020-12-25 07:12:38"
    },
    {
        "identifier": "1393d999-b9e4-4855-bb3b-f4fe98ba9000",
        "description": "Transfer funds - Bette Hartmann",
        "amount": 4300,
        "dateOfRequest": "2020-12-24 06:30:38"
    },
    {
        "identifier": "0b941254-69e1-42ae-9f84-0a4e7ea1a3eb",
        "description": "Transfer funds - Tracy Yost",
        "amount": 1513,
        "dateOfRequest": "2020-12-23 05:58:38"
    },
    {
        "identifier": "48bd1fd6-4faa-4452-8910-78f3eb134b0c",
        "description": "Transfer funds - Kasey Leffler",
        "amount": 3933,
        "dateOfRequest": "2020-12-22 08:49:38"
    },
    {
        "identifier": "90ef0d23-f0c9-4709-bf13-b3c67cb80e26",
        "description": "Transfer funds - Cyrus Crooks IV",
        "amount": 2625,
        "dateOfRequest": "2020-12-21 11:32:38"
    },
    {
        "identifier": "837d310b-c47f-46d0-be7a-7561cc80b87b",
        "description": "Transfer funds - Rico Schneider",
        "amount": -8290,
        "dateOfRequest": "2020-12-20 06:06:38"
    },
    {
        "identifier": "dc85cba7-8a62-473c-9fb6-ce92ae4c6893",
        "description": "Transfer funds - Rubye Gusikowski DDS",
        "amount": -7754,
        "dateOfRequest": "2020-12-19 09:01:38"
    },
    {
        "identifier": "b402d5be-8ecc-4ceb-8959-735b2a4b22d4",
        "description": "Transfer funds - Stefanie Goyette",
        "amount": 5513,
        "dateOfRequest": "2020-12-18 08:03:38"
    },
    {
        "identifier": "bdc47831-4716-456c-b506-01067c2d43e7",
        "description": "Transfer funds - Dylan Schulist",
        "amount": 1696,
        "dateOfRequest": "2020-12-17 05:44:38"
    },
    {
        "identifier": "3dec4a29-cff0-4e40-9d69-216e148f9609",
        "description": "Transfer funds - Eileen Hickle",
        "amount": 9941,
        "dateOfRequest": "2020-12-16 09:57:38"
    },
    {
        "identifier": "d7800e61-c638-4d49-af99-4a2cf1359afc",
        "description": "Transfer funds - Kamryn Hayes III",
        "amount": -281,
        "dateOfRequest": "2020-12-15 08:52:38"
    },
    {
        "identifier": "e7ae9f29-4f8a-47fe-84e1-69aec4eac48d",
        "description": "Transfer funds - Cara Gaylord V",
        "amount": 5238,
        "dateOfRequest": "2020-12-14 06:16:38"
    },
    {
        "identifier": "3f662f18-3167-4aec-988a-8f7dfe2d4dc3",
        "description": "Transfer funds - Garrick O'Hara",
        "amount": -5539,
        "dateOfRequest": "2020-12-13 04:37:38"
    },
    {
        "identifier": "ac63aed2-f1e8-4b65-9c0e-e1c815696fa6",
        "description": "Transfer funds - Vicenta Spinka",
        "amount": 934,
        "dateOfRequest": "2020-12-12 06:50:38"
    },
    {
        "identifier": "fb151039-0608-4dac-b908-e44c8e2539eb",
        "description": "Transfer funds - Murray Jacobson PhD",
        "amount": -8563,
        "dateOfRequest": "2020-12-11 04:10:38"
    },
    {
        "identifier": "557ac002-fda2-419e-bcb9-c1dfb36f9938",
        "description": "Transfer funds - Mrs. Berenice Corwin Jr.",
        "amount": 9882,
        "dateOfRequest": "2020-12-10 06:45:38"
    },
    {
        "identifier": "92196165-90b9-407c-8a2e-e28150301685",
        "description": "Transfer funds - Lonie Wiza",
        "amount": 8955,
        "dateOfRequest": "2020-12-09 03:39:38"
    },
    {
        "identifier": "9ab0beb5-e212-4be9-8d0a-db9f86f3a169",
        "description": "Transfer funds - Myrl Wunsch",
        "amount": 3739,
        "dateOfRequest": "2020-12-08 11:03:38"
    },
    {
        "identifier": "36a57f26-3dd0-47bc-a151-c19bf28b5215",
        "description": "Transfer funds - Prof. Jamaal Lang Jr.",
        "amount": -9995,
        "dateOfRequest": "2020-12-07 06:58:38"
    },
    {
        "identifier": "e16a919e-fc83-4d6c-9970-05cbdbe278be",
        "description": "Transfer funds - Gustave Jenkins",
        "amount": -1776,
        "dateOfRequest": "2020-12-06 07:41:38"
    },
    {
        "identifier": "f9cef162-c0ff-407d-8f40-3345a30e4d9d",
        "description": "Transfer funds - Prof. Heloise Frami",
        "amount": 2948,
        "dateOfRequest": "2020-12-05 05:35:38"
    },
    {
        "identifier": "387667f2-2701-4472-a4fc-1d27ec460e7d",
        "description": "Transfer funds - Gust Graham",
        "amount": -3924,
        "dateOfRequest": "2020-12-04 05:12:38"
    },
    {
        "identifier": "dccf4a16-fcfb-4868-bd90-e5bb1affd654",
        "description": "Transfer funds - Miss Heloise Quitzon DVM",
        "amount": -2331,
        "dateOfRequest": "2020-12-03 11:42:38"
    },
    {
        "identifier": "ca948c0f-1ad4-4e76-bf9b-7a60d491fb25",
        "description": "Transfer funds - Leland Cruickshank",
        "amount": -1136,
        "dateOfRequest": "2020-12-02 07:37:38"
    },
    {
        "identifier": "c1da8908-b848-4c9e-a478-f4676f6f9f70",
        "description": "Transfer funds - Carol Crist DVM",
        "amount": 8816,
        "dateOfRequest": "2020-12-01 09:45:38"
    },
    {
        "identifier": "5a2e54ab-5a0a-43cf-a731-198b13b3a2e3",
        "description": "Transfer funds - Prof. Laurence Metz",
        "amount": -5207,
        "dateOfRequest": "2020-11-30 05:22:38"
    },
    {
        "identifier": "32017548-728d-46cf-b2e7-4de659463b6d",
        "description": "Transfer funds - Prof. Eliseo Ledner",
        "amount": -5803,
        "dateOfRequest": "2020-11-29 08:14:38"
    },
    {
        "identifier": "f3318404-5f04-464b-920e-0eaa086576a8",
        "description": "Transfer funds - Geovanni McClure",
        "amount": -9609,
        "dateOfRequest": "2020-11-28 04:16:38"
    },
    {
        "identifier": "002c1b3a-ede1-4fce-9acf-403976cbee9e",
        "description": "Transfer funds - Ms. Dandre Upton",
        "amount": 2882,
        "dateOfRequest": "2020-11-27 06:03:38"
    },
    {
        "identifier": "a0021342-8ba0-48b6-b962-46cf0390842f",
        "description": "Transfer funds - Beulah Feest DDS",
        "amount": 1393,
        "dateOfRequest": "2020-11-26 06:14:38"
    },
    {
        "identifier": "e620d2be-0868-4287-9528-dafc43dabab9",
        "description": "Transfer funds - Lilla Franecki",
        "amount": -3933,
        "dateOfRequest": "2020-11-25 08:45:38"
    },
    {
        "identifier": "9affb0b3-951c-45ff-ad4a-d65e36fc8ffd",
        "description": "Transfer funds - Dr. Jerry Schinner",
        "amount": 609,
        "dateOfRequest": "2021-01-13 04:53:38"
    },
    {
        "identifier": "ffcc42b0-a19e-47b2-8ace-e57acafa6472",
        "description": "Transfer funds - Ms. Peggie Mohr",
        "amount": 8670,
        "dateOfRequest": "2021-01-12 07:48:38"
    },
    {
        "identifier": "d079fa2d-9e22-41ca-a262-0f27f2ecf9ac",
        "description": "Transfer funds - Blair Hartmann",
        "amount": -4981,
        "dateOfRequest": "2021-01-11 03:48:38"
    },
    {
        "identifier": "61c00354-8415-48d6-b8c9-952ece2f6a6d",
        "description": "Transfer funds - Bianka Hodkiewicz Sr.",
        "amount": 8529,
        "dateOfRequest": "2021-01-10 04:31:38"
    },
    {
        "identifier": "7e32a4eb-9983-477a-9e01-9eb5a53e383e",
        "description": "Transfer funds - Mr. Grant Kuvalis",
        "amount": -9289,
        "dateOfRequest": "2021-01-09 05:42:38"
    },
    {
        "identifier": "041c677e-2160-42ef-bde6-0a8c670fb79a",
        "description": "Transfer funds - Earnestine King III",
        "amount": -8934,
        "dateOfRequest": "2021-01-08 04:55:38"
    },
    {
        "identifier": "478cfd42-bfff-4210-a770-e439f5d6c6da",
        "description": "Transfer funds - Breanna Sauer",
        "amount": 8971,
        "dateOfRequest": "2021-01-07 08:19:38"
    },
    {
        "identifier": "90cdcc6b-b11a-4c91-9a7c-dceb6aa7eb26",
        "description": "Transfer funds - Mrs. Nikki Parisian Jr.",
        "amount": -6267,
        "dateOfRequest": "2021-01-06 05:56:38"
    },
    {
        "identifier": "e62cd723-f37c-48cc-9886-f2210d5b59de",
        "description": "Transfer funds - Mrs. Larissa Roberts V",
        "amount": 2423,
        "dateOfRequest": "2021-01-05 03:52:38"
    },
    {
        "identifier": "9c3b08ab-3006-4946-a13b-4b67adc9dcf0",
        "description": "Transfer funds - Wilfrid Tillman",
        "amount": 4688,
        "dateOfRequest": "2021-01-04 04:00:38"
    },
    {
        "identifier": "459c9efd-c1a4-4ec9-8cf6-fa3e1f9a02da",
        "description": "Transfer funds - Okey Considine",
        "amount": -3119,
        "dateOfRequest": "2021-01-03 08:32:38"
    },
    {
        "identifier": "4d8fec81-bc26-4943-b90e-4f09e819d4c1",
        "description": "Transfer funds - Brooklyn Smith",
        "amount": -3809,
        "dateOfRequest": "2021-01-02 11:10:38"
    },
    {
        "identifier": "92ac8150-4002-4ce9-a346-4eed0bd84bb6",
        "description": "Transfer funds - Cathrine Windler",
        "amount": -70,
        "dateOfRequest": "2021-01-01 07:42:38"
    },
    {
        "identifier": "399eec06-e00e-4c5c-8a53-0047d2da3c26",
        "description": "Transfer funds - Judy Batz",
        "amount": 8493,
        "dateOfRequest": "2020-12-31 12:08:38"
    },
    {
        "identifier": "9f8c7439-b322-46a2-92b7-6ec5cf494fe1",
        "description": "Transfer funds - Cale Glover",
        "amount": 9030,
        "dateOfRequest": "2020-12-30 03:42:38"
    },
    {
        "identifier": "1d3227c7-39e6-4460-acac-084d410a0947",
        "description": "Transfer funds - Mrs. Celestine Konopelski",
        "amount": -3187,
        "dateOfRequest": "2020-12-29 10:39:38"
    },
    {
        "identifier": "eb7bdf41-256d-48b2-912c-a31a9da104f9",
        "description": "Transfer funds - Muhammad Lebsack",
        "amount": -596,
        "dateOfRequest": "2020-12-28 09:41:38"
    },
    {
        "identifier": "9c38e6bb-17c1-411e-b1db-287254661f9d",
        "description": "Transfer funds - Mrs. Alverta Bednar",
        "amount": 1473,
        "dateOfRequest": "2020-12-27 07:44:38"
    },
    {
        "identifier": "50f3808a-1ca8-47ff-a0ac-948c3061703e",
        "description": "Transfer funds - Mr. Dallin Will",
        "amount": -1577,
        "dateOfRequest": "2020-12-26 05:19:38"
    },
    {
        "identifier": "1068a964-5ab8-45d6-99ce-5e2edf5f04df",
        "description": "Transfer funds - Mr. Xander Block",
        "amount": 2156,
        "dateOfRequest": "2020-12-25 06:21:38"
    },
    {
        "identifier": "e22e0f8b-97c4-490d-9df2-bcafe13de616",
        "description": "Transfer funds - Rosalind Klocko",
        "amount": 7182,
        "dateOfRequest": "2020-12-24 08:57:38"
    },
    {
        "identifier": "1969b9e7-4929-4068-992d-15b181330bbf",
        "description": "Transfer funds - Kristin Dietrich",
        "amount": 9156,
        "dateOfRequest": "2020-12-23 09:11:38"
    },
    {
        "identifier": "086c2cea-3fb9-47da-a7c9-94b3157093de",
        "description": "Transfer funds - Nikita Stark",
        "amount": -6471,
        "dateOfRequest": "2020-12-22 06:28:38"
    },
    {
        "identifier": "b453f7e3-25e3-4e0a-88a8-dafe46da483a",
        "description": "Transfer funds - Nikita Klein",
        "amount": -3284,
        "dateOfRequest": "2020-12-21 06:20:38"
    },
    {
        "identifier": "bc8c4c75-8221-440a-b901-43b0f2d8ebb4",
        "description": "Transfer funds - Bud Mueller",
        "amount": 581,
        "dateOfRequest": "2020-12-20 08:07:38"
    },
    {
        "identifier": "a0bd9f05-aadc-4b61-8786-da5085687678",
        "description": "Transfer funds - Prof. Deonte Bosco Jr.",
        "amount": 2931,
        "dateOfRequest": "2020-12-19 09:01:38"
    },
    {
        "identifier": "5d954c47-bad7-4d4a-b4f7-d66b09f5c652",
        "description": "Transfer funds - Eloy Hickle",
        "amount": -6265,
        "dateOfRequest": "2020-12-18 10:11:38"
    },
    {
        "identifier": "624bde49-1a8f-46a5-af1e-332a3a93f0d9",
        "description": "Transfer funds - Cristina Hagenes",
        "amount": 5632,
        "dateOfRequest": "2020-12-17 11:21:38"
    },
    {
        "identifier": "ad9099d3-8f79-4edf-9063-92823087a6db",
        "description": "Transfer funds - Moses Thompson",
        "amount": -7924,
        "dateOfRequest": "2020-12-16 04:10:38"
    },
    {
        "identifier": "20c183e1-6cfb-4d16-8fcc-bf4044f2163d",
        "description": "Transfer funds - Prof. Filiberto Medhurst",
        "amount": 3262,
        "dateOfRequest": "2020-12-15 12:09:38"
    },
    {
        "identifier": "8a77cee0-1184-4ba8-93be-742f48ccc253",
        "description": "Transfer funds - Oma Torphy",
        "amount": 9248,
        "dateOfRequest": "2020-12-14 09:34:38"
    },
    {
        "identifier": "ad18fc80-fcd9-40ff-8f9a-1f52ba9e9687",
        "description": "Transfer funds - Darby Mohr",
        "amount": -7771,
        "dateOfRequest": "2020-12-13 05:52:38"
    },
    {
        "identifier": "1d030c36-c129-4c06-8994-6043fb426345",
        "description": "Transfer funds - Mabelle Keebler",
        "amount": 4595,
        "dateOfRequest": "2020-12-12 09:43:38"
    },
    {
        "identifier": "4ec2a99c-41a0-443d-901d-a0e7abf86e1c",
        "description": "Transfer funds - Franz Kertzmann",
        "amount": 9538,
        "dateOfRequest": "2020-12-11 07:37:38"
    },
    {
        "identifier": "25ea6348-1f87-4a81-bf48-8f078e9eb4d2",
        "description": "Transfer funds - Evalyn Rolfson",
        "amount": -2684,
        "dateOfRequest": "2020-12-10 03:34:38"
    },
    {
        "identifier": "18069c61-ba41-4a70-9054-77e2d6788794",
        "description": "Transfer funds - Violette Cartwright",
        "amount": 1669,
        "dateOfRequest": "2020-12-09 11:44:38"
    },
    {
        "identifier": "179f90a4-a0ff-4b13-8af0-039076205053",
        "description": "Transfer funds - Dr. Claud Abernathy",
        "amount": 100,
        "dateOfRequest": "2020-12-08 06:14:38"
    },
    {
        "identifier": "8352909f-32e9-4519-8fbd-9387132d43b5",
        "description": "Transfer funds - Talon Halvorson",
        "amount": 7717,
        "dateOfRequest": "2020-12-07 11:36:38"
    },
    {
        "identifier": "c3380b6f-ae74-4aa4-a9fb-8c031cb376de",
        "description": "Transfer funds - Loren Bernhard",
        "amount": 2501,
        "dateOfRequest": "2020-12-06 05:13:38"
    },
    {
        "identifier": "95d11d64-6776-449c-8130-c623d1972f45",
        "description": "Transfer funds - Miss Justine Bogisich V",
        "amount": -6385,
        "dateOfRequest": "2020-12-05 09:01:38"
    },
    {
        "identifier": "b99085a7-9f62-4993-ad2a-dcb5da91e71b",
        "description": "Transfer funds - Nikita Witting",
        "amount": -1588,
        "dateOfRequest": "2020-12-04 07:42:38"
    },
    {
        "identifier": "54efa877-5ecb-4316-8006-1864fe3f2d64",
        "description": "Transfer funds - Chadrick Baumbach",
        "amount": 7507,
        "dateOfRequest": "2020-12-03 07:37:38"
    },
    {
        "identifier": "6c5bf221-5753-4c1d-9f1a-8cce99b64240",
        "description": "Transfer funds - Justyn Harvey",
        "amount": -613,
        "dateOfRequest": "2020-12-02 10:41:38"
    },
    {
        "identifier": "8886cfb6-6f47-4952-b6cd-f87372a12dbf",
        "description": "Transfer funds - Dr. Nicklaus Kozey",
        "amount": 4143,
        "dateOfRequest": "2020-12-01 09:40:38"
    },
    {
        "identifier": "43af0b9c-4abd-498f-af80-3c8df0746a5a",
        "description": "Transfer funds - Grover Grant",
        "amount": 8597,
        "dateOfRequest": "2020-11-30 04:31:38"
    },
    {
        "identifier": "556051b7-4093-46f2-8a81-fc6d23549ae1",
        "description": "Transfer funds - Laurianne O'Hara",
        "amount": 9364,
        "dateOfRequest": "2020-11-29 04:29:38"
    },
    {
        "identifier": "8c9f5869-f65d-434e-9892-fd29df18ebac",
        "description": "Transfer funds - Dameon O'Kon",
        "amount": 3315,
        "dateOfRequest": "2020-11-28 06:39:38"
    },
    {
        "identifier": "d12234d5-4cd2-47e2-9d72-cdb20907bfe4",
        "description": "Transfer funds - Prof. Erick Gaylord DDS",
        "amount": -1538,
        "dateOfRequest": "2020-11-27 07:34:38"
    },
    {
        "identifier": "b276ade7-345a-48ee-b408-7ca653ae12a1",
        "description": "Transfer funds - Wyatt Lockman MD",
        "amount": 687,
        "dateOfRequest": "2020-11-26 12:16:38"
    },
    {
        "identifier": "3f3f2c50-5d7c-4eeb-b504-4aa5acf67009",
        "description": "Transfer funds - Lula O'Hara",
        "amount": 210,
        "dateOfRequest": "2020-11-25 07:39:38"
    },
    {
        "identifier": "83b44a0a-8ff0-4d71-ac5c-5f654a566370",
        "description": "Transfer funds - Dr. Carley Lang V",
        "amount": -6169,
        "dateOfRequest": "2021-01-13 09:07:38"
    },
    {
        "identifier": "b4122068-2e89-4065-b447-cb858f6678bd",
        "description": "Transfer funds - Dr. Elta Hackett",
        "amount": -8346,
        "dateOfRequest": "2021-01-12 04:04:38"
    },
    {
        "identifier": "23a748cc-f6d6-41fd-b990-df30b8e65beb",
        "description": "Transfer funds - Mrs. Aisha Kihn II",
        "amount": 9391,
        "dateOfRequest": "2021-01-11 03:46:38"
    },
    {
        "identifier": "24825c5b-e0ed-4d7a-bf56-39ec14e0caca",
        "description": "Transfer funds - Kurtis Moore Jr.",
        "amount": -9546,
        "dateOfRequest": "2021-01-10 07:00:38"
    },
    {
        "identifier": "5bbf6cef-d331-43ce-91c8-61235f012e52",
        "description": "Transfer funds - Milton Auer",
        "amount": 4122,
        "dateOfRequest": "2021-01-09 04:20:38"
    },
    {
        "identifier": "9be9609f-e966-4b2a-b62a-b80414a1cc7e",
        "description": "Transfer funds - Dr. Judy Gutmann V",
        "amount": 4166,
        "dateOfRequest": "2021-01-08 08:29:38"
    },
    {
        "identifier": "bab168cf-c21c-4335-ab43-e7468d3eeaff",
        "description": "Transfer funds - Alberta Gleichner",
        "amount": 2022,
        "dateOfRequest": "2021-01-07 10:09:38"
    },
    {
        "identifier": "af8ab9cf-264b-49c2-b8ab-1e9da513878c",
        "description": "Transfer funds - Elvera Marquardt DVM",
        "amount": -3983,
        "dateOfRequest": "2021-01-06 03:52:38"
    },
    {
        "identifier": "c77be8cb-4072-4902-bfef-31c5a9eed9d7",
        "description": "Transfer funds - Dr. Alba Collins PhD",
        "amount": 5862,
        "dateOfRequest": "2021-01-05 04:03:38"
    },
    {
        "identifier": "a3ad431b-10f2-4ff1-9588-9e877e1b0803",
        "description": "Transfer funds - Stacey Donnelly DDS",
        "amount": -9230,
        "dateOfRequest": "2021-01-04 09:04:38"
    },
    {
        "identifier": "d77d939d-9fcb-40f8-b8d6-1402b4094e60",
        "description": "Transfer funds - Jack Friesen PhD",
        "amount": -6349,
        "dateOfRequest": "2021-01-03 07:58:38"
    },
    {
        "identifier": "bbf0ad38-8f5f-4ec9-aec6-633bb63d0e1a",
        "description": "Transfer funds - Davonte Yost",
        "amount": -3958,
        "dateOfRequest": "2021-01-02 07:40:38"
    },
    {
        "identifier": "a922db58-aab7-4067-8048-4d71fad2762c",
        "description": "Transfer funds - Cody Stokes",
        "amount": 1566,
        "dateOfRequest": "2021-01-01 08:51:38"
    },
    {
        "identifier": "c5f7ed24-f81d-421e-bc44-1dc70482f3b3",
        "description": "Transfer funds - Brian Volkman",
        "amount": 7865,
        "dateOfRequest": "2020-12-31 06:12:38"
    },
    {
        "identifier": "299b1f69-33e0-4343-b201-84b48bef3df8",
        "description": "Transfer funds - Prof. Alize Moore I",
        "amount": -6820,
        "dateOfRequest": "2020-12-30 06:00:38"
    },
    {
        "identifier": "3da57dfc-4c56-47c6-9f5c-0873be90b3ff",
        "description": "Transfer funds - Isobel Miller",
        "amount": 7164,
        "dateOfRequest": "2020-12-29 11:34:38"
    },
    {
        "identifier": "ecd4e4da-e032-406f-a1f1-ee718a148d60",
        "description": "Transfer funds - Mr. Jamel Hermiston II",
        "amount": -6604,
        "dateOfRequest": "2020-12-28 09:58:38"
    },
    {
        "identifier": "ae1a9555-bf3a-427d-87f5-5bf00a7a9ea5",
        "description": "Transfer funds - Mr. Kameron Flatley Sr.",
        "amount": -3382,
        "dateOfRequest": "2020-12-27 12:13:38"
    },
    {
        "identifier": "b7134623-e993-435d-ba08-bed1bcdbf158",
        "description": "Transfer funds - Jaime Nikolaus",
        "amount": -555,
        "dateOfRequest": "2020-12-26 09:38:38"
    },
    {
        "identifier": "ba6d5263-0edb-45b9-9c96-1aec44b22fbc",
        "description": "Transfer funds - Rozella Schuppe",
        "amount": -6550,
        "dateOfRequest": "2020-12-25 06:37:38"
    },
    {
        "identifier": "452254bf-609a-43d8-a743-a07bac5b75b6",
        "description": "Transfer funds - Vita Muller",
        "amount": -3545,
        "dateOfRequest": "2020-12-24 08:51:38"
    },
    {
        "identifier": "48b7fb20-dff5-45d0-afc3-c58799f25e66",
        "description": "Transfer funds - Dr. Julius Sporer",
        "amount": 2523,
        "dateOfRequest": "2020-12-23 03:43:38"
    },
    {
        "identifier": "6a5321f5-3b1d-498c-b7c2-743a4bb0ed75",
        "description": "Transfer funds - Jefferey Dickinson",
        "amount": -9406,
        "dateOfRequest": "2020-12-22 10:01:38"
    },
    {
        "identifier": "4449ae94-769d-48bc-b239-dc14b8b1e61b",
        "description": "Transfer funds - Coralie Ullrich",
        "amount": -6695,
        "dateOfRequest": "2020-12-21 06:20:38"
    },
    {
        "identifier": "33e51d9e-2838-4690-b4f8-4dc415c18a29",
        "description": "Transfer funds - Kristina Kirlin",
        "amount": -5678,
        "dateOfRequest": "2020-12-20 06:33:38"
    },
    {
        "identifier": "ca4dae4f-3f11-4401-9a25-9a78eccf506e",
        "description": "Transfer funds - Leilani Douglas II",
        "amount": 9649,
        "dateOfRequest": "2020-12-19 07:32:38"
    },
    {
        "identifier": "4b2940b8-5756-42af-9379-c9b5e48654fe",
        "description": "Transfer funds - Dr. Dominic Muller",
        "amount": -5736,
        "dateOfRequest": "2020-12-18 03:45:38"
    },
    {
        "identifier": "e91a3217-d011-4849-aa3a-ecfc54d69a81",
        "description": "Transfer funds - Mrs. Sunny Luettgen III",
        "amount": -3522,
        "dateOfRequest": "2020-12-17 10:59:38"
    },
    {
        "identifier": "f6dbaec3-ab0d-4bb0-9b23-1fa7d2dcd8c7",
        "description": "Transfer funds - Herta Towne",
        "amount": -9807,
        "dateOfRequest": "2020-12-16 06:55:38"
    },
    {
        "identifier": "09ec3560-a85e-489e-839e-750288a168bb",
        "description": "Transfer funds - Jerrell Monahan",
        "amount": 3839,
        "dateOfRequest": "2020-12-15 09:15:38"
    },
    {
        "identifier": "b0381d90-ac80-4ee4-9a72-dfa882cb20b1",
        "description": "Transfer funds - Blaise Hintz",
        "amount": -2318,
        "dateOfRequest": "2020-12-14 10:02:38"
    },
    {
        "identifier": "89f2e0fe-137b-4875-b886-4f3fd82f5177",
        "description": "Transfer funds - Alexander Cummings",
        "amount": -7273,
        "dateOfRequest": "2020-12-13 09:44:38"
    },
    {
        "identifier": "a0b5e379-8a7f-4ded-bd7c-eff7aa3bca8b",
        "description": "Transfer funds - Dr. Clifton Feeney Jr.",
        "amount": 4731,
        "dateOfRequest": "2020-12-12 09:48:38"
    },
    {
        "identifier": "7bd2cd54-47e9-4943-9ef9-825eccda2e31",
        "description": "Transfer funds - Daryl Hills",
        "amount": 1725,
        "dateOfRequest": "2020-12-11 03:47:38"
    },
    {
        "identifier": "dfbd7906-3b58-400b-8f57-7c78c03b23be",
        "description": "Transfer funds - Emmet Bechtelar",
        "amount": -3461,
        "dateOfRequest": "2020-12-10 10:32:38"
    },
    {
        "identifier": "c13ef8d0-0b31-4b59-bc0b-f828d490dfc9",
        "description": "Transfer funds - Abigale Batz",
        "amount": 2428,
        "dateOfRequest": "2020-12-09 05:21:38"
    },
    {
        "identifier": "f36aac97-b13d-4857-8857-5e8f37f9b2ca",
        "description": "Transfer funds - Gussie Swift",
        "amount": 4927,
        "dateOfRequest": "2020-12-08 12:15:38"
    },
    {
        "identifier": "3af29366-0ac9-4c9f-ac5b-4555bf4fcb42",
        "description": "Transfer funds - Bernardo Rippin",
        "amount": 826,
        "dateOfRequest": "2020-12-07 11:43:38"
    },
    {
        "identifier": "739adc87-5990-42ad-b306-7e63b6e51562",
        "description": "Transfer funds - Dave Sporer",
        "amount": -8221,
        "dateOfRequest": "2020-12-06 05:14:38"
    },
    {
        "identifier": "764c649b-c2ce-4dcc-a906-e4613fd26d45",
        "description": "Transfer funds - Winnifred Larkin",
        "amount": 6597,
        "dateOfRequest": "2020-12-05 04:29:38"
    },
    {
        "identifier": "eda4e3cc-88b5-4193-a87e-b4a749939378",
        "description": "Transfer funds - Miss Elnora Shields Jr.",
        "amount": -1843,
        "dateOfRequest": "2020-12-04 03:45:38"
    },
    {
        "identifier": "ac42b357-1e23-4d31-bbda-e95cddeb0d99",
        "description": "Transfer funds - Lorenz Kovacek PhD",
        "amount": -7757,
        "dateOfRequest": "2020-12-03 06:49:38"
    },
    {
        "identifier": "d04d0838-8898-4521-92c3-e61c67138aed",
        "description": "Transfer funds - Van Langworth",
        "amount": -4480,
        "dateOfRequest": "2020-12-02 12:09:38"
    },
    {
        "identifier": "5d4995c0-5924-4f33-9824-d0bb12d515ad",
        "description": "Transfer funds - Ewell Hoppe",
        "amount": 7921,
        "dateOfRequest": "2020-12-01 07:17:38"
    },
    {
        "identifier": "2e325c0e-3f12-425c-bf19-badc495d0f0f",
        "description": "Transfer funds - Georgianna Bailey",
        "amount": -8196,
        "dateOfRequest": "2020-11-30 05:03:38"
    },
    {
        "identifier": "2a39f327-41fe-44aa-871e-ba6a637aceb4",
        "description": "Transfer funds - Mrs. Makayla Kshlerin",
        "amount": 2625,
        "dateOfRequest": "2020-11-29 04:14:38"
    },
    {
        "identifier": "2b3021ac-b582-46d1-8d00-6cf7f0e32826",
        "description": "Transfer funds - Mathilde Greenholt Jr.",
        "amount": -6040,
        "dateOfRequest": "2020-11-28 08:46:38"
    },
    {
        "identifier": "201fe774-105a-49e5-97e8-e0d51194e17a",
        "description": "Transfer funds - Josh Rogahn",
        "amount": -6802,
        "dateOfRequest": "2020-11-27 03:43:38"
    },
    {
        "identifier": "c42c132c-d1c4-4c95-92f4-1f3143e7eaab",
        "description": "Transfer funds - Mr. Trevor Kuhn",
        "amount": -1569,
        "dateOfRequest": "2020-11-26 11:55:38"
    },
    {
        "identifier": "f235ea68-7e97-45a4-93a5-b526a387b2c0",
        "description": "Transfer funds - Prof. Curtis Mayert",
        "amount": 3808,
        "dateOfRequest": "2020-11-25 05:48:38"
    },
    {
        "identifier": "e81dcf41-59c8-472e-bced-04589c6725b4",
        "description": "Transfer funds - Prof. Julius Klocko III",
        "amount": -2106,
        "dateOfRequest": "2021-01-13 08:41:38"
    },
    {
        "identifier": "4cdcc51c-ad72-480e-973f-3705c74cd3e2",
        "description": "Transfer funds - Mrs. Gail Nicolas",
        "amount": -9605,
        "dateOfRequest": "2021-01-12 10:30:38"
    },
    {
        "identifier": "fd483e32-51ac-4c8d-9ea6-e78ba477ca16",
        "description": "Transfer funds - Vincent Jerde",
        "amount": 9539,
        "dateOfRequest": "2021-01-11 08:45:38"
    },
    {
        "identifier": "d76612df-3f40-4a41-8a64-66ee51df9bb4",
        "description": "Transfer funds - Trystan Armstrong II",
        "amount": 1287,
        "dateOfRequest": "2021-01-10 07:22:38"
    },
    {
        "identifier": "1b50f9b3-1dde-4a7a-b8d3-9055ac665948",
        "description": "Transfer funds - Hadley Tremblay",
        "amount": 2612,
        "dateOfRequest": "2021-01-09 12:15:38"
    },
    {
        "identifier": "3486e2e1-9612-460d-a817-cf0ad3ae0605",
        "description": "Transfer funds - Garnet Bins",
        "amount": -943,
        "dateOfRequest": "2021-01-08 04:29:38"
    },
    {
        "identifier": "5e8e8838-80ba-427c-af7d-585de69f2474",
        "description": "Transfer funds - Shaina Ernser",
        "amount": 4126,
        "dateOfRequest": "2021-01-07 09:10:38"
    },
    {
        "identifier": "b0ba5f41-719d-443f-aedc-1377608f8961",
        "description": "Transfer funds - Ms. Jade Dicki III",
        "amount": -6878,
        "dateOfRequest": "2021-01-06 05:41:38"
    },
    {
        "identifier": "29801c1d-7b41-495e-beaa-9218fa626099",
        "description": "Transfer funds - Trey Stracke",
        "amount": -948,
        "dateOfRequest": "2021-01-05 03:58:38"
    },
    {
        "identifier": "5ef29e18-c208-4812-adbc-7ba1636922a0",
        "description": "Transfer funds - Mr. Cristopher Fisher",
        "amount": -7188,
        "dateOfRequest": "2021-01-04 07:48:38"
    },
    {
        "identifier": "97458106-7264-470b-a8f1-e4e43ef2b62b",
        "description": "Transfer funds - Elisabeth Lynch",
        "amount": -681,
        "dateOfRequest": "2021-01-03 07:51:38"
    },
    {
        "identifier": "22d2da5f-9fb5-4d3f-9415-835527cb1734",
        "description": "Transfer funds - Roma Hintz",
        "amount": 8482,
        "dateOfRequest": "2021-01-02 10:47:38"
    },
    {
        "identifier": "e36badb9-b93d-4a08-b2d3-56503c30dc6e",
        "description": "Transfer funds - Vena Nienow",
        "amount": -5967,
        "dateOfRequest": "2021-01-01 08:04:38"
    },
    {
        "identifier": "b7261108-dc3f-4b0e-8e71-14135585af7a",
        "description": "Transfer funds - Jaleel Smith I",
        "amount": -5311,
        "dateOfRequest": "2020-12-31 10:12:38"
    },
    {
        "identifier": "e6115a0a-a815-464e-b2e2-48b59a53071e",
        "description": "Transfer funds - Andrew Boehm",
        "amount": -7825,
        "dateOfRequest": "2020-12-30 07:55:38"
    },
    {
        "identifier": "bee6a0c7-6bd7-44a8-a320-d3513fdda4ae",
        "description": "Transfer funds - Bethel Lesch",
        "amount": 1565,
        "dateOfRequest": "2020-12-29 10:55:38"
    },
    {
        "identifier": "8516a16d-bd21-41ef-824a-498a86bb539a",
        "description": "Transfer funds - Ms. Petra Kessler",
        "amount": 4098,
        "dateOfRequest": "2020-12-28 05:09:38"
    },
    {
        "identifier": "261ef0ae-8d6b-4dac-af6e-fdc94a79b50e",
        "description": "Transfer funds - Jayde Will II",
        "amount": 1023,
        "dateOfRequest": "2020-12-27 08:32:38"
    },
    {
        "identifier": "0ce0be2a-219a-4a60-b84c-09d086f039fc",
        "description": "Transfer funds - Euna Lakin IV",
        "amount": 2067,
        "dateOfRequest": "2020-12-26 04:30:38"
    },
    {
        "identifier": "f0610070-5f3d-4167-9f80-8fc071a0190a",
        "description": "Transfer funds - Miss Nakia Corkery",
        "amount": 7471,
        "dateOfRequest": "2020-12-25 08:31:38"
    },
    {
        "identifier": "344c008a-a1a0-4b36-9833-e27e237a9db3",
        "description": "Transfer funds - Garnett Pacocha PhD",
        "amount": -5791,
        "dateOfRequest": "2020-12-24 12:09:38"
    },
    {
        "identifier": "d52ac6c7-203c-4a65-a328-4efa0bd3a552",
        "description": "Transfer funds - Jeffrey Hudson",
        "amount": 446,
        "dateOfRequest": "2020-12-23 09:22:38"
    },
    {
        "identifier": "1d3c00e9-d7a5-44ff-b705-ce968f9479fd",
        "description": "Transfer funds - Sven Robel",
        "amount": 2151,
        "dateOfRequest": "2020-12-22 10:45:38"
    },
    {
        "identifier": "9379f5b5-6b4f-4ff8-9d7d-c25c8e1da8bb",
        "description": "Transfer funds - Theodora Wunsch",
        "amount": 6230,
        "dateOfRequest": "2020-12-21 05:43:38"
    },
    {
        "identifier": "402eaf8a-692f-4d26-bb39-7e9ca719be92",
        "description": "Transfer funds - Mrs. Penelope Bashirian",
        "amount": -244,
        "dateOfRequest": "2020-12-20 06:21:38"
    },
    {
        "identifier": "89a961de-8d42-4727-b5c4-d8b0c3b244de",
        "description": "Transfer funds - Owen Thiel",
        "amount": -6414,
        "dateOfRequest": "2020-12-19 06:28:38"
    },
    {
        "identifier": "b6b5d259-6ada-4e9a-927f-ff1af98944a6",
        "description": "Transfer funds - Olaf Rempel MD",
        "amount": -1391,
        "dateOfRequest": "2020-12-18 11:15:38"
    },
    {
        "identifier": "cb40c849-0c91-47e4-b5dc-18bddb7145f1",
        "description": "Transfer funds - Francesca Maggio",
        "amount": -8561,
        "dateOfRequest": "2020-12-17 07:11:38"
    },
    {
        "identifier": "fce4cbe2-2219-4db6-882a-5a35af8f6353",
        "description": "Transfer funds - Abraham Nicolas",
        "amount": -2560,
        "dateOfRequest": "2020-12-16 11:51:38"
    },
    {
        "identifier": "423389ad-f196-4704-97e4-67491c6eac3e",
        "description": "Transfer funds - Mr. Haley Labadie",
        "amount": -6980,
        "dateOfRequest": "2020-12-15 09:47:38"
    },
    {
        "identifier": "71d7bad8-7029-4b83-81f3-dbdd18870023",
        "description": "Transfer funds - Elias Bernier",
        "amount": -2947,
        "dateOfRequest": "2020-12-14 10:36:38"
    },
    {
        "identifier": "add64771-bd0f-4ea1-87d0-df944ba05105",
        "description": "Transfer funds - Barbara Corkery",
        "amount": -2896,
        "dateOfRequest": "2020-12-13 07:54:38"
    },
    {
        "identifier": "74ef7028-a11a-458b-9c84-9039fe5f8c59",
        "description": "Transfer funds - Euna Dooley MD",
        "amount": 1653,
        "dateOfRequest": "2020-12-12 08:18:38"
    },
    {
        "identifier": "381bdf29-8e51-49c1-b6fa-8ce471cf940c",
        "description": "Transfer funds - Hilton Senger II",
        "amount": -2964,
        "dateOfRequest": "2020-12-11 06:57:38"
    },
    {
        "identifier": "ad58bc5a-9c0f-4616-86ed-22e34a119e80",
        "description": "Transfer funds - Adonis Quitzon",
        "amount": 2305,
        "dateOfRequest": "2020-12-10 11:15:38"
    },
    {
        "identifier": "c67b1f9b-1469-4d36-9a2a-255348aec011",
        "description": "Transfer funds - Jace Quigley",
        "amount": -3341,
        "dateOfRequest": "2020-12-09 11:48:38"
    },
    {
        "identifier": "98521020-eee8-496c-af80-e387d2a7086d",
        "description": "Transfer funds - Alden Mosciski IV",
        "amount": -3779,
        "dateOfRequest": "2020-12-08 09:57:38"
    },
    {
        "identifier": "013c748c-8676-45e0-9c8b-c3b9eb95b4a1",
        "description": "Transfer funds - Prof. Armani Kuvalis I",
        "amount": 4315,
        "dateOfRequest": "2020-12-07 12:01:38"
    },
    {
        "identifier": "1f60587f-b39c-46f9-8f5c-2482c60202ba",
        "description": "Transfer funds - Luther Hansen",
        "amount": 8869,
        "dateOfRequest": "2020-12-06 08:39:38"
    },
    {
        "identifier": "49fc5b9f-36fe-4b32-afe5-6c1848724bc2",
        "description": "Transfer funds - Mr. Ethan Tremblay",
        "amount": -3387,
        "dateOfRequest": "2020-12-05 03:35:38"
    },
    {
        "identifier": "9dc8566f-9201-4536-ae8d-337fc36cd77c",
        "description": "Transfer funds - Ms. Elenora Hills II",
        "amount": -3323,
        "dateOfRequest": "2020-12-04 05:42:38"
    },
    {
        "identifier": "f397bab5-c784-40b6-8487-1d97e714a881",
        "description": "Transfer funds - Jena Kemmer",
        "amount": -2359,
        "dateOfRequest": "2020-12-03 04:08:38"
    },
    {
        "identifier": "2b46dd21-bcbd-44ec-b094-fe0ae0394aa2",
        "description": "Transfer funds - Mr. Cyrus Hudson II",
        "amount": 6017,
        "dateOfRequest": "2020-12-02 08:35:38"
    },
    {
        "identifier": "ac10f4d9-5e13-4947-adcc-15ff6c732f29",
        "description": "Transfer funds - Dr. Aylin Wolf PhD",
        "amount": 9650,
        "dateOfRequest": "2020-12-01 08:19:38"
    },
    {
        "identifier": "65e0e6d5-8130-4d7e-90c9-d1838c0971d9",
        "description": "Transfer funds - Taya Armstrong DVM",
        "amount": 8939,
        "dateOfRequest": "2020-11-30 11:13:38"
    },
    {
        "identifier": "ebec5d81-e111-46c0-a372-f27f7247d69b",
        "description": "Transfer funds - Tito Fadel",
        "amount": 6405,
        "dateOfRequest": "2020-11-29 11:54:38"
    },
    {
        "identifier": "833a316e-e24d-4a0a-9998-8db76cae3bdc",
        "description": "Transfer funds - Javonte Graham",
        "amount": -7561,
        "dateOfRequest": "2020-11-28 04:37:38"
    },
    {
        "identifier": "bc0bc0bd-804d-4b3b-8990-46c0fbe61e6f",
        "description": "Transfer funds - Orval Runolfsson",
        "amount": 4295,
        "dateOfRequest": "2020-11-27 07:28:38"
    },
    {
        "identifier": "5e3a728a-f9e7-4039-86e7-6fe7514df615",
        "description": "Transfer funds - Mr. Sigmund Moore I",
        "amount": 983,
        "dateOfRequest": "2020-11-26 10:20:38"
    },
    {
        "identifier": "ba0b8717-ed83-4e84-b4c1-77980d7e5509",
        "description": "Transfer funds - Carey Jaskolski",
        "amount": -5115,
        "dateOfRequest": "2020-11-25 11:20:38"
    }
]