id,name,birth
001,leanardo Dicaprio,1965
002,Tom Cruise,1962
003,Robert Downey JR,1960
004,Mark Ruffalo,1970
005,vin disel,1975
006,Tom Holland,1992
007,scarlet johnson,1978
008,chris evans,1976
009,chris hemsworth,1972
010,vin disel,1956
011,Margot robbie,1986