[
  {
    "id": 1,
    "name": "Josef Anderson III",
    "email": "andrew.weber@gutkowski-mosciski.co",
    "phone": "1-190-004-3410",
    "notes": "",
    "starred": false,
    "avatarUrl": "",
    "labels": []
  },
  {
    "id": 2,
    "name": "Cameron Anderson",
    "email": "robbi.kris@quitzonllc.name",
    "phone": "1-083-684-8263",
    "notes": "",
    "starred": false,
    "avatarUrl": "",
    "labels": []
  },
  {
    "id": 3,
    "name": "Shanta Little II",
    "email": "myesha.mills@gutkowskicummingsandokuneva.biz",
    "phone": "900.385.9750",
    "notes": "",
    "starred": false,
    "avatarUrl": "",
    "labels": [
      "Family"
    ]
  },
  {
    "id": 4,
    "name": "Ms. Viola Kuhlman",
    "email": "aleta.sawayn@rippinllc.co",
    "phone": "1-339-922-4926",
    "notes": "",
    "starred": false,
    "avatarUrl": "",
    "labels": [
      "Family"
    ]
  },
  {
    "id": 5,
    "name": "Florentina Green",
    "email": "verlene.kemmer@mclaughlin-dickens.net",
    "phone": "826-177-2005",
    "notes": "",
    "starred": false,
    "avatarUrl": "",
    "labels": [
      "Co-worker"
    ]
  },
  {
    "id": 6,
    "name": "Son Franecki",
    "email": "isaiah.hermiston@kunzeinc.biz",
    "phone": "(848) 269-0867",
    "notes": "",
    "starred": false,
    "avatarUrl": "",
    "labels": [
      "Friend"
    ]
  },
  {
    "id": 7,
    "name": "Miss Teri Hammes",
    "email": "lenard.marquardt@wehner-hartmann.org",
    "phone": "370.990.7156",
    "notes": "",
    "starred": false,
    "avatarUrl": "",
    "labels": [
      "Co-worker"
    ]
  },
  {
    "id": 8,
    "name": "Grisel Turner",
    "email": "doyle.vonrueden@schmidthayesandkutch.biz",
    "phone": "453.991.4617",
    "notes": "",
    "starred": false,
    "avatarUrl": "",
    "labels": []
  },
  {
    "id": 9,
    "name": "Keven Smitham",
    "email": "francis.herzog@bartonsteuberandmohr.biz",
    "phone": "1-841-763-1077",
    "notes": "",
    "starred": false,
    "avatarUrl": "",
    "labels": [
      "Co-worker"
    ]
  },
  {
    "id": 10,
    "name": "Sylvie Weimann",
    "email": "nadene.walker@wiegand-daugherty.biz",
    "phone": "925.416.9396",
    "notes": "",
    "starred": false,
    "avatarUrl": "",
    "labels": [
      "Family"
    ]
  },
  {
    "id": 11,
    "name": "Norberto Murazik",
    "email": "michal.douglas@hodkiewicz-beatty.net",
    "phone": "746-765-4541",
    "notes": "",
    "starred": false,
    "avatarUrl": "",
    "labels": []
  },
  {
    "id": 12,
    "name": "Kerstin Heidenreich",
    "email": "kanesha.willms@bernhardlangworthandbruen.co",
    "phone": "367.417.6198",
    "notes": "",
    "starred": false,
    "avatarUrl": "",
    "labels": []
  },
  {
    "id": 13,
    "name": "Fritz Shanahan DDS",
    "email": "cleveland.johnston@jenkinsdareandmiller.biz",
    "phone": "529.105.2547",
    "notes": "",
    "starred": false,
    "avatarUrl": "",
    "labels": [
      "Co-worker"
    ]
  },
  {
    "id": 14,
    "name": "Raleigh Weimann",
    "email": "carol.bogan@walter-runolfsson.net",
    "phone": "1-726-476-7131",
    "notes": "",
    "starred": false,
    "avatarUrl": "",
    "labels": [
      "Friend"
    ]
  },
  {
    "id": 15,
    "name": "Miss Mikki Franecki",
    "email": "val.purdy@shieldsandsons.com",
    "phone": "821.466.0005",
    "notes": "",
    "starred": false,
    "avatarUrl": "",
    "labels": []
  },
  {
    "id": 16,
    "name": "Lonna Schumm",
    "email": "mikel.moore@boscohuelsandharvey.info",
    "phone": "325.014.9286",
    "notes": "",
    "starred": false,
    "avatarUrl": "",
    "labels": [
      "Friend"
    ]
  },
  {
    "id": 17,
    "name": "Toby Wilkinson",
    "email": "jacques.lindgren@kulaswuckertandkshlerin.co",
    "phone": "510-179-8921",
    "notes": "",
    "starred": false,
    "avatarUrl": "",
    "labels": [
      "Family"
    ]
  },
  {
    "id": 18,
    "name": "Mindy Davis",
    "email": "lakiesha.rath@homenickmurphyandkertzmann.biz",
    "phone": "1-788-603-7822",
    "notes": "",
    "starred": false,
    "avatarUrl": "",
    "labels": [
      "Friend"
    ]
  },
  {
    "id": 19,
    "name": "Coleman Bogan DDS",
    "email": "cassy.torp@bashiriangroup.com",
    "phone": "1-701-283-9214",
    "notes": "",
    "starred": false,
    "avatarUrl": "",
    "labels": []
  },
  {
    "id": 20,
    "name": "Garrett Quigley",
    "email": "reuben.rogahn@hilpertllc.net",
    "phone": "(701) 976-0706",
    "notes": "",
    "starred": false,
    "avatarUrl": "",
    "labels": [
      "Family"
    ]
  },
  {
    "id": 21,
    "name": "Sarah West",
    "email": "claud.greenfelder@ernser-cremin.com",
    "phone": "919.961.2783",
    "notes": "",
    "starred": false,
    "avatarUrl": "",
    "labels": [
      "Friend"
    ]
  },
  {
    "id": 22,
    "name": "Denis Ortiz",
    "email": "lurline.lebsack@erdmanraynoranddaugherty.org",
    "phone": "1-710-295-6065",
    "notes": "",
    "starred": false,
    "avatarUrl": "",
    "labels": [
      "Co-worker"
    ]
  },
  {
    "id": 23,
    "name": "Dallas Wilkinson",
    "email": "joetta.okon@koch-ebert.name",
    "phone": "474.797.9661",
    "notes": "",
    "starred": false,
    "avatarUrl": "",
    "labels": []
  },
  {
    "id": 24,
    "name": "Prince Greenholt",
    "email": "kari.king@yundtmcdermottandjacobs.co",
    "phone": "354-257-0571",
    "notes": "",
    "starred": false,
    "avatarUrl": "",
    "labels": [
      "Friend"
    ]
  },
  {
    "id": 25,
    "name": "Dr. Rolland Smitham",
    "email": "basil.roberts@parisian-ferry.org",
    "phone": "1-846-915-6709",
    "notes": "",
    "starred": false,
    "avatarUrl": "",
    "labels": []
  }
]