param_SVM__max_iter,train acc,test acc
1,0.8498508196335354,0.90615304066578
2,0.9125507752708513,0.900731578112275
4,0.8782371701019033,0.8874449700691639
8,0.8992303316826671,0.8851159853938537
16,0.9160272853531742,0.9078816658152344
32,0.9252397836716417,0.9256200296058759
64,0.9320304906103529,0.9334963853164441
128,0.9345003536081643,0.9330224516671549
256,0.9345367907130212,0.930690035847291
512,0.9342998238883766,0.9325112655912843
1024,0.9342998238883766,0.9325112655912843
2048,0.9342998238883766,0.9325112655912843
