k,GMM,Kmeans
2,0.2612244897959184,0.2602040816326531
3,0.26326530612244897,0.28469387755102044
4,0.44081632653061226,0.3816326530612245
5,0.4153061224489796,0.3704081632653061
6,0.3704081632653061,0.37755102040816324
7,0.3020408163265306,0.40714285714285714
8,0.3826530612244898,0.4173469387755102
9,0.33979591836734696,0.42653061224489797
10,0.3704081632653061,0.4193877551020408
15,0.39387755102040817,0.43979591836734694
20,0.413265306122449,0.45510204081632655
25,0.42653061224489797,0.44693877551020406
30,0.44285714285714284,0.45816326530612245
35,0.44081632653061226,0.46122448979591835
40,0.4377551020408163,0.45816326530612245
