iterations,fitness,time,fevals
0,533.0,0.040823736,647
10,548.0,0.054736636,1200
20,538.0,0.068972302,1740
30,541.0,0.083610536,2286
40,553.0,0.0974223,2836
50,567.0,0.112213423,3379
60,567.0,0.126739855,3925
70,565.0,0.141261545,4477
80,561.0,0.15629089,5022
90,557.0,0.16956537,5569
100,561.0,0.183900591,6122
110,563.0,0.198275318,6675
120,555.0,0.211684513,7223
130,561.0,0.224826252,7765
140,557.0,0.238233868,8315
150,557.0,0.251574718,8858
160,567.0,0.268515374,9398
170,565.0,0.281628274,9953
180,563.0,0.295843002,10504
190,563.0,0.309674914,11041
200,565.0,0.323860012,11590
210,569.0,0.337554838,12136
220,569.0,0.35040344,12685
230,569.0,0.366326416,13230
240,569.0,0.379353982,13776
250,571.0,0.394806044,14330
260,569.0,0.408154795,14882
270,573.0,0.421944831,15422
280,573.0,0.435683508,15976
290,577.0,0.449006975,16527
300,573.0,0.464006691,17079
310,579.0,0.477654899,17623
320,577.0,0.491476144,18171
330,579.0,0.505098674,18720
340,577.0,0.519116661,19266
350,579.0,0.531996078,19811
360,577.0,0.547589572,20356
370,577.0,0.56317951,20898
380,581.0,0.577552263,21459
390,577.0,0.590613409,22008
400,577.0,0.603262111,22550
410,575.0,0.617418369,23096
420,577.0,0.630521787,23649
430,577.0,0.643936909,24197
440,577.0,0.658031142,24746
450,577.0,0.670726461,25285
460,575.0,0.684197287,25839
470,575.0,0.699034631,26386
480,573.0,0.712207975,26933
490,573.0,0.753005241,27479
500,575.0,0.767871031,28032
510,575.0,0.781734943,28578
520,575.0,0.794636484,29124
530,573.0,0.807604395,29670
540,573.0,0.821889838,30221
550,573.0,0.836670689,30763
560,571.0,0.849965316,31305
570,571.0,0.864561278,31851
580,569.0,0.877447017,32395
590,569.0,0.890652756,32946
600,569.0,0.906651584,33494
610,567.0,0.919948977,34042
620,571.0,0.933193432,34586
630,571.0,0.947826135,35139
640,567.0,0.959685502,35689
650,571.0,0.971463092,36235
660,567.0,0.984531349,36792
670,567.0,0.999602965,37347
680,571.0,1.012729692,37897
690,567.0,1.026668271,38444
700,569.0,1.040400232,38989
710,567.0,1.053899502,39540
720,569.0,1.066817636,40084
730,569.0,1.08094861,40639
740,565.0,1.095961758,41186
750,567.0,1.1099833,41735
760,567.0,1.124193286,42287
770,567.0,1.138103816,42835
780,567.0,1.151174839,43382
790,567.0,1.164042405,43935
800,569.0,1.17754523,44487
810,565.0,1.192609736,45037
820,565.0,1.206908217,45587
830,565.0,1.221252919,46136
840,565.0,1.234480386,46680
850,567.0,1.247269334,47233
860,567.0,1.260463221,47771
870,565.0,1.274329108,48311
880,567.0,1.288152724,48857
890,567.0,1.302015451,49403
900,567.0,1.316620895,49952
910,567.0,1.329986634,50504
920,569.0,1.342696965,51058
930,567.0,1.356099049,51596
940,569.0,1.370760197,52139
950,565.0,1.384419072,52677
960,567.0,1.398887034,53234
970,565.0,1.412562107,53783
980,565.0,1.427268291,54327
990,567.0,1.441737043,54876
1000,567.0,1.454928559,55425
1010,567.0,1.49482785,55978
1020,569.0,1.509155565,56527
1030,567.0,1.522187871,57076
1040,567.0,1.534801412,57623
1050,565.0,1.548659793,58174
1060,567.0,1.561291112,58721
1070,567.0,1.574193838,59273
1080,565.0,1.586727181,59822
1090,565.0,1.599721956,60368
1100,567.0,1.613135498,60921
1110,567.0,1.629150918,61476
1120,569.0,1.643631917,62026
1130,569.0,1.659920325,62578
1140,569.0,1.676014757,63121
1150,567.0,1.689357978,63666
1160,567.0,1.702278087,64220
1170,567.0,1.715944468,64768
1180,569.0,1.731390208,65314
1190,567.0,1.747602369,65870
1200,569.0,1.761605738,66423
1210,569.0,1.775001106,66971
1220,573.0,1.787880918,67523
1230,575.0,1.800968138,68069
1240,573.0,1.814933186,68608
1250,573.0,1.827395813,69161
1260,571.0,1.840481848,69709
1270,571.0,1.854065661,70253
1280,571.0,1.86622725,70802
1290,571.0,1.879292742,71340
1300,567.0,1.891642381,71891
1310,567.0,1.905313107,72445
1320,565.0,1.919143439,72986
1330,569.0,1.93236182,73529
1340,573.0,1.945054374,74072
1350,571.0,1.958623175,74615
1360,569.0,1.971533803,75157
1370,571.0,1.984366999,75706
1380,571.0,1.998775306,76245
1390,571.0,2.012450774,76796
1400,571.0,2.025217204,77349
1410,575.0,2.039655142,77900
1420,571.0,2.053041424,78450
1430,575.0,2.066507904,78997
1440,571.0,2.079410235,79550
1450,573.0,2.092655085,80096
1460,573.0,2.107533912,80640
1470,575.0,2.121429034,81196
1480,571.0,2.134388255,81749
1490,573.0,2.146983623,82293
1500,573.0,2.159900571,82840
1510,573.0,2.173297125,83381
1520,573.0,2.211985155,83930
1530,573.0,2.226453117,84474
1540,569.0,2.241517623,85024
1550,569.0,2.254260349,85575
1560,569.0,2.267103025,86113
1570,567.0,2.280359332,86664
1580,567.0,2.295187985,87210
1590,567.0,2.308705428,87759
1600,565.0,2.322613587,88302
1610,567.0,2.335439671,88844
1620,567.0,2.349148719,89400
1630,567.0,2.364388237,89947
1640,569.0,2.378687507,90490
1650,563.0,2.391697295,91039
1660,563.0,2.405223034,91587
1670,567.0,2.418081118,92134
1680,567.0,2.430932486,92688
1690,565.0,2.443936348,93231
1700,565.0,2.45741705,93783
1710,561.0,2.470832567,94327
1720,561.0,2.484805121,94874
1730,561.0,2.498523255,95420
1740,565.0,2.511063314,95957
1750,563.0,2.523670534,96507
1760,563.0,2.537600026,97056
1770,561.0,2.550565172,97598
1780,561.0,2.56385822,98150
1790,559.0,2.578160651,98700
1800,561.0,2.592568563,99256
1810,563.0,2.608099242,99803
1820,571.0,2.625137082,100352
1830,563.0,2.639801785,100902
1840,565.0,2.653088116,101449
1850,563.0,2.666923583,102001
1860,563.0,2.680163692,102553
1870,563.0,2.693918172,103098
1880,561.0,2.708813196,103647
1890,559.0,2.725917802,104194
1900,561.0,2.740540234,104732
1910,561.0,2.754060837,105280
1920,559.0,2.766170674,105828
1930,561.0,2.778683474,106369
1940,559.0,2.792685658,106916
1950,559.0,2.80517989,107462
1960,559.0,2.817783554,108008
1970,561.0,2.830803614,108556
1980,563.0,2.843458241,109107
1990,563.0,2.856298547,109656
2000,561.0,2.868937766,110194
2010,561.0,2.88192306,110737
2020,561.0,2.895406527,111289
2030,561.0,2.937700684,111832
2040,559.0,2.951422374,112380
2050,557.0,2.965367273,112924
2060,557.0,2.978289357,113478
2070,555.0,2.991465071,114030
2080,555.0,3.005611848,114581
2090,553.0,3.018810475,115135
2100,551.0,3.032420363,115675
2110,551.0,3.045662843,116216
2120,555.0,3.059988978,116762
2130,555.0,3.073440445,117307
2140,555.0,3.088747518,117857
2150,553.0,3.101672763,118397
2160,555.0,3.114631588,118946
2170,553.0,3.128247797,119493
2180,555.0,3.14195408,120051
2190,555.0,3.155657992,120590
2200,553.0,3.168786694,121141
2210,553.0,3.182415544,121693
2220,553.0,3.197194024,122237
2230,551.0,3.211178825,122786
2240,549.0,3.225265552,123342
2250,549.0,3.238782204,123892
2260,551.0,3.252420141,124444
2270,553.0,3.266854918,124985
2280,551.0,3.28135646,125538
2290,553.0,3.295059187,126085
2300,551.0,3.308280729,126635
2310,551.0,3.321168837,127181
2320,549.0,3.334376946,127728
2330,551.0,3.34733103,128280
2340,553.0,3.359995929,128816
2350,551.0,3.373573816,129363
2360,549.0,3.387410469,129913
2370,549.0,3.401217492,130474
2380,549.0,3.414262046,131024
2390,549.0,3.427892476,131568
2400,547.0,3.442018709,132113
2410,547.0,3.456329042,132667
2420,545.0,3.469757991,133226
2430,547.0,3.482795433,133776
2440,545.0,3.495872777,134328
2450,545.0,3.510480591,134878
2460,545.0,3.523730182,135432
2470,545.0,3.53925296,135976
2480,545.0,3.553962701,136528
2490,547.0,3.571907999,137083
2500,547.0,3.612290056,137634
2510,547.0,3.626788833,138176
2520,549.0,3.640652745,138722
2530,549.0,3.654539571,139276
2540,545.0,3.668284569,139825
2550,547.0,3.684089026,140372
2560,547.0,3.697495456,140920
2570,549.0,3.709646775,141462
2580,549.0,3.723378736,142014
2590,547.0,3.738407686,142564
2600,547.0,3.751906166,143117
2610,547.0,3.765227658,143673
2620,547.0,3.778435372,144220
2630,547.0,3.792250692,144775
2640,545.0,3.805114307,145313
2650,547.0,3.820878467,145862
2660,543.0,3.834165983,146399
2670,545.0,3.847287574,146944
2680,547.0,3.861641363,147491
2690,545.0,3.876591696,148040
2700,547.0,3.89024425,148580
2710,547.0,3.90298105,149127
2720,549.0,3.916468468,149679
2730,547.0,3.92995233,150232
2740,549.0,3.942733377,150782
2750,551.0,3.956081338,151332
2760,549.0,3.970087868,151879
2770,553.0,3.983588718,152427
2780,551.0,3.999288089,152980
2790,551.0,4.012197926,153525
2800,549.0,4.025748159,154076
2810,551.0,4.039986195,154617
2820,553.0,4.055907985,155171
2830,551.0,4.069400144,155724
2840,551.0,4.083559168,156273
2850,551.0,4.097510389,156818
2860,549.0,4.112627438,157361
2870,551.0,4.126287498,157910
2880,547.0,4.139818372,158454
2890,549.0,4.154535223,159001
2900,549.0,4.169764469,159552
2910,551.0,4.185987692,160099
2920,551.0,4.19928627,160652
2930,549.0,4.21291038,161207
2940,549.0,4.225980217,161762
2950,553.0,4.239829117,162319
2960,551.0,4.253525128,162867
2970,553.0,4.267399312,163427
2980,555.0,4.280570681,163973
2990,555.0,4.294918939,164516
3000,555.0,4.308876481,165067
