param_MLP__max_iter,train acc,test acc
1,0.44356286480203344,0.45273268398268396
2,0.4688180865781463,0.4701028138528139
4,0.5407103638970452,0.5658549783549784
8,0.6386129612148883,0.5981601731601731
16,0.7265869001370183,0.6674512987012988
32,0.8042921197045841,0.7202380952380952
64,0.8495832279756781,0.7313041125541125
128,0.888940980245412,0.7889339826839828
256,0.9357872191264462,0.8013798701298702
512,0.9650374022441347,0.8243777056277057
1024,0.9650374022441347,0.8243777056277057
2048,0.9650374022441347,0.8243777056277057
2100,0.9650374022441347,0.8243777056277057
2200,0.9650374022441347,0.8243777056277057
2300,0.9650374022441347,0.8243777056277057
2400,0.9650374022441347,0.8243777056277057
2500,0.9650374022441347,0.8243777056277057
2600,0.9650374022441347,0.8243777056277057
2700,0.9650374022441347,0.8243777056277057
2800,0.9650374022441347,0.8243777056277057
2900,0.9650374022441347,0.8243777056277057
3000,0.9650374022441347,0.8243777056277057
