digraph Tree {
node [shape=box] ;
0 [label="X[15] <= -0.121\nentropy = 3.322\nsamples = 8793\nvalue = [879.3, 879.3, 879.3, 879.3, 879.3, 879.3, 879.3, 879.3\n879.3, 879.3]"] ;
1 [label="X[14] <= -0.521\nentropy = 2.905\nsamples = 5380\nvalue = [34.633, 879.3, 863.924, 866.798, 879.3, 352.137, 489.078\n144.305, 13.544, 847.003]"] ;
0 -> 1 [labeldistance=2.5, labelangle=45, headlabel="True"] ;
2 [label="X[9] <= -0.268\nentropy = 2.469\nsamples = 2524\nvalue = [28.861, 214.534, 0.0, 826.167, 81.684, 351.095, 431.846\n24.051, 13.544, 628.22]"] ;
1 -> 2 ;
3 [label="X[13] <= -0.799\nentropy = 0.399\nsamples = 442\nvalue = [0.0, 12.506, 0.0, 12.502, 0.0, 0.0, 431.846, 1.924\n0.0, 0.0]"] ;
2 -> 3 ;
4 [label="X[10] <= 0.56\nentropy = 1.314\nsamples = 27\nvalue = [0.0, 12.506, 0.0, 12.502, 0.0, 0.0, 2.081, 0.0, 0.0\n0.0]"] ;
3 -> 4 ;
5 [label="X[6] <= -0.094\nentropy = 0.591\nsamples = 14\nvalue = [0.0, 0.0, 0.0, 12.502, 0.0, 0.0, 2.081, 0.0, 0.0\n0.0]"] ;
4 -> 5 ;
6 [label="entropy = 0.0\nsamples = 2\nvalue = [0.0, 0.0, 0.0, 0.0, 0.0, 0.0, 2.081, 0.0, 0.0, 0.0]"] ;
5 -> 6 ;
7 [label="entropy = 0.0\nsamples = 12\nvalue = [0.0, 0.0, 0.0, 12.502, 0.0, 0.0, 0.0, 0.0, 0.0, 0.0]"] ;
5 -> 7 ;
8 [label="entropy = 0.0\nsamples = 13\nvalue = [0.0, 12.506, 0.0, 0.0, 0.0, 0.0, 0.0, 0.0, 0.0, 0.0]"] ;
4 -> 8 ;
9 [label="X[0] <= -0.899\nentropy = 0.041\nsamples = 415\nvalue = [0.0, 0.0, 0.0, 0.0, 0.0, 0.0, 429.764, 1.924, 0.0\n0.0]"] ;
3 -> 9 ;
10 [label="entropy = 0.0\nsamples = 2\nvalue = [0.0, 0.0, 0.0, 0.0, 0.0, 0.0, 0.0, 1.924, 0.0, 0.0]"] ;
9 -> 10 ;
11 [label="entropy = -0.0\nsamples = 413\nvalue = [0.0, 0.0, 0.0, 0.0, 0.0, 0.0, 429.764, 0.0, 0.0, 0.0]"] ;
9 -> 11 ;
12 [label="X[9] <= 0.831\nentropy = 2.176\nsamples = 2082\nvalue = [28.861, 202.027, 0.0, 813.665, 81.684, 351.095, 0.0\n22.127, 13.544, 628.22]"] ;
2 -> 12 ;
13 [label="X[0] <= 0.728\nentropy = 1.527\nsamples = 1153\nvalue = [4.81, 74.077, 0.0, 791.787, 20.181, 203.156, 0.0, 0.0\n4.167, 94.806]"] ;
12 -> 13 ;
14 [label="X[2] <= 1.857\nentropy = 0.843\nsamples = 877\nvalue = [2.886, 17.317, 0.0, 777.201, 5.766, 86.471, 0.0, 0.0\n3.125, 18.753]"] ;
13 -> 14 ;
15 [label="X[3] <= 0.616\nentropy = 0.599\nsamples = 799\nvalue = [2.886, 12.506, 0.0, 760.532, 5.766, 29.171, 0.0, 0.0\n3.125, 16.669]"] ;
14 -> 15 ;
16 [label="X[6] <= 0.775\nentropy = 2.573\nsamples = 59\nvalue = [2.886, 11.544, 0.0, 16.669, 5.766, 7.293, 0.0, 0.0\n3.125, 12.502]"] ;
15 -> 16 ;
17 [label="X[7] <= 0.701\nentropy = 2.497\nsamples = 36\nvalue = [2.886, 0.962, 0.0, 4.167, 5.766, 7.293, 0.0, 0.0\n3.125, 12.502]"] ;
16 -> 17 ;
18 [label="X[15] <= -0.779\nentropy = 1.741\nsamples = 12\nvalue = [2.886, 0.962, 0.0, 2.084, 5.766, 0.0, 0.0, 0.0, 0.0\n0.0]"] ;
17 -> 18 ;
19 [label="X[8] <= 0.467\nentropy = 0.592\nsamples = 7\nvalue = [0.0, 0.962, 0.0, 0.0, 5.766, 0.0, 0.0, 0.0, 0.0, 0.0]"] ;
18 -> 19 ;
20 [label="entropy = 0.0\nsamples = 1\nvalue = [0.0, 0.962, 0.0, 0.0, 0.0, 0.0, 0.0, 0.0, 0.0, 0.0]"] ;
19 -> 20 ;
21 [label="entropy = 0.0\nsamples = 6\nvalue = [0.0, 0.0, 0.0, 0.0, 5.766, 0.0, 0.0, 0.0, 0.0, 0.0]"] ;
19 -> 21 ;
22 [label="X[9] <= 0.226\nentropy = 0.981\nsamples = 5\nvalue = [2.886, 0.0, 0.0, 2.084, 0.0, 0.0, 0.0, 0.0, 0.0, 0.0]"] ;
18 -> 22 ;
23 [label="entropy = 0.0\nsamples = 2\nvalue = [0.0, 0.0, 0.0, 2.084, 0.0, 0.0, 0.0, 0.0, 0.0, 0.0]"] ;
22 -> 23 ;
24 [label="entropy = -0.0\nsamples = 3\nvalue = [2.886, 0.0, 0.0, 0.0, 0.0, 0.0, 0.0, 0.0, 0.0, 0.0]"] ;
22 -> 24 ;
25 [label="X[0] <= -0.459\nentropy = 1.692\nsamples = 24\nvalue = [0.0, 0.0, 0.0, 2.084, 0.0, 7.293, 0.0, 0.0, 3.125\n12.502]"] ;
17 -> 25 ;
26 [label="X[3] <= -0.114\nentropy = 1.669\nsamples = 13\nvalue = [0.0, 0.0, 0.0, 1.042, 0.0, 7.293, 0.0, 0.0, 3.125\n2.084]"] ;
25 -> 26 ;
27 [label="X[5] <= 0.924\nentropy = 0.971\nsamples = 5\nvalue = [0.0, 0.0, 0.0, 0.0, 0.0, 0.0, 0.0, 0.0, 3.125, 2.084]"] ;
26 -> 27 ;
28 [label="entropy = 0.0\nsamples = 2\nvalue = [0.0, 0.0, 0.0, 0.0, 0.0, 0.0, 0.0, 0.0, 0.0, 2.084]"] ;
27 -> 28 ;
29 [label="entropy = 0.0\nsamples = 3\nvalue = [0.0, 0.0, 0.0, 0.0, 0.0, 0.0, 0.0, 0.0, 3.125, 0.0]"] ;
27 -> 29 ;
30 [label="X[11] <= -0.552\nentropy = 0.544\nsamples = 8\nvalue = [0.0, 0.0, 0.0, 1.042, 0.0, 7.293, 0.0, 0.0, 0.0, 0.0]"] ;
26 -> 30 ;
31 [label="entropy = 0.0\nsamples = 1\nvalue = [0.0, 0.0, 0.0, 1.042, 0.0, 0.0, 0.0, 0.0, 0.0, 0.0]"] ;
30 -> 31 ;
32 [label="entropy = 0.0\nsamples = 7\nvalue = [0.0, 0.0, 0.0, 0.0, 0.0, 7.293, 0.0, 0.0, 0.0, 0.0]"] ;
30 -> 32 ;
33 [label="X[7] <= 0.968\nentropy = 0.439\nsamples = 11\nvalue = [0.0, 0.0, 0.0, 1.042, 0.0, 0.0, 0.0, 0.0, 0.0\n10.418]"] ;
25 -> 33 ;
34 [label="entropy = 0.0\nsamples = 1\nvalue = [0.0, 0.0, 0.0, 1.042, 0.0, 0.0, 0.0, 0.0, 0.0, 0.0]"] ;
33 -> 34 ;
35 [label="entropy = 0.0\nsamples = 10\nvalue = [0.0, 0.0, 0.0, 0.0, 0.0, 0.0, 0.0, 0.0, 0.0, 10.418]"] ;
33 -> 35 ;
36 [label="X[2] <= 0.566\nentropy = 0.995\nsamples = 23\nvalue = [0.0, 10.582, 0.0, 12.502, 0.0, 0.0, 0.0, 0.0, 0.0\n0.0]"] ;
16 -> 36 ;
37 [label="entropy = 0.0\nsamples = 12\nvalue = [0.0, 0.0, 0.0, 12.502, 0.0, 0.0, 0.0, 0.0, 0.0, 0.0]"] ;
36 -> 37 ;
38 [label="entropy = 0.0\nsamples = 11\nvalue = [0.0, 10.582, 0.0, 0.0, 0.0, 0.0, 0.0, 0.0, 0.0, 0.0]"] ;
36 -> 38 ;
39 [label="X[7] <= 1.168\nentropy = 0.248\nsamples = 740\nvalue = [0.0, 0.962, 0.0, 743.863, 0.0, 21.878, 0.0, 0.0, 0.0\n4.167]"] ;
15 -> 39 ;
40 [label="X[4] <= -0.07\nentropy = 0.127\nsamples = 725\nvalue = [0.0, 0.962, 0.0, 742.821, 0.0, 11.46, 0.0, 0.0, 0.0\n0.0]"] ;
39 -> 40 ;
41 [label="X[14] <= -1.048\nentropy = 0.722\nsamples = 10\nvalue = [0.0, 0.0, 0.0, 2.084, 0.0, 8.335, 0.0, 0.0, 0.0, 0.0]"] ;
40 -> 41 ;
42 [label="entropy = 0.0\nsamples = 8\nvalue = [0.0, 0.0, 0.0, 0.0, 0.0, 8.335, 0.0, 0.0, 0.0, 0.0]"] ;
41 -> 42 ;
43 [label="entropy = 0.0\nsamples = 2\nvalue = [0.0, 0.0, 0.0, 2.084, 0.0, 0.0, 0.0, 0.0, 0.0, 0.0]"] ;
41 -> 43 ;
44 [label="X[2] <= 1.439\nentropy = 0.053\nsamples = 715\nvalue = [0.0, 0.962, 0.0, 740.737, 0.0, 3.125, 0.0, 0.0, 0.0\n0.0]"] ;
40 -> 44 ;
45 [label="entropy = -0.0\nsamples = 648\nvalue = [0.0, 0.0, 0.0, 675.102, 0.0, 0.0, 0.0, 0.0, 0.0, 0.0]"] ;
44 -> 45 ;
46 [label="X[5] <= 0.813\nentropy = 0.368\nsamples = 67\nvalue = [0.0, 0.962, 0.0, 65.635, 0.0, 3.125, 0.0, 0.0, 0.0\n0.0]"] ;
44 -> 46 ;
47 [label="entropy = 0.0\nsamples = 63\nvalue = [0.0, 0.0, 0.0, 65.635, 0.0, 0.0, 0.0, 0.0, 0.0, 0.0]"] ;
46 -> 47 ;
48 [label="X[3] <= 0.824\nentropy = 0.787\nsamples = 4\nvalue = [0.0, 0.962, 0.0, 0.0, 0.0, 3.125, 0.0, 0.0, 0.0, 0.0]"] ;
46 -> 48 ;
49 [label="entropy = 0.0\nsamples = 1\nvalue = [0.0, 0.962, 0.0, 0.0, 0.0, 0.0, 0.0, 0.0, 0.0, 0.0]"] ;
48 -> 49 ;
50 [label="entropy = 0.0\nsamples = 3\nvalue = [0.0, 0.0, 0.0, 0.0, 0.0, 3.125, 0.0, 0.0, 0.0, 0.0]"] ;
48 -> 50 ;
51 [label="X[4] <= 0.647\nentropy = 1.159\nsamples = 15\nvalue = [0.0, 0.0, 0.0, 1.042, 0.0, 10.418, 0.0, 0.0, 0.0\n4.167]"] ;
39 -> 51 ;
52 [label="X[12] <= -0.245\nentropy = 0.722\nsamples = 5\nvalue = [0.0, 0.0, 0.0, 1.042, 0.0, 0.0, 0.0, 0.0, 0.0, 4.167]"] ;
51 -> 52 ;
53 [label="entropy = 0.0\nsamples = 1\nvalue = [0.0, 0.0, 0.0, 1.042, 0.0, 0.0, 0.0, 0.0, 0.0, 0.0]"] ;
52 -> 53 ;
54 [label="entropy = 0.0\nsamples = 4\nvalue = [0.0, 0.0, 0.0, 0.0, 0.0, 0.0, 0.0, 0.0, 0.0, 4.167]"] ;
52 -> 54 ;
55 [label="entropy = 0.0\nsamples = 10\nvalue = [0.0, 0.0, 0.0, 0.0, 0.0, 10.418, 0.0, 0.0, 0.0, 0.0]"] ;
51 -> 55 ;
56 [label="X[6] <= 0.185\nentropy = 1.2\nsamples = 78\nvalue = [0.0, 4.81, 0.0, 16.669, 0.0, 57.3, 0.0, 0.0, 0.0\n2.084]"] ;
14 -> 56 ;
57 [label="X[5] <= 0.554\nentropy = 0.413\nsamples = 59\nvalue = [0.0, 0.0, 0.0, 3.125, 0.0, 57.3, 0.0, 0.0, 0.0\n1.042]"] ;
56 -> 57 ;
58 [label="entropy = 0.0\nsamples = 3\nvalue = [0.0, 0.0, 0.0, 3.125, 0.0, 0.0, 0.0, 0.0, 0.0, 0.0]"] ;
57 -> 58 ;
59 [label="X[1] <= -1.087\nentropy = 0.129\nsamples = 56\nvalue = [0.0, 0.0, 0.0, 0.0, 0.0, 57.3, 0.0, 0.0, 0.0, 1.042]"] ;
57 -> 59 ;
60 [label="entropy = 0.0\nsamples = 1\nvalue = [0.0, 0.0, 0.0, 0.0, 0.0, 0.0, 0.0, 0.0, 0.0, 1.042]"] ;
59 -> 60 ;
61 [label="entropy = 0.0\nsamples = 55\nvalue = [0.0, 0.0, 0.0, 0.0, 0.0, 57.3, 0.0, 0.0, 0.0, 0.0]"] ;
59 -> 61 ;
62 [label="X[11] <= -0.331\nentropy = 1.087\nsamples = 19\nvalue = [0.0, 4.81, 0.0, 13.544, 0.0, 0.0, 0.0, 0.0, 0.0\n1.042]"] ;
56 -> 62 ;
63 [label="X[5] <= 0.998\nentropy = 0.371\nsamples = 14\nvalue = [0.0, 0.0, 0.0, 13.544, 0.0, 0.0, 0.0, 0.0, 0.0\n1.042]"] ;
62 -> 63 ;
64 [label="entropy = 0.0\nsamples = 13\nvalue = [0.0, 0.0, 0.0, 13.544, 0.0, 0.0, 0.0, 0.0, 0.0, 0.0]"] ;
63 -> 64 ;
65 [label="entropy = 0.0\nsamples = 1\nvalue = [0.0, 0.0, 0.0, 0.0, 0.0, 0.0, 0.0, 0.0, 0.0, 1.042]"] ;
63 -> 65 ;
66 [label="entropy = 0.0\nsamples = 5\nvalue = [0.0, 4.81, 0.0, 0.0, 0.0, 0.0, 0.0, 0.0, 0.0, 0.0]"] ;
62 -> 66 ;
67 [label="X[10] <= -0.324\nentropy = 2.023\nsamples = 276\nvalue = [1.924, 56.76, 0.0, 14.586, 14.415, 116.684, 0.0, 0.0\n1.042, 76.053]"] ;
13 -> 67 ;
68 [label="X[2] <= -0.838\nentropy = 0.13\nsamples = 60\nvalue = [0.0, 56.76, 0.0, 0.0, 0.0, 0.0, 0.0, 0.0, 1.042, 0.0]"] ;
67 -> 68 ;
69 [label="entropy = 0.0\nsamples = 1\nvalue = [0.0, 0.0, 0.0, 0.0, 0.0, 0.0, 0.0, 0.0, 1.042, 0.0]"] ;
68 -> 69 ;
70 [label="entropy = 0.0\nsamples = 59\nvalue = [0.0, 56.76, 0.0, 0.0, 0.0, 0.0, 0.0, 0.0, 0.0, 0.0]"] ;
68 -> 70 ;
71 [label="X[6] <= 0.218\nentropy = 1.59\nsamples = 216\nvalue = [1.924, 0.0, 0.0, 14.586, 14.415, 116.684, 0.0, 0.0\n0.0, 76.053]"] ;
67 -> 71 ;
72 [label="X[13] <= -0.468\nentropy = 0.685\nsamples = 124\nvalue = [1.924, 0.0, 0.0, 0.0, 14.415, 110.433, 0.0, 0.0, 0.0\n1.042]"] ;
71 -> 72 ;
73 [label="X[5] <= 0.166\nentropy = 0.076\nsamples = 107\nvalue = [0.0, 0.0, 0.0, 0.0, 0.0, 110.433, 0.0, 0.0, 0.0\n1.042]"] ;
72 -> 73 ;
74 [label="entropy = 0.0\nsamples = 1\nvalue = [0.0, 0.0, 0.0, 0.0, 0.0, 0.0, 0.0, 0.0, 0.0, 1.042]"] ;
73 -> 74 ;
75 [label="entropy = 0.0\nsamples = 106\nvalue = [0.0, 0.0, 0.0, 0.0, 0.0, 110.433, 0.0, 0.0, 0.0, 0.0]"] ;
73 -> 75 ;
76 [label="X[7] <= -0.967\nentropy = 0.523\nsamples = 17\nvalue = [1.924, 0.0, 0.0, 0.0, 14.415, 0.0, 0.0, 0.0, 0.0\n0.0]"] ;
72 -> 76 ;
77 [label="entropy = 0.0\nsamples = 2\nvalue = [1.924, 0.0, 0.0, 0.0, 0.0, 0.0, 0.0, 0.0, 0.0, 0.0]"] ;
76 -> 77 ;
78 [label="entropy = -0.0\nsamples = 15\nvalue = [0.0, 0.0, 0.0, 0.0, 14.415, 0.0, 0.0, 0.0, 0.0, 0.0]"] ;
76 -> 78 ;
79 [label="X[7] <= 0.668\nentropy = 0.947\nsamples = 92\nvalue = [0.0, 0.0, 0.0, 14.586, 0.0, 6.251, 0.0, 0.0, 0.0\n75.011]"] ;
71 -> 79 ;
80 [label="X[4] <= 0.793\nentropy = 1.181\nsamples = 20\nvalue = [0.0, 0.0, 0.0, 14.586, 0.0, 3.125, 0.0, 0.0, 0.0\n3.125]"] ;
79 -> 80 ;
81 [label="X[7] <= 0.518\nentropy = 0.971\nsamples = 5\nvalue = [0.0, 0.0, 0.0, 0.0, 0.0, 3.125, 0.0, 0.0, 0.0, 2.084]"] ;
80 -> 81 ;
82 [label="entropy = 0.0\nsamples = 3\nvalue = [0.0, 0.0, 0.0, 0.0, 0.0, 3.125, 0.0, 0.0, 0.0, 0.0]"] ;
81 -> 82 ;
83 [label="entropy = 0.0\nsamples = 2\nvalue = [0.0, 0.0, 0.0, 0.0, 0.0, 0.0, 0.0, 0.0, 0.0, 2.084]"] ;
81 -> 83 ;
84 [label="X[3] <= 0.251\nentropy = 0.353\nsamples = 15\nvalue = [0.0, 0.0, 0.0, 14.586, 0.0, 0.0, 0.0, 0.0, 0.0\n1.042]"] ;
80 -> 84 ;
85 [label="entropy = 0.0\nsamples = 1\nvalue = [0.0, 0.0, 0.0, 0.0, 0.0, 0.0, 0.0, 0.0, 0.0, 1.042]"] ;
84 -> 85 ;
86 [label="entropy = 0.0\nsamples = 14\nvalue = [0.0, 0.0, 0.0, 14.586, 0.0, 0.0, 0.0, 0.0, 0.0, 0.0]"] ;
84 -> 86 ;
87 [label="X[6] <= 0.562\nentropy = 0.25\nsamples = 72\nvalue = [0.0, 0.0, 0.0, 0.0, 0.0, 3.125, 0.0, 0.0, 0.0\n71.886]"] ;
79 -> 87 ;
88 [label="X[12] <= -0.425\nentropy = 0.918\nsamples = 9\nvalue = [0.0, 0.0, 0.0, 0.0, 0.0, 3.125, 0.0, 0.0, 0.0, 6.251]"] ;
87 -> 88 ;
89 [label="entropy = 0.0\nsamples = 3\nvalue = [0.0, 0.0, 0.0, 0.0, 0.0, 3.125, 0.0, 0.0, 0.0, 0.0]"] ;
88 -> 89 ;
90 [label="entropy = 0.0\nsamples = 6\nvalue = [0.0, 0.0, 0.0, 0.0, 0.0, 0.0, 0.0, 0.0, 0.0, 6.251]"] ;
88 -> 90 ;
91 [label="entropy = 0.0\nsamples = 63\nvalue = [0.0, 0.0, 0.0, 0.0, 0.0, 0.0, 0.0, 0.0, 0.0, 65.635]"] ;
87 -> 91 ;
92 [label="X[13] <= -0.498\nentropy = 1.983\nsamples = 929\nvalue = [24.051, 127.951, 0.0, 21.878, 61.503, 147.939, 0.0\n22.127, 9.376, 533.414]"] ;
12 -> 92 ;
93 [label="X[8] <= 0.482\nentropy = 1.194\nsamples = 593\nvalue = [0.0, 8.658, 0.0, 21.878, 0.0, 142.73, 0.0, 0.0, 9.376\n434.441]"] ;
92 -> 93 ;
94 [label="X[3] <= 0.303\nentropy = 1.533\nsamples = 213\nvalue = [0.0, 2.886, 0.0, 18.753, 0.0, 131.27, 0.0, 0.0, 9.376\n59.384]"] ;
93 -> 94 ;
95 [label="X[1] <= -2.694\nentropy = 0.941\nsamples = 53\nvalue = [0.0, 2.886, 0.0, 0.0, 0.0, 0.0, 0.0, 0.0, 9.376\n42.715]"] ;
94 -> 95 ;
96 [label="entropy = 0.0\nsamples = 9\nvalue = [0.0, 0.0, 0.0, 0.0, 0.0, 0.0, 0.0, 0.0, 9.376, 0.0]"] ;
95 -> 96 ;
97 [label="X[6] <= 1.054\nentropy = 0.34\nsamples = 44\nvalue = [0.0, 2.886, 0.0, 0.0, 0.0, 0.0, 0.0, 0.0, 0.0\n42.715]"] ;
95 -> 97 ;
98 [label="entropy = 0.0\nsamples = 41\nvalue = [0.0, 0.0, 0.0, 0.0, 0.0, 0.0, 0.0, 0.0, 0.0, 42.715]"] ;
97 -> 98 ;
99 [label="entropy = -0.0\nsamples = 3\nvalue = [0.0, 2.886, 0.0, 0.0, 0.0, 0.0, 0.0, 0.0, 0.0, 0.0]"] ;
97 -> 99 ;
100 [label="X[6] <= 0.66\nentropy = 0.958\nsamples = 160\nvalue = [0.0, 0.0, 0.0, 18.753, 0.0, 131.27, 0.0, 0.0, 0.0\n16.669]"] ;
94 -> 100 ;
101 [label="X[5] <= 0.462\nentropy = 0.485\nsamples = 139\nvalue = [0.0, 0.0, 0.0, 1.042, 0.0, 131.27, 0.0, 0.0, 0.0\n12.502]"] ;
100 -> 101 ;
102 [label="X[12] <= -0.2\nentropy = 0.503\nsamples = 9\nvalue = [0.0, 0.0, 0.0, 0.0, 0.0, 1.042, 0.0, 0.0, 0.0, 8.335]"] ;
101 -> 102 ;
103 [label="entropy = 0.0\nsamples = 1\nvalue = [0.0, 0.0, 0.0, 0.0, 0.0, 1.042, 0.0, 0.0, 0.0, 0.0]"] ;
102 -> 103 ;
104 [label="entropy = 0.0\nsamples = 8\nvalue = [0.0, 0.0, 0.0, 0.0, 0.0, 0.0, 0.0, 0.0, 0.0, 8.335]"] ;
102 -> 104 ;
105 [label="X[1] <= -0.469\nentropy = 0.263\nsamples = 130\nvalue = [0.0, 0.0, 0.0, 1.042, 0.0, 130.228, 0.0, 0.0, 0.0\n4.167]"] ;
101 -> 105 ;
106 [label="X[11] <= 0.571\nentropy = 0.722\nsamples = 5\nvalue = [0.0, 0.0, 0.0, 0.0, 0.0, 1.042, 0.0, 0.0, 0.0, 4.167]"] ;
105 -> 106 ;
107 [label="entropy = 0.0\nsamples = 4\nvalue = [0.0, 0.0, 0.0, 0.0, 0.0, 0.0, 0.0, 0.0, 0.0, 4.167]"] ;
106 -> 107 ;
108 [label="entropy = 0.0\nsamples = 1\nvalue = [0.0, 0.0, 0.0, 0.0, 0.0, 1.042, 0.0, 0.0, 0.0, 0.0]"] ;
106 -> 108 ;
109 [label="X[2] <= -0.477\nentropy = 0.067\nsamples = 125\nvalue = [0.0, 0.0, 0.0, 1.042, 0.0, 129.186, 0.0, 0.0, 0.0\n0.0]"] ;
105 -> 109 ;
110 [label="entropy = 0.0\nsamples = 1\nvalue = [0.0, 0.0, 0.0, 1.042, 0.0, 0.0, 0.0, 0.0, 0.0, 0.0]"] ;
109 -> 110 ;
111 [label="entropy = 0.0\nsamples = 124\nvalue = [0.0, 0.0, 0.0, 0.0, 0.0, 129.186, 0.0, 0.0, 0.0, 0.0]"] ;
109 -> 111 ;
112 [label="X[9] <= 1.088\nentropy = 0.702\nsamples = 21\nvalue = [0.0, 0.0, 0.0, 17.711, 0.0, 0.0, 0.0, 0.0, 0.0\n4.167]"] ;
100 -> 112 ;
113 [label="entropy = 0.0\nsamples = 17\nvalue = [0.0, 0.0, 0.0, 17.711, 0.0, 0.0, 0.0, 0.0, 0.0, 0.0]"] ;
112 -> 113 ;
114 [label="entropy = 0.0\nsamples = 4\nvalue = [0.0, 0.0, 0.0, 0.0, 0.0, 0.0, 0.0, 0.0, 0.0, 4.167]"] ;
112 -> 114 ;
115 [label="X[0] <= 0.846\nentropy = 0.365\nsamples = 380\nvalue = [0.0, 5.772, 0.0, 3.125, 0.0, 11.46, 0.0, 0.0, 0.0\n375.057]"] ;
93 -> 115 ;
116 [label="X[6] <= 1.267\nentropy = 0.956\nsamples = 105\nvalue = [0.0, 5.772, 0.0, 3.125, 0.0, 11.46, 0.0, 0.0, 0.0\n88.555]"] ;
115 -> 116 ;
117 [label="X[3] <= 0.824\nentropy = 0.656\nsamples = 96\nvalue = [0.0, 0.0, 0.0, 2.084, 0.0, 11.46, 0.0, 0.0, 0.0\n86.471]"] ;
116 -> 117 ;
118 [label="entropy = 0.0\nsamples = 62\nvalue = [0.0, 0.0, 0.0, 0.0, 0.0, 0.0, 0.0, 0.0, 0.0, 64.593]"] ;
117 -> 118 ;
119 [label="X[6] <= -0.045\nentropy = 1.197\nsamples = 34\nvalue = [0.0, 0.0, 0.0, 2.084, 0.0, 11.46, 0.0, 0.0, 0.0\n21.878]"] ;
117 -> 119 ;
120 [label="X[5] <= 0.259\nentropy = 1.053\nsamples = 15\nvalue = [0.0, 0.0, 0.0, 1.042, 0.0, 11.46, 0.0, 0.0, 0.0\n3.125]"] ;
119 -> 120 ;
121 [label="X[5] <= 0.111\nentropy = 0.811\nsamples = 4\nvalue = [0.0, 0.0, 0.0, 1.042, 0.0, 0.0, 0.0, 0.0, 0.0, 3.125]"] ;
120 -> 121 ;
122 [label="entropy = 0.0\nsamples = 3\nvalue = [0.0, 0.0, 0.0, 0.0, 0.0, 0.0, 0.0, 0.0, 0.0, 3.125]"] ;
121 -> 122 ;
123 [label="entropy = 0.0\nsamples = 1\nvalue = [0.0, 0.0, 0.0, 1.042, 0.0, 0.0, 0.0, 0.0, 0.0, 0.0]"] ;
121 -> 123 ;
124 [label="entropy = 0.0\nsamples = 11\nvalue = [0.0, 0.0, 0.0, 0.0, 0.0, 11.46, 0.0, 0.0, 0.0, 0.0]"] ;
120 -> 124 ;
125 [label="X[4] <= 0.588\nentropy = 0.297\nsamples = 19\nvalue = [0.0, 0.0, 0.0, 1.042, 0.0, 0.0, 0.0, 0.0, 0.0\n18.753]"] ;
119 -> 125 ;
126 [label="entropy = 0.0\nsamples = 18\nvalue = [0.0, 0.0, 0.0, 0.0, 0.0, 0.0, 0.0, 0.0, 0.0, 18.753]"] ;
125 -> 126 ;
127 [label="entropy = 0.0\nsamples = 1\nvalue = [0.0, 0.0, 0.0, 1.042, 0.0, 0.0, 0.0, 0.0, 0.0, 0.0]"] ;
125 -> 127 ;
128 [label="X[0] <= -0.093\nentropy = 1.258\nsamples = 9\nvalue = [0.0, 5.772, 0.0, 1.042, 0.0, 0.0, 0.0, 0.0, 0.0\n2.084]"] ;
116 -> 128 ;
129 [label="entropy = 0.0\nsamples = 6\nvalue = [0.0, 5.772, 0.0, 0.0, 0.0, 0.0, 0.0, 0.0, 0.0, 0.0]"] ;
128 -> 129 ;
130 [label="X[4] <= 0.662\nentropy = 0.918\nsamples = 3\nvalue = [0.0, 0.0, 0.0, 1.042, 0.0, 0.0, 0.0, 0.0, 0.0, 2.084]"] ;
128 -> 130 ;
131 [label="entropy = 0.0\nsamples = 2\nvalue = [0.0, 0.0, 0.0, 0.0, 0.0, 0.0, 0.0, 0.0, 0.0, 2.084]"] ;
130 -> 131 ;
132 [label="entropy = 0.0\nsamples = 1\nvalue = [0.0, 0.0, 0.0, 1.042, 0.0, 0.0, 0.0, 0.0, 0.0, 0.0]"] ;
130 -> 132 ;
133 [label="entropy = 0.0\nsamples = 275\nvalue = [0.0, 0.0, 0.0, 0.0, 0.0, 0.0, 0.0, 0.0, 0.0, 286.502]"] ;
115 -> 133 ;
134 [label="X[5] <= 0.111\nentropy = 2.132\nsamples = 336\nvalue = [24.051, 119.292, 0.0, 0.0, 61.503, 5.209, 0.0, 22.127\n0.0, 98.973]"] ;
92 -> 134 ;
135 [label="X[5] <= -1.496\nentropy = 1.106\nsamples = 90\nvalue = [24.051, 0.0, 0.0, 0.0, 58.62, 0.0, 0.0, 0.0, 0.0\n4.167]"] ;
134 -> 135 ;
136 [label="entropy = 0.0\nsamples = 24\nvalue = [23.089, 0.0, 0.0, 0.0, 0.0, 0.0, 0.0, 0.0, 0.0, 0.0]"] ;
135 -> 136 ;
137 [label="X[7] <= 1.202\nentropy = 0.46\nsamples = 66\nvalue = [0.962, 0.0, 0.0, 0.0, 58.62, 0.0, 0.0, 0.0, 0.0\n4.167]"] ;
135 -> 137 ;
138 [label="entropy = 0.0\nsamples = 61\nvalue = [0.0, 0.0, 0.0, 0.0, 58.62, 0.0, 0.0, 0.0, 0.0, 0.0]"] ;
137 -> 138 ;
139 [label="X[12] <= -1.212\nentropy = 0.696\nsamples = 5\nvalue = [0.962, 0.0, 0.0, 0.0, 0.0, 0.0, 0.0, 0.0, 0.0, 4.167]"] ;
137 -> 139 ;
140 [label="entropy = 0.0\nsamples = 1\nvalue = [0.962, 0.0, 0.0, 0.0, 0.0, 0.0, 0.0, 0.0, 0.0, 0.0]"] ;
139 -> 140 ;
141 [label="entropy = 0.0\nsamples = 4\nvalue = [0.0, 0.0, 0.0, 0.0, 0.0, 0.0, 0.0, 0.0, 0.0, 4.167]"] ;
139 -> 141 ;
142 [label="X[10] <= 0.212\nentropy = 1.543\nsamples = 246\nvalue = [0.0, 119.292, 0.0, 0.0, 2.883, 5.209, 0.0, 22.127, 0.0\n94.806]"] ;
134 -> 142 ;
143 [label="X[1] <= -0.099\nentropy = 1.179\nsamples = 161\nvalue = [0.0, 118.33, 0.0, 0.0, 1.922, 4.167, 0.0, 20.203, 0.0\n11.46]"] ;
142 -> 143 ;
144 [label="X[3] <= 0.355\nentropy = 0.428\nsamples = 128\nvalue = [0.0, 114.482, 0.0, 0.0, 0.0, 0.0, 0.0, 6.734, 0.0\n2.084]"] ;
143 -> 144 ;
145 [label="X[2] <= 2.028\nentropy = 0.147\nsamples = 117\nvalue = [0.0, 110.634, 0.0, 0.0, 0.0, 0.0, 0.0, 0.962, 0.0\n1.042]"] ;
144 -> 145 ;
146 [label="X[4] <= 0.106\nentropy = 0.072\nsamples = 116\nvalue = [0.0, 110.634, 0.0, 0.0, 0.0, 0.0, 0.0, 0.962, 0.0\n0.0]"] ;
145 -> 146 ;
147 [label="X[9] <= 1.527\nentropy = 0.811\nsamples = 4\nvalue = [0.0, 2.886, 0.0, 0.0, 0.0, 0.0, 0.0, 0.962, 0.0, 0.0]"] ;
146 -> 147 ;
148 [label="entropy = 0.0\nsamples = 1\nvalue = [0.0, 0.0, 0.0, 0.0, 0.0, 0.0, 0.0, 0.962, 0.0, 0.0]"] ;
147 -> 148 ;
149 [label="entropy = 0.0\nsamples = 3\nvalue = [0.0, 2.886, 0.0, 0.0, 0.0, 0.0, 0.0, 0.0, 0.0, 0.0]"] ;
147 -> 149 ;
150 [label="entropy = 0.0\nsamples = 112\nvalue = [0.0, 107.748, 0.0, 0.0, 0.0, 0.0, 0.0, 0.0, 0.0, 0.0]"] ;
146 -> 150 ;
151 [label="entropy = 0.0\nsamples = 1\nvalue = [0.0, 0.0, 0.0, 0.0, 0.0, 0.0, 0.0, 0.0, 0.0, 1.042]"] ;
145 -> 151 ;
152 [label="X[6] <= 1.316\nentropy = 1.338\nsamples = 11\nvalue = [0.0, 3.848, 0.0, 0.0, 0.0, 0.0, 0.0, 5.772, 0.0\n1.042]"] ;
144 -> 152 ;
153 [label="X[9] <= 1.454\nentropy = 0.747\nsamples = 5\nvalue = [0.0, 3.848, 0.0, 0.0, 0.0, 0.0, 0.0, 0.0, 0.0, 1.042]"] ;
152 -> 153 ;
154 [label="entropy = 0.0\nsamples = 4\nvalue = [0.0, 3.848, 0.0, 0.0, 0.0, 0.0, 0.0, 0.0, 0.0, 0.0]"] ;
153 -> 154 ;
155 [label="entropy = 0.0\nsamples = 1\nvalue = [0.0, 0.0, 0.0, 0.0, 0.0, 0.0, 0.0, 0.0, 0.0, 1.042]"] ;
153 -> 155 ;
156 [label="entropy = 0.0\nsamples = 6\nvalue = [0.0, 0.0, 0.0, 0.0, 0.0, 0.0, 0.0, 5.772, 0.0, 0.0]"] ;
152 -> 156 ;
157 [label="X[2] <= -0.155\nentropy = 2.025\nsamples = 33\nvalue = [0.0, 3.848, 0.0, 0.0, 1.922, 4.167, 0.0, 13.468, 0.0\n9.376]"] ;
143 -> 157 ;
158 [label="X[3] <= 0.251\nentropy = 0.986\nsamples = 18\nvalue = [0.0, 1.924, 0.0, 0.0, 1.922, 0.0, 0.0, 13.468, 0.0\n0.0]"] ;
157 -> 158 ;
159 [label="X[7] <= 1.652\nentropy = 1.0\nsamples = 4\nvalue = [0.0, 1.924, 0.0, 0.0, 1.922, 0.0, 0.0, 0.0, 0.0, 0.0]"] ;
158 -> 159 ;
160 [label="entropy = 0.0\nsamples = 2\nvalue = [0.0, 0.0, 0.0, 0.0, 1.922, 0.0, 0.0, 0.0, 0.0, 0.0]"] ;
159 -> 160 ;
161 [label="entropy = -0.0\nsamples = 2\nvalue = [0.0, 1.924, 0.0, 0.0, 0.0, 0.0, 0.0, 0.0, 0.0, 0.0]"] ;
159 -> 161 ;
162 [label="entropy = 0.0\nsamples = 14\nvalue = [0.0, 0.0, 0.0, 0.0, 0.0, 0.0, 0.0, 13.468, 0.0, 0.0]"] ;
158 -> 162 ;
163 [label="X[11] <= 0.277\nentropy = 1.322\nsamples = 15\nvalue = [0.0, 1.924, 0.0, 0.0, 0.0, 4.167, 0.0, 0.0, 0.0\n9.376]"] ;
157 -> 163 ;
164 [label="X[9] <= 0.941\nentropy = 0.9\nsamples = 6\nvalue = [0.0, 1.924, 0.0, 0.0, 0.0, 4.167, 0.0, 0.0, 0.0, 0.0]"] ;
163 -> 164 ;
165 [label="entropy = 0.0\nsamples = 2\nvalue = [0.0, 1.924, 0.0, 0.0, 0.0, 0.0, 0.0, 0.0, 0.0, 0.0]"] ;
164 -> 165 ;
166 [label="entropy = 0.0\nsamples = 4\nvalue = [0.0, 0.0, 0.0, 0.0, 0.0, 4.167, 0.0, 0.0, 0.0, 0.0]"] ;
164 -> 166 ;
167 [label="entropy = 0.0\nsamples = 9\nvalue = [0.0, 0.0, 0.0, 0.0, 0.0, 0.0, 0.0, 0.0, 0.0, 9.376]"] ;
163 -> 167 ;
168 [label="X[0] <= -1.075\nentropy = 0.416\nsamples = 85\nvalue = [0.0, 0.962, 0.0, 0.0, 0.961, 1.042, 0.0, 1.924, 0.0\n83.346]"] ;
142 -> 168 ;
169 [label="X[8] <= 0.232\nentropy = 1.352\nsamples = 7\nvalue = [0.0, 0.962, 0.0, 0.0, 0.0, 0.0, 0.0, 1.924, 0.0\n4.167]"] ;
168 -> 169 ;
170 [label="entropy = -0.0\nsamples = 4\nvalue = [0.0, 0.0, 0.0, 0.0, 0.0, 0.0, 0.0, 0.0, 0.0, 4.167]"] ;
169 -> 170 ;
171 [label="X[9] <= 1.875\nentropy = 0.918\nsamples = 3\nvalue = [0.0, 0.962, 0.0, 0.0, 0.0, 0.0, 0.0, 1.924, 0.0, 0.0]"] ;
169 -> 171 ;
172 [label="entropy = 0.0\nsamples = 2\nvalue = [0.0, 0.0, 0.0, 0.0, 0.0, 0.0, 0.0, 1.924, 0.0, 0.0]"] ;
171 -> 172 ;
173 [label="entropy = 0.0\nsamples = 1\nvalue = [0.0, 0.962, 0.0, 0.0, 0.0, 0.0, 0.0, 0.0, 0.0, 0.0]"] ;
171 -> 173 ;
174 [label="X[7] <= 0.668\nentropy = 0.192\nsamples = 78\nvalue = [0.0, 0.0, 0.0, 0.0, 0.961, 1.042, 0.0, 0.0, 0.0\n79.179]"] ;
168 -> 174 ;
175 [label="X[1] <= -0.161\nentropy = 0.847\nsamples = 11\nvalue = [0.0, 0.0, 0.0, 0.0, 0.961, 1.042, 0.0, 0.0, 0.0\n9.376]"] ;
174 -> 175 ;
176 [label="entropy = 0.0\nsamples = 9\nvalue = [0.0, 0.0, 0.0, 0.0, 0.0, 0.0, 0.0, 0.0, 0.0, 9.376]"] ;
175 -> 176 ;
177 [label="X[11] <= 0.885\nentropy = 0.999\nsamples = 2\nvalue = [0.0, 0.0, 0.0, 0.0, 0.961, 1.042, 0.0, 0.0, 0.0, 0.0]"] ;
175 -> 177 ;
178 [label="entropy = 0.0\nsamples = 1\nvalue = [0.0, 0.0, 0.0, 0.0, 0.0, 1.042, 0.0, 0.0, 0.0, 0.0]"] ;
177 -> 178 ;
179 [label="entropy = -0.0\nsamples = 1\nvalue = [0.0, 0.0, 0.0, 0.0, 0.961, 0.0, 0.0, 0.0, 0.0, 0.0]"] ;
177 -> 179 ;
180 [label="entropy = 0.0\nsamples = 67\nvalue = [0.0, 0.0, 0.0, 0.0, 0.0, 0.0, 0.0, 0.0, 0.0, 69.802]"] ;
174 -> 180 ;
181 [label="X[1] <= 0.828\nentropy = 2.249\nsamples = 2856\nvalue = [5.772, 664.766, 863.924, 40.631, 797.616, 1.042, 57.233\n120.254, 0.0, 218.783]"] ;
1 -> 181 ;
182 [label="X[10] <= -0.485\nentropy = 1.918\nsamples = 1957\nvalue = [5.772, 650.336, 852.392, 39.589, 38.439, 1.042, 9.365\n102.938, 0.0, 201.072]"] ;
181 -> 182 ;
183 [label="X[8] <= -0.664\nentropy = 0.881\nsamples = 1135\nvalue = [0.0, 232.812, 838.939, 1.042, 0.0, 0.0, 0.0, 17.317\n0.0, 1.042]"] ;
182 -> 183 ;
184 [label="X[1] <= -0.84\nentropy = 0.442\nsamples = 714\nvalue = [0.0, 51.95, 630.405, 0.0, 0.0, 0.0, 0.0, 2.886, 0.0\n1.042]"] ;
183 -> 184 ;
185 [label="X[4] <= -0.099\nentropy = 0.755\nsamples = 230\nvalue = [0.0, 43.292, 176.821, 0.0, 0.0, 0.0, 0.0, 0.0, 0.0\n1.042]"] ;
184 -> 185 ;
186 [label="X[12] <= 0.025\nentropy = 0.957\nsamples = 37\nvalue = [0.0, 22.127, 13.454, 0.0, 0.0, 0.0, 0.0, 0.0, 0.0\n0.0]"] ;
185 -> 186 ;
187 [label="X[2] <= -0.686\nentropy = 0.516\nsamples = 26\nvalue = [0.0, 22.127, 2.883, 0.0, 0.0, 0.0, 0.0, 0.0, 0.0\n0.0]"] ;
186 -> 187 ;
188 [label="X[4] <= -0.406\nentropy = 0.985\nsamples = 7\nvalue = [0.0, 3.848, 2.883, 0.0, 0.0, 0.0, 0.0, 0.0, 0.0, 0.0]"] ;
187 -> 188 ;
189 [label="entropy = 0.0\nsamples = 4\nvalue = [0.0, 3.848, 0.0, 0.0, 0.0, 0.0, 0.0, 0.0, 0.0, 0.0]"] ;
188 -> 189 ;
190 [label="entropy = 0.0\nsamples = 3\nvalue = [0.0, 0.0, 2.883, 0.0, 0.0, 0.0, 0.0, 0.0, 0.0, 0.0]"] ;
188 -> 190 ;
191 [label="entropy = 0.0\nsamples = 19\nvalue = [0.0, 18.279, 0.0, 0.0, 0.0, 0.0, 0.0, 0.0, 0.0, 0.0]"] ;
187 -> 191 ;
192 [label="entropy = 0.0\nsamples = 11\nvalue = [0.0, 0.0, 10.571, 0.0, 0.0, 0.0, 0.0, 0.0, 0.0, 0.0]"] ;
186 -> 192 ;
193 [label="X[8] <= -1.252\nentropy = 0.561\nsamples = 193\nvalue = [0.0, 21.165, 163.367, 0.0, 0.0, 0.0, 0.0, 0.0, 0.0\n1.042]"] ;
185 -> 193 ;
194 [label="X[0] <= 0.582\nentropy = 0.159\nsamples = 106\nvalue = [0.0, 0.962, 99.942, 0.0, 0.0, 0.0, 0.0, 0.0, 0.0\n1.042]"] ;
193 -> 194 ;
195 [label="X[4] <= -0.07\nentropy = 0.078\nsamples = 105\nvalue = [0.0, 0.962, 99.942, 0.0, 0.0, 0.0, 0.0, 0.0, 0.0\n0.0]"] ;
194 -> 195 ;
196 [label="X[11] <= -1.234\nentropy = 0.592\nsamples = 7\nvalue = [0.0, 0.962, 5.766, 0.0, 0.0, 0.0, 0.0, 0.0, 0.0, 0.0]"] ;
195 -> 196 ;
197 [label="entropy = 0.0\nsamples = 1\nvalue = [0.0, 0.962, 0.0, 0.0, 0.0, 0.0, 0.0, 0.0, 0.0, 0.0]"] ;
196 -> 197 ;
198 [label="entropy = 0.0\nsamples = 6\nvalue = [0.0, 0.0, 5.766, 0.0, 0.0, 0.0, 0.0, 0.0, 0.0, 0.0]"] ;
196 -> 198 ;
199 [label="entropy = 0.0\nsamples = 98\nvalue = [0.0, 0.0, 94.176, 0.0, 0.0, 0.0, 0.0, 0.0, 0.0, 0.0]"] ;
195 -> 199 ;
200 [label="entropy = 0.0\nsamples = 1\nvalue = [0.0, 0.0, 0.0, 0.0, 0.0, 0.0, 0.0, 0.0, 0.0, 1.042]"] ;
194 -> 200 ;
201 [label="X[4] <= 0.398\nentropy = 0.798\nsamples = 87\nvalue = [0.0, 20.203, 63.425, 0.0, 0.0, 0.0, 0.0, 0.0, 0.0\n0.0]"] ;
193 -> 201 ;
202 [label="X[2] <= -0.174\nentropy = 0.999\nsamples = 35\nvalue = [0.0, 17.317, 16.337, 0.0, 0.0, 0.0, 0.0, 0.0, 0.0\n0.0]"] ;
201 -> 202 ;
203 [label="X[7] <= 0.568\nentropy = 0.31\nsamples = 18\nvalue = [0.0, 0.962, 16.337, 0.0, 0.0, 0.0, 0.0, 0.0, 0.0\n0.0]"] ;
202 -> 203 ;
204 [label="entropy = 0.0\nsamples = 16\nvalue = [0.0, 0.0, 15.376, 0.0, 0.0, 0.0, 0.0, 0.0, 0.0, 0.0]"] ;
203 -> 204 ;
205 [label="X[2] <= -0.477\nentropy = 1.0\nsamples = 2\nvalue = [0.0, 0.962, 0.961, 0.0, 0.0, 0.0, 0.0, 0.0, 0.0, 0.0]"] ;
203 -> 205 ;
206 [label="entropy = 0.0\nsamples = 1\nvalue = [0.0, 0.0, 0.961, 0.0, 0.0, 0.0, 0.0, 0.0, 0.0, 0.0]"] ;
205 -> 206 ;
207 [label="entropy = -0.0\nsamples = 1\nvalue = [0.0, 0.962, 0.0, 0.0, 0.0, 0.0, 0.0, 0.0, 0.0, 0.0]"] ;
205 -> 207 ;
208 [label="entropy = 0.0\nsamples = 17\nvalue = [0.0, 16.355, 0.0, 0.0, 0.0, 0.0, 0.0, 0.0, 0.0, 0.0]"] ;
202 -> 208 ;
209 [label="X[7] <= 0.734\nentropy = 0.318\nsamples = 52\nvalue = [0.0, 2.886, 47.088, 0.0, 0.0, 0.0, 0.0, 0.0, 0.0\n0.0]"] ;
201 -> 209 ;
210 [label="X[2] <= 1.345\nentropy = 0.142\nsamples = 50\nvalue = [0.0, 0.962, 47.088, 0.0, 0.0, 0.0, 0.0, 0.0, 0.0\n0.0]"] ;
209 -> 210 ;
211 [label="entropy = 0.0\nsamples = 49\nvalue = [0.0, 0.0, 47.088, 0.0, 0.0, 0.0, 0.0, 0.0, 0.0, 0.0]"] ;
210 -> 211 ;
212 [label="entropy = -0.0\nsamples = 1\nvalue = [0.0, 0.962, 0.0, 0.0, 0.0, 0.0, 0.0, 0.0, 0.0, 0.0]"] ;
210 -> 212 ;
213 [label="entropy = -0.0\nsamples = 2\nvalue = [0.0, 1.924, 0.0, 0.0, 0.0, 0.0, 0.0, 0.0, 0.0, 0.0]"] ;
209 -> 213 ;
214 [label="X[12] <= -1.032\nentropy = 0.188\nsamples = 484\nvalue = [0.0, 8.658, 453.584, 0.0, 0.0, 0.0, 0.0, 2.886, 0.0\n0.0]"] ;
184 -> 214 ;
215 [label="X[13] <= -0.453\nentropy = 0.811\nsamples = 4\nvalue = [0.0, 2.886, 0.0, 0.0, 0.0, 0.0, 0.0, 0.962, 0.0, 0.0]"] ;
214 -> 215 ;
216 [label="entropy = 0.0\nsamples = 3\nvalue = [0.0, 2.886, 0.0, 0.0, 0.0, 0.0, 0.0, 0.0, 0.0, 0.0]"] ;
215 -> 216 ;
217 [label="entropy = 0.0\nsamples = 1\nvalue = [0.0, 0.0, 0.0, 0.0, 0.0, 0.0, 0.0, 0.962, 0.0, 0.0]"] ;
215 -> 217 ;
218 [label="X[9] <= -1.221\nentropy = 0.136\nsamples = 480\nvalue = [0.0, 5.772, 453.584, 0.0, 0.0, 0.0, 0.0, 1.924, 0.0\n0.0]"] ;
214 -> 218 ;
219 [label="X[8] <= -1.222\nentropy = 0.669\nsamples = 47\nvalue = [0.0, 3.848, 39.4, 0.0, 0.0, 0.0, 0.0, 1.924, 0.0\n0.0]"] ;
218 -> 219 ;
220 [label="entropy = 0.0\nsamples = 36\nvalue = [0.0, 0.0, 34.595, 0.0, 0.0, 0.0, 0.0, 0.0, 0.0, 0.0]"] ;
219 -> 220 ;
221 [label="X[4] <= 0.691\nentropy = 1.495\nsamples = 11\nvalue = [0.0, 3.848, 4.805, 0.0, 0.0, 0.0, 0.0, 1.924, 0.0\n0.0]"] ;
219 -> 221 ;
222 [label="X[1] <= 0.056\nentropy = 0.918\nsamples = 6\nvalue = [0.0, 3.848, 0.0, 0.0, 0.0, 0.0, 0.0, 1.924, 0.0, 0.0]"] ;
221 -> 222 ;
223 [label="entropy = 0.0\nsamples = 4\nvalue = [0.0, 3.848, 0.0, 0.0, 0.0, 0.0, 0.0, 0.0, 0.0, 0.0]"] ;
222 -> 223 ;
224 [label="entropy = 0.0\nsamples = 2\nvalue = [0.0, 0.0, 0.0, 0.0, 0.0, 0.0, 0.0, 1.924, 0.0, 0.0]"] ;
222 -> 224 ;
225 [label="entropy = 0.0\nsamples = 5\nvalue = [0.0, 0.0, 4.805, 0.0, 0.0, 0.0, 0.0, 0.0, 0.0, 0.0]"] ;
221 -> 225 ;
226 [label="X[11] <= 0.019\nentropy = 0.043\nsamples = 433\nvalue = [0.0, 1.924, 414.184, 0.0, 0.0, 0.0, 0.0, 0.0, 0.0\n0.0]"] ;
218 -> 226 ;
227 [label="X[1] <= -0.717\nentropy = 0.024\nsamples = 432\nvalue = [0.0, 0.962, 414.184, 0.0, 0.0, 0.0, 0.0, 0.0, 0.0\n0.0]"] ;
226 -> 227 ;
228 [label="X[5] <= 0.85\nentropy = 0.172\nsamples = 39\nvalue = [0.0, 0.962, 36.517, 0.0, 0.0, 0.0, 0.0, 0.0, 0.0\n0.0]"] ;
227 -> 228 ;
229 [label="entropy = 0.0\nsamples = 33\nvalue = [0.0, 0.0, 31.712, 0.0, 0.0, 0.0, 0.0, 0.0, 0.0, 0.0]"] ;
228 -> 229 ;
230 [label="X[5] <= 0.905\nentropy = 0.65\nsamples = 6\nvalue = [0.0, 0.962, 4.805, 0.0, 0.0, 0.0, 0.0, 0.0, 0.0, 0.0]"] ;
228 -> 230 ;
231 [label="entropy = 0.0\nsamples = 1\nvalue = [0.0, 0.962, 0.0, 0.0, 0.0, 0.0, 0.0, 0.0, 0.0, 0.0]"] ;
230 -> 231 ;
232 [label="entropy = 0.0\nsamples = 5\nvalue = [0.0, 0.0, 4.805, 0.0, 0.0, 0.0, 0.0, 0.0, 0.0, 0.0]"] ;
230 -> 232 ;
233 [label="entropy = -0.0\nsamples = 393\nvalue = [0.0, 0.0, 377.667, 0.0, 0.0, 0.0, 0.0, 0.0, 0.0, 0.0]"] ;
227 -> 233 ;
234 [label="entropy = -0.0\nsamples = 1\nvalue = [0.0, 0.962, 0.0, 0.0, 0.0, 0.0, 0.0, 0.0, 0.0, 0.0]"] ;
226 -> 234 ;
235 [label="X[6] <= 0.398\nentropy = 1.206\nsamples = 421\nvalue = [0.0, 180.863, 208.533, 1.042, 0.0, 0.0, 0.0, 14.431\n0.0, 0.0]"] ;
183 -> 235 ;
236 [label="X[12] <= -0.02\nentropy = 0.61\nsamples = 164\nvalue = [0.0, 137.571, 18.259, 0.0, 0.0, 0.0, 0.0, 1.924, 0.0\n0.0]"] ;
235 -> 236 ;
237 [label="X[6] <= 0.234\nentropy = 0.288\nsamples = 144\nvalue = [0.0, 132.761, 3.844, 0.0, 0.0, 0.0, 0.0, 1.924, 0.0\n0.0]"] ;
236 -> 237 ;
238 [label="entropy = 0.0\nsamples = 114\nvalue = [0.0, 109.672, 0.0, 0.0, 0.0, 0.0, 0.0, 0.0, 0.0, 0.0]"] ;
237 -> 238 ;
239 [label="X[15] <= -0.275\nentropy = 0.905\nsamples = 30\nvalue = [0.0, 23.089, 3.844, 0.0, 0.0, 0.0, 0.0, 1.924, 0.0\n0.0]"] ;
237 -> 239 ;
240 [label="X[8] <= -0.458\nentropy = 0.591\nsamples = 28\nvalue = [0.0, 23.089, 3.844, 0.0, 0.0, 0.0, 0.0, 0.0, 0.0\n0.0]"] ;
239 -> 240 ;
241 [label="X[15] <= -0.709\nentropy = 1.0\nsamples = 8\nvalue = [0.0, 3.848, 3.844, 0.0, 0.0, 0.0, 0.0, 0.0, 0.0, 0.0]"] ;
240 -> 241 ;
242 [label="entropy = 0.0\nsamples = 3\nvalue = [0.0, 0.0, 2.883, 0.0, 0.0, 0.0, 0.0, 0.0, 0.0, 0.0]"] ;
241 -> 242 ;
243 [label="X[10] <= -1.476\nentropy = 0.722\nsamples = 5\nvalue = [0.0, 3.848, 0.961, 0.0, 0.0, 0.0, 0.0, 0.0, 0.0, 0.0]"] ;
241 -> 243 ;
244 [label="entropy = 0.0\nsamples = 4\nvalue = [0.0, 3.848, 0.0, 0.0, 0.0, 0.0, 0.0, 0.0, 0.0, 0.0]"] ;
243 -> 244 ;
245 [label="entropy = -0.0\nsamples = 1\nvalue = [0.0, 0.0, 0.961, 0.0, 0.0, 0.0, 0.0, 0.0, 0.0, 0.0]"] ;
243 -> 245 ;
246 [label="entropy = 0.0\nsamples = 20\nvalue = [0.0, 19.241, 0.0, 0.0, 0.0, 0.0, 0.0, 0.0, 0.0, 0.0]"] ;
240 -> 246 ;
247 [label="entropy = 0.0\nsamples = 2\nvalue = [0.0, 0.0, 0.0, 0.0, 0.0, 0.0, 0.0, 1.924, 0.0, 0.0]"] ;
239 -> 247 ;
248 [label="X[9] <= -0.287\nentropy = 0.812\nsamples = 20\nvalue = [0.0, 4.81, 14.415, 0.0, 0.0, 0.0, 0.0, 0.0, 0.0, 0.0]"] ;
236 -> 248 ;
249 [label="entropy = 0.0\nsamples = 5\nvalue = [0.0, 4.81, 0.0, 0.0, 0.0, 0.0, 0.0, 0.0, 0.0, 0.0]"] ;
248 -> 249 ;
250 [label="entropy = 0.0\nsamples = 15\nvalue = [0.0, 0.0, 14.415, 0.0, 0.0, 0.0, 0.0, 0.0, 0.0, 0.0]"] ;
248 -> 250 ;
251 [label="X[15] <= -0.359\nentropy = 0.982\nsamples = 257\nvalue = [0.0, 43.292, 190.275, 1.042, 0.0, 0.0, 0.0, 12.506\n0.0, 0.0]"] ;
235 -> 251 ;
252 [label="X[8] <= -0.252\nentropy = 0.816\nsamples = 247\nvalue = [0.0, 43.292, 190.275, 1.042, 0.0, 0.0, 0.0, 2.886, 0.0\n0.0]"] ;
251 -> 252 ;
253 [label="X[7] <= 1.435\nentropy = 0.228\nsamples = 130\nvalue = [0.0, 2.886, 121.084, 1.042, 0.0, 0.0, 0.0, 0.0, 0.0\n0.0]"] ;
252 -> 253 ;
254 [label="X[6] <= 0.464\nentropy = 0.136\nsamples = 128\nvalue = [0.0, 0.962, 121.084, 1.042, 0.0, 0.0, 0.0, 0.0, 0.0\n0.0]"] ;
253 -> 254 ;
255 [label="X[12] <= -0.38\nentropy = 0.592\nsamples = 7\nvalue = [0.0, 0.962, 5.766, 0.0, 0.0, 0.0, 0.0, 0.0, 0.0, 0.0]"] ;
254 -> 255 ;
256 [label="entropy = 0.0\nsamples = 1\nvalue = [0.0, 0.962, 0.0, 0.0, 0.0, 0.0, 0.0, 0.0, 0.0, 0.0]"] ;
255 -> 256 ;
257 [label="entropy = 0.0\nsamples = 6\nvalue = [0.0, 0.0, 5.766, 0.0, 0.0, 0.0, 0.0, 0.0, 0.0, 0.0]"] ;
255 -> 257 ;
258 [label="X[1] <= 0.272\nentropy = 0.074\nsamples = 121\nvalue = [0.0, 0.0, 115.318, 1.042, 0.0, 0.0, 0.0, 0.0, 0.0\n0.0]"] ;
254 -> 258 ;
259 [label="entropy = 0.0\nsamples = 107\nvalue = [0.0, 0.0, 102.825, 0.0, 0.0, 0.0, 0.0, 0.0, 0.0, 0.0]"] ;
258 -> 259 ;
260 [label="X[0] <= -0.914\nentropy = 0.391\nsamples = 14\nvalue = [0.0, 0.0, 12.493, 1.042, 0.0, 0.0, 0.0, 0.0, 0.0\n0.0]"] ;
258 -> 260 ;
261 [label="X[10] <= -1.476\nentropy = 0.748\nsamples = 5\nvalue = [0.0, 0.0, 3.844, 1.042, 0.0, 0.0, 0.0, 0.0, 0.0, 0.0]"] ;
260 -> 261 ;
262 [label="entropy = 0.0\nsamples = 1\nvalue = [0.0, 0.0, 0.0, 1.042, 0.0, 0.0, 0.0, 0.0, 0.0, 0.0]"] ;
261 -> 262 ;
263 [label="entropy = -0.0\nsamples = 4\nvalue = [0.0, 0.0, 3.844, 0.0, 0.0, 0.0, 0.0, 0.0, 0.0, 0.0]"] ;
261 -> 263 ;
264 [label="entropy = 0.0\nsamples = 9\nvalue = [0.0, 0.0, 8.649, 0.0, 0.0, 0.0, 0.0, 0.0, 0.0, 0.0]"] ;
260 -> 264 ;
265 [label="entropy = 0.0\nsamples = 2\nvalue = [0.0, 1.924, 0.0, 0.0, 0.0, 0.0, 0.0, 0.0, 0.0, 0.0]"] ;
253 -> 265 ;
266 [label="X[2] <= -0.041\nentropy = 1.097\nsamples = 117\nvalue = [0.0, 40.405, 69.191, 0.0, 0.0, 0.0, 0.0, 2.886, 0.0\n0.0]"] ;
252 -> 266 ;
267 [label="X[11] <= 0.111\nentropy = 0.455\nsamples = 54\nvalue = [0.0, 1.924, 48.049, 0.0, 0.0, 0.0, 0.0, 1.924, 0.0\n0.0]"] ;
266 -> 267 ;
268 [label="X[10] <= -0.592\nentropy = 0.139\nsamples = 51\nvalue = [0.0, 0.962, 48.049, 0.0, 0.0, 0.0, 0.0, 0.0, 0.0\n0.0]"] ;
267 -> 268 ;
269 [label="entropy = 0.0\nsamples = 50\nvalue = [0.0, 0.0, 48.049, 0.0, 0.0, 0.0, 0.0, 0.0, 0.0, 0.0]"] ;
268 -> 269 ;
270 [label="entropy = -0.0\nsamples = 1\nvalue = [0.0, 0.962, 0.0, 0.0, 0.0, 0.0, 0.0, 0.0, 0.0, 0.0]"] ;
268 -> 270 ;
271 [label="X[7] <= 1.552\nentropy = 0.918\nsamples = 3\nvalue = [0.0, 0.962, 0.0, 0.0, 0.0, 0.0, 0.0, 1.924, 0.0, 0.0]"] ;
267 -> 271 ;
272 [label="entropy = 0.0\nsamples = 1\nvalue = [0.0, 0.962, 0.0, 0.0, 0.0, 0.0, 0.0, 0.0, 0.0, 0.0]"] ;
271 -> 272 ;
273 [label="entropy = 0.0\nsamples = 2\nvalue = [0.0, 0.0, 0.0, 0.0, 0.0, 0.0, 0.0, 1.924, 0.0, 0.0]"] ;
271 -> 273 ;
274 [label="X[1] <= -0.284\nentropy = 1.041\nsamples = 63\nvalue = [0.0, 38.481, 21.142, 0.0, 0.0, 0.0, 0.0, 0.962, 0.0\n0.0]"] ;
266 -> 274 ;
275 [label="X[6] <= 0.955\nentropy = 0.688\nsamples = 49\nvalue = [0.0, 38.481, 8.649, 0.0, 0.0, 0.0, 0.0, 0.0, 0.0\n0.0]"] ;
274 -> 275 ;
276 [label="entropy = -0.0\nsamples = 29\nvalue = [0.0, 27.899, 0.0, 0.0, 0.0, 0.0, 0.0, 0.0, 0.0, 0.0]"] ;
275 -> 276 ;
277 [label="X[8] <= 0.012\nentropy = 0.993\nsamples = 20\nvalue = [0.0, 10.582, 8.649, 0.0, 0.0, 0.0, 0.0, 0.0, 0.0\n0.0]"] ;
275 -> 277 ;
278 [label="entropy = 0.0\nsamples = 7\nvalue = [0.0, 0.0, 6.727, 0.0, 0.0, 0.0, 0.0, 0.0, 0.0, 0.0]"] ;
277 -> 278 ;
279 [label="X[1] <= -0.655\nentropy = 0.619\nsamples = 13\nvalue = [0.0, 10.582, 1.922, 0.0, 0.0, 0.0, 0.0, 0.0, 0.0\n0.0]"] ;
277 -> 279 ;
280 [label="entropy = 0.0\nsamples = 11\nvalue = [0.0, 10.582, 0.0, 0.0, 0.0, 0.0, 0.0, 0.0, 0.0, 0.0]"] ;
279 -> 280 ;
281 [label="entropy = 0.0\nsamples = 2\nvalue = [0.0, 0.0, 1.922, 0.0, 0.0, 0.0, 0.0, 0.0, 0.0, 0.0]"] ;
279 -> 281 ;
282 [label="X[9] <= -1.074\nentropy = 0.372\nsamples = 14\nvalue = [0.0, 0.0, 12.493, 0.0, 0.0, 0.0, 0.0, 0.962, 0.0\n0.0]"] ;
274 -> 282 ;
283 [label="entropy = 0.0\nsamples = 1\nvalue = [0.0, 0.0, 0.0, 0.0, 0.0, 0.0, 0.0, 0.962, 0.0, 0.0]"] ;
282 -> 283 ;
284 [label="entropy = 0.0\nsamples = 13\nvalue = [0.0, 0.0, 12.493, 0.0, 0.0, 0.0, 0.0, 0.0, 0.0, 0.0]"] ;
282 -> 284 ;
285 [label="entropy = 0.0\nsamples = 10\nvalue = [0.0, 0.0, 0.0, 0.0, 0.0, 0.0, 0.0, 9.62, 0.0, 0.0]"] ;
251 -> 285 ;
286 [label="X[6] <= 0.3\nentropy = 1.987\nsamples = 822\nvalue = [5.772, 417.523, 13.454, 38.548, 38.439, 1.042, 9.365\n85.621, 0.0, 200.03]"] ;
182 -> 286 ;
287 [label="X[9] <= 0.703\nentropy = 1.393\nsamples = 232\nvalue = [0.962, 11.544, 1.922, 10.418, 26.908, 1.042, 9.365, 0.0\n0.0, 176.068]"] ;
286 -> 287 ;
288 [label="X[13] <= -0.453\nentropy = 2.24\nsamples = 54\nvalue = [0.0, 6.734, 1.922, 9.376, 22.103, 0.0, 9.365, 0.0, 0.0\n4.167]"] ;
287 -> 288 ;
289 [label="X[10] <= 0.547\nentropy = 1.596\nsamples = 19\nvalue = [0.0, 6.734, 1.922, 9.376, 0.0, 0.0, 1.041, 0.0, 0.0\n0.0]"] ;
288 -> 289 ;
290 [label="X[12] <= 0.632\nentropy = 1.241\nsamples = 9\nvalue = [0.0, 5.772, 1.922, 0.0, 0.0, 0.0, 1.041, 0.0, 0.0\n0.0]"] ;
289 -> 290 ;
291 [label="entropy = 0.0\nsamples = 6\nvalue = [0.0, 5.772, 0.0, 0.0, 0.0, 0.0, 0.0, 0.0, 0.0, 0.0]"] ;
290 -> 291 ;
292 [label="X[7] <= 0.134\nentropy = 0.935\nsamples = 3\nvalue = [0.0, 0.0, 1.922, 0.0, 0.0, 0.0, 1.041, 0.0, 0.0, 0.0]"] ;
290 -> 292 ;
293 [label="entropy = 0.0\nsamples = 1\nvalue = [0.0, 0.0, 0.0, 0.0, 0.0, 0.0, 1.041, 0.0, 0.0, 0.0]"] ;
292 -> 293 ;
294 [label="entropy = 0.0\nsamples = 2\nvalue = [0.0, 0.0, 1.922, 0.0, 0.0, 0.0, 0.0, 0.0, 0.0, 0.0]"] ;
292 -> 294 ;
295 [label="X[1] <= -0.253\nentropy = 0.447\nsamples = 10\nvalue = [0.0, 0.962, 0.0, 9.376, 0.0, 0.0, 0.0, 0.0, 0.0, 0.0]"] ;
289 -> 295 ;
296 [label="entropy = 0.0\nsamples = 1\nvalue = [0.0, 0.962, 0.0, 0.0, 0.0, 0.0, 0.0, 0.0, 0.0, 0.0]"] ;
295 -> 296 ;
297 [label="entropy = 0.0\nsamples = 9\nvalue = [0.0, 0.0, 0.0, 9.376, 0.0, 0.0, 0.0, 0.0, 0.0, 0.0]"] ;
295 -> 297 ;
298 [label="X[9] <= -0.598\nentropy = 1.275\nsamples = 35\nvalue = [0.0, 0.0, 0.0, 0.0, 22.103, 0.0, 8.325, 0.0, 0.0\n4.167]"] ;
288 -> 298 ;
299 [label="entropy = 0.0\nsamples = 8\nvalue = [0.0, 0.0, 0.0, 0.0, 0.0, 0.0, 8.325, 0.0, 0.0, 0.0]"] ;
298 -> 299 ;
300 [label="X[5] <= 0.887\nentropy = 0.631\nsamples = 27\nvalue = [0.0, 0.0, 0.0, 0.0, 22.103, 0.0, 0.0, 0.0, 0.0\n4.167]"] ;
298 -> 300 ;
301 [label="entropy = 0.0\nsamples = 23\nvalue = [0.0, 0.0, 0.0, 0.0, 22.103, 0.0, 0.0, 0.0, 0.0, 0.0]"] ;
300 -> 301 ;
302 [label="entropy = 0.0\nsamples = 4\nvalue = [0.0, 0.0, 0.0, 0.0, 0.0, 0.0, 0.0, 0.0, 0.0, 4.167]"] ;
300 -> 302 ;
303 [label="X[11] <= 0.221\nentropy = 0.494\nsamples = 178\nvalue = [0.962, 4.81, 0.0, 1.042, 4.805, 1.042, 0.0, 0.0, 0.0\n171.901]"] ;
287 -> 303 ;
304 [label="X[3] <= 0.121\nentropy = 1.693\nsamples = 9\nvalue = [0.0, 4.81, 0.0, 1.042, 0.0, 1.042, 0.0, 0.0, 0.0\n2.084]"] ;
303 -> 304 ;
305 [label="entropy = 0.0\nsamples = 5\nvalue = [0.0, 4.81, 0.0, 0.0, 0.0, 0.0, 0.0, 0.0, 0.0, 0.0]"] ;
304 -> 305 ;
306 [label="X[14] <= -0.449\nentropy = 1.5\nsamples = 4\nvalue = [0.0, 0.0, 0.0, 1.042, 0.0, 1.042, 0.0, 0.0, 0.0\n2.084]"] ;
304 -> 306 ;
307 [label="entropy = 0.0\nsamples = 2\nvalue = [0.0, 0.0, 0.0, 0.0, 0.0, 0.0, 0.0, 0.0, 0.0, 2.084]"] ;
306 -> 307 ;
308 [label="X[12] <= 1.059\nentropy = 1.0\nsamples = 2\nvalue = [0.0, 0.0, 0.0, 1.042, 0.0, 1.042, 0.0, 0.0, 0.0, 0.0]"] ;
306 -> 308 ;
309 [label="entropy = 0.0\nsamples = 1\nvalue = [0.0, 0.0, 0.0, 1.042, 0.0, 0.0, 0.0, 0.0, 0.0, 0.0]"] ;
308 -> 309 ;
310 [label="entropy = 0.0\nsamples = 1\nvalue = [0.0, 0.0, 0.0, 0.0, 0.0, 1.042, 0.0, 0.0, 0.0, 0.0]"] ;
308 -> 310 ;
311 [label="X[7] <= 0.534\nentropy = 0.23\nsamples = 169\nvalue = [0.962, 0.0, 0.0, 0.0, 4.805, 0.0, 0.0, 0.0, 0.0\n169.817]"] ;
303 -> 311 ;
312 [label="X[0] <= 0.831\nentropy = 0.73\nsamples = 23\nvalue = [0.0, 0.0, 0.0, 0.0, 4.805, 0.0, 0.0, 0.0, 0.0\n18.753]"] ;
311 -> 312 ;
313 [label="X[12] <= 1.172\nentropy = 0.676\nsamples = 6\nvalue = [0.0, 0.0, 0.0, 0.0, 4.805, 0.0, 0.0, 0.0, 0.0, 1.042]"] ;
312 -> 313 ;
314 [label="entropy = 0.0\nsamples = 5\nvalue = [0.0, 0.0, 0.0, 0.0, 4.805, 0.0, 0.0, 0.0, 0.0, 0.0]"] ;
313 -> 314 ;
315 [label="entropy = 0.0\nsamples = 1\nvalue = [0.0, 0.0, 0.0, 0.0, 0.0, 0.0, 0.0, 0.0, 0.0, 1.042]"] ;
313 -> 315 ;
316 [label="entropy = 0.0\nsamples = 17\nvalue = [0.0, 0.0, 0.0, 0.0, 0.0, 0.0, 0.0, 0.0, 0.0, 17.711]"] ;
312 -> 316 ;
317 [label="X[5] <= -1.053\nentropy = 0.055\nsamples = 146\nvalue = [0.962, 0.0, 0.0, 0.0, 0.0, 0.0, 0.0, 0.0, 0.0\n151.065]"] ;
311 -> 317 ;
318 [label="entropy = 0.0\nsamples = 1\nvalue = [0.962, 0.0, 0.0, 0.0, 0.0, 0.0, 0.0, 0.0, 0.0, 0.0]"] ;
317 -> 318 ;
319 [label="entropy = 0.0\nsamples = 145\nvalue = [0.0, 0.0, 0.0, 0.0, 0.0, 0.0, 0.0, 0.0, 0.0, 151.065]"] ;
317 -> 319 ;
320 [label="X[1] <= -0.408\nentropy = 1.452\nsamples = 590\nvalue = [4.81, 405.979, 11.532, 28.129, 11.532, 0.0, 0.0, 85.621\n0.0, 23.962]"] ;
286 -> 320 ;
321 [label="X[3] <= 0.251\nentropy = 0.632\nsamples = 457\nvalue = [1.924, 399.245, 3.844, 9.376, 0.0, 0.0, 0.0, 20.203\n0.0, 6.251]"] ;
320 -> 321 ;
322 [label="X[4] <= -0.246\nentropy = 0.277\nsamples = 420\nvalue = [1.924, 390.586, 0.0, 1.042, 0.0, 0.0, 0.0, 4.81, 0.0\n6.251]"] ;
321 -> 322 ;
323 [label="X[12] <= 0.587\nentropy = 1.828\nsamples = 12\nvalue = [0.962, 2.886, 0.0, 0.0, 0.0, 0.0, 0.0, 4.81, 0.0\n3.125]"] ;
322 -> 323 ;
324 [label="X[3] <= -1.704\nentropy = 0.65\nsamples = 6\nvalue = [0.962, 0.0, 0.0, 0.0, 0.0, 0.0, 0.0, 4.81, 0.0, 0.0]"] ;
323 -> 324 ;
325 [label="entropy = 0.0\nsamples = 1\nvalue = [0.962, 0.0, 0.0, 0.0, 0.0, 0.0, 0.0, 0.0, 0.0, 0.0]"] ;
324 -> 325 ;
326 [label="entropy = 0.0\nsamples = 5\nvalue = [0.0, 0.0, 0.0, 0.0, 0.0, 0.0, 0.0, 4.81, 0.0, 0.0]"] ;
324 -> 326 ;
327 [label="X[0] <= 0.039\nentropy = 0.999\nsamples = 6\nvalue = [0.0, 2.886, 0.0, 0.0, 0.0, 0.0, 0.0, 0.0, 0.0, 3.125]"] ;
323 -> 327 ;
328 [label="entropy = 0.0\nsamples = 3\nvalue = [0.0, 2.886, 0.0, 0.0, 0.0, 0.0, 0.0, 0.0, 0.0, 0.0]"] ;
327 -> 328 ;
329 [label="entropy = -0.0\nsamples = 3\nvalue = [0.0, 0.0, 0.0, 0.0, 0.0, 0.0, 0.0, 0.0, 0.0, 3.125]"] ;
327 -> 329 ;
330 [label="X[13] <= 0.014\nentropy = 0.118\nsamples = 408\nvalue = [0.962, 387.7, 0.0, 1.042, 0.0, 0.0, 0.0, 0.0, 0.0\n3.125]"] ;
322 -> 330 ;
331 [label="X[4] <= -0.041\nentropy = 0.054\nsamples = 401\nvalue = [0.0, 383.852, 0.0, 1.042, 0.0, 0.0, 0.0, 0.0, 0.0\n1.042]"] ;
330 -> 331 ;
332 [label="X[5] <= 1.256\nentropy = 0.673\nsamples = 17\nvalue = [0.0, 14.431, 0.0, 1.042, 0.0, 0.0, 0.0, 0.0, 0.0\n1.042]"] ;
331 -> 332 ;
333 [label="X[10] <= 0.279\nentropy = 0.356\nsamples = 16\nvalue = [0.0, 14.431, 0.0, 1.042, 0.0, 0.0, 0.0, 0.0, 0.0\n0.0]"] ;
332 -> 333 ;
334 [label="X[1] <= -2.57\nentropy = 0.999\nsamples = 2\nvalue = [0.0, 0.962, 0.0, 1.042, 0.0, 0.0, 0.0, 0.0, 0.0, 0.0]"] ;
333 -> 334 ;
335 [label="entropy = 0.0\nsamples = 1\nvalue = [0.0, 0.962, 0.0, 0.0, 0.0, 0.0, 0.0, 0.0, 0.0, 0.0]"] ;
334 -> 335 ;
336 [label="entropy = 0.0\nsamples = 1\nvalue = [0.0, 0.0, 0.0, 1.042, 0.0, 0.0, 0.0, 0.0, 0.0, 0.0]"] ;
334 -> 336 ;
337 [label="entropy = 0.0\nsamples = 14\nvalue = [0.0, 13.468, 0.0, 0.0, 0.0, 0.0, 0.0, 0.0, 0.0, 0.0]"] ;
333 -> 337 ;
338 [label="entropy = 0.0\nsamples = 1\nvalue = [0.0, 0.0, 0.0, 0.0, 0.0, 0.0, 0.0, 0.0, 0.0, 1.042]"] ;
332 -> 338 ;
339 [label="entropy = -0.0\nsamples = 384\nvalue = [0.0, 369.421, 0.0, 0.0, 0.0, 0.0, 0.0, 0.0, 0.0, 0.0]"] ;
331 -> 339 ;
340 [label="X[10] <= 0.373\nentropy = 1.388\nsamples = 7\nvalue = [0.962, 3.848, 0.0, 0.0, 0.0, 0.0, 0.0, 0.0, 0.0\n2.084]"] ;
330 -> 340 ;
341 [label="X[2] <= -1.142\nentropy = 0.9\nsamples = 3\nvalue = [0.962, 0.0, 0.0, 0.0, 0.0, 0.0, 0.0, 0.0, 0.0, 2.084]"] ;
340 -> 341 ;
342 [label="entropy = 0.0\nsamples = 1\nvalue = [0.962, 0.0, 0.0, 0.0, 0.0, 0.0, 0.0, 0.0, 0.0, 0.0]"] ;
341 -> 342 ;
343 [label="entropy = 0.0\nsamples = 2\nvalue = [0.0, 0.0, 0.0, 0.0, 0.0, 0.0, 0.0, 0.0, 0.0, 2.084]"] ;
341 -> 343 ;
344 [label="entropy = 0.0\nsamples = 4\nvalue = [0.0, 3.848, 0.0, 0.0, 0.0, 0.0, 0.0, 0.0, 0.0, 0.0]"] ;
340 -> 344 ;
345 [label="X[7] <= 1.569\nentropy = 1.849\nsamples = 37\nvalue = [0.0, 8.658, 3.844, 8.335, 0.0, 0.0, 0.0, 15.393, 0.0\n0.0]"] ;
321 -> 345 ;
346 [label="X[2] <= -0.383\nentropy = 1.7\nsamples = 22\nvalue = [0.0, 8.658, 3.844, 8.335, 0.0, 0.0, 0.0, 0.962, 0.0\n0.0]"] ;
345 -> 346 ;
347 [label="X[14] <= 0.593\nentropy = 0.9\nsamples = 12\nvalue = [0.0, 0.0, 3.844, 8.335, 0.0, 0.0, 0.0, 0.0, 0.0, 0.0]"] ;
346 -> 347 ;
348 [label="entropy = 0.0\nsamples = 8\nvalue = [0.0, 0.0, 0.0, 8.335, 0.0, 0.0, 0.0, 0.0, 0.0, 0.0]"] ;
347 -> 348 ;
349 [label="entropy = 0.0\nsamples = 4\nvalue = [0.0, 0.0, 3.844, 0.0, 0.0, 0.0, 0.0, 0.0, 0.0, 0.0]"] ;
347 -> 349 ;
350 [label="X[2] <= 0.111\nentropy = 0.469\nsamples = 10\nvalue = [0.0, 8.658, 0.0, 0.0, 0.0, 0.0, 0.0, 0.962, 0.0, 0.0]"] ;
346 -> 350 ;
351 [label="entropy = 0.0\nsamples = 1\nvalue = [0.0, 0.0, 0.0, 0.0, 0.0, 0.0, 0.0, 0.962, 0.0, 0.0]"] ;
350 -> 351 ;
352 [label="entropy = 0.0\nsamples = 9\nvalue = [0.0, 8.658, 0.0, 0.0, 0.0, 0.0, 0.0, 0.0, 0.0, 0.0]"] ;
350 -> 352 ;
353 [label="entropy = -0.0\nsamples = 15\nvalue = [0.0, 0.0, 0.0, 0.0, 0.0, 0.0, 0.0, 14.431, 0.0, 0.0]"] ;
345 -> 353 ;
354 [label="X[5] <= 0.407\nentropy = 2.184\nsamples = 133\nvalue = [2.886, 6.734, 7.688, 18.753, 11.532, 0.0, 0.0, 65.418\n0.0, 17.711]"] ;
320 -> 354 ;
355 [label="X[7] <= 0.601\nentropy = 1.383\nsamples = 27\nvalue = [2.886, 0.0, 0.0, 0.0, 11.532, 0.0, 0.0, 0.0, 0.0\n12.502]"] ;
354 -> 355 ;
356 [label="X[3] <= -1.391\nentropy = 0.722\nsamples = 15\nvalue = [2.886, 0.0, 0.0, 0.0, 11.532, 0.0, 0.0, 0.0, 0.0\n0.0]"] ;
355 -> 356 ;
357 [label="entropy = 0.0\nsamples = 3\nvalue = [2.886, 0.0, 0.0, 0.0, 0.0, 0.0, 0.0, 0.0, 0.0, 0.0]"] ;
356 -> 357 ;
358 [label="entropy = 0.0\nsamples = 12\nvalue = [0.0, 0.0, 0.0, 0.0, 11.532, 0.0, 0.0, 0.0, 0.0, 0.0]"] ;
356 -> 358 ;
359 [label="entropy = 0.0\nsamples = 12\nvalue = [0.0, 0.0, 0.0, 0.0, 0.0, 0.0, 0.0, 0.0, 0.0, 12.502]"] ;
355 -> 359 ;
360 [label="X[10] <= 0.721\nentropy = 1.617\nsamples = 106\nvalue = [0.0, 6.734, 7.688, 18.753, 0.0, 0.0, 0.0, 65.418, 0.0\n5.209]"] ;
354 -> 360 ;
361 [label="X[13] <= -0.678\nentropy = 0.862\nsamples = 83\nvalue = [0.0, 6.734, 7.688, 0.0, 0.0, 0.0, 0.0, 65.418, 0.0\n0.0]"] ;
360 -> 361 ;
362 [label="X[6] <= 1.3\nentropy = 1.31\nsamples = 11\nvalue = [0.0, 1.924, 6.727, 0.0, 0.0, 0.0, 0.0, 1.924, 0.0\n0.0]"] ;
361 -> 362 ;
363 [label="X[5] <= 0.85\nentropy = 0.765\nsamples = 9\nvalue = [0.0, 1.924, 6.727, 0.0, 0.0, 0.0, 0.0, 0.0, 0.0, 0.0]"] ;
362 -> 363 ;
364 [label="entropy = 0.0\nsamples = 2\nvalue = [0.0, 1.924, 0.0, 0.0, 0.0, 0.0, 0.0, 0.0, 0.0, 0.0]"] ;
363 -> 364 ;
365 [label="entropy = 0.0\nsamples = 7\nvalue = [0.0, 0.0, 6.727, 0.0, 0.0, 0.0, 0.0, 0.0, 0.0, 0.0]"] ;
363 -> 365 ;
366 [label="entropy = 0.0\nsamples = 2\nvalue = [0.0, 0.0, 0.0, 0.0, 0.0, 0.0, 0.0, 1.924, 0.0, 0.0]"] ;
362 -> 366 ;
367 [label="X[2] <= -0.383\nentropy = 0.468\nsamples = 72\nvalue = [0.0, 4.81, 0.961, 0.0, 0.0, 0.0, 0.0, 63.494, 0.0\n0.0]"] ;
361 -> 367 ;
368 [label="entropy = 0.0\nsamples = 46\nvalue = [0.0, 0.0, 0.0, 0.0, 0.0, 0.0, 0.0, 44.254, 0.0, 0.0]"] ;
367 -> 368 ;
369 [label="X[10] <= 0.225\nentropy = 0.929\nsamples = 26\nvalue = [0.0, 4.81, 0.961, 0.0, 0.0, 0.0, 0.0, 19.241, 0.0\n0.0]"] ;
367 -> 369 ;
370 [label="entropy = 0.0\nsamples = 17\nvalue = [0.0, 0.0, 0.0, 0.0, 0.0, 0.0, 0.0, 16.355, 0.0, 0.0]"] ;
369 -> 370 ;
371 [label="X[4] <= 0.559\nentropy = 1.351\nsamples = 9\nvalue = [0.0, 4.81, 0.961, 0.0, 0.0, 0.0, 0.0, 2.886, 0.0\n0.0]"] ;
369 -> 371 ;
372 [label="entropy = 0.0\nsamples = 1\nvalue = [0.0, 0.0, 0.961, 0.0, 0.0, 0.0, 0.0, 0.0, 0.0, 0.0]"] ;
371 -> 372 ;
373 [label="X[2] <= 0.168\nentropy = 0.954\nsamples = 8\nvalue = [0.0, 4.81, 0.0, 0.0, 0.0, 0.0, 0.0, 2.886, 0.0, 0.0]"] ;
371 -> 373 ;
374 [label="X[3] <= 0.433\nentropy = 0.971\nsamples = 5\nvalue = [0.0, 1.924, 0.0, 0.0, 0.0, 0.0, 0.0, 2.886, 0.0, 0.0]"] ;
373 -> 374 ;
375 [label="entropy = 0.0\nsamples = 2\nvalue = [0.0, 1.924, 0.0, 0.0, 0.0, 0.0, 0.0, 0.0, 0.0, 0.0]"] ;
374 -> 375 ;
376 [label="entropy = 0.0\nsamples = 3\nvalue = [0.0, 0.0, 0.0, 0.0, 0.0, 0.0, 0.0, 2.886, 0.0, 0.0]"] ;
374 -> 376 ;
377 [label="entropy = 0.0\nsamples = 3\nvalue = [0.0, 2.886, 0.0, 0.0, 0.0, 0.0, 0.0, 0.0, 0.0, 0.0]"] ;
373 -> 377 ;
378 [label="X[10] <= 1.002\nentropy = 0.755\nsamples = 23\nvalue = [0.0, 0.0, 0.0, 18.753, 0.0, 0.0, 0.0, 0.0, 0.0\n5.209]"] ;
360 -> 378 ;
379 [label="entropy = 0.0\nsamples = 5\nvalue = [0.0, 0.0, 0.0, 0.0, 0.0, 0.0, 0.0, 0.0, 0.0, 5.209]"] ;
378 -> 379 ;
380 [label="entropy = 0.0\nsamples = 18\nvalue = [0.0, 0.0, 0.0, 18.753, 0.0, 0.0, 0.0, 0.0, 0.0, 0.0]"] ;
378 -> 380 ;
381 [label="X[11] <= -0.423\nentropy = 0.82\nsamples = 899\nvalue = [0.0, 14.431, 11.532, 1.042, 759.177, 0.0, 47.867, 17.317\n0.0, 17.711]"] ;
181 -> 381 ;
382 [label="X[14] <= 0.569\nentropy = 1.674\nsamples = 71\nvalue = [0.0, 8.658, 9.61, 1.042, 0.961, 0.0, 44.745, 6.734\n0.0, 0.0]"] ;
381 -> 382 ;
383 [label="X[7] <= 0.267\nentropy = 0.298\nsamples = 45\nvalue = [0.0, 0.0, 0.0, 1.042, 0.0, 0.0, 44.745, 0.962, 0.0\n0.0]"] ;
382 -> 383 ;
384 [label="entropy = 0.0\nsamples = 43\nvalue = [0.0, 0.0, 0.0, 0.0, 0.0, 0.0, 44.745, 0.0, 0.0, 0.0]"] ;
383 -> 384 ;
385 [label="X[13] <= -0.543\nentropy = 0.999\nsamples = 2\nvalue = [0.0, 0.0, 0.0, 1.042, 0.0, 0.0, 0.0, 0.962, 0.0, 0.0]"] ;
383 -> 385 ;
386 [label="entropy = 0.0\nsamples = 1\nvalue = [0.0, 0.0, 0.0, 1.042, 0.0, 0.0, 0.0, 0.0, 0.0, 0.0]"] ;
385 -> 386 ;
387 [label="entropy = 0.0\nsamples = 1\nvalue = [0.0, 0.0, 0.0, 0.0, 0.0, 0.0, 0.0, 0.962, 0.0, 0.0]"] ;
385 -> 387 ;
388 [label="X[3] <= -0.062\nentropy = 1.729\nsamples = 26\nvalue = [0.0, 8.658, 9.61, 0.0, 0.961, 0.0, 0.0, 5.772, 0.0\n0.0]"] ;
382 -> 388 ;
389 [label="entropy = 0.0\nsamples = 9\nvalue = [0.0, 8.658, 0.0, 0.0, 0.0, 0.0, 0.0, 0.0, 0.0, 0.0]"] ;
388 -> 389 ;
390 [label="X[15] <= -0.415\nentropy = 1.221\nsamples = 17\nvalue = [0.0, 0.0, 9.61, 0.0, 0.961, 0.0, 0.0, 5.772, 0.0\n0.0]"] ;
388 -> 390 ;
391 [label="X[4] <= -0.524\nentropy = 0.439\nsamples = 11\nvalue = [0.0, 0.0, 9.61, 0.0, 0.961, 0.0, 0.0, 0.0, 0.0, 0.0]"] ;
390 -> 391 ;
392 [label="entropy = 0.0\nsamples = 1\nvalue = [0.0, 0.0, 0.0, 0.0, 0.961, 0.0, 0.0, 0.0, 0.0, 0.0]"] ;
391 -> 392 ;
393 [label="entropy = 0.0\nsamples = 10\nvalue = [0.0, 0.0, 9.61, 0.0, 0.0, 0.0, 0.0, 0.0, 0.0, 0.0]"] ;
391 -> 393 ;
394 [label="entropy = 0.0\nsamples = 6\nvalue = [0.0, 0.0, 0.0, 0.0, 0.0, 0.0, 0.0, 5.772, 0.0, 0.0]"] ;
390 -> 394 ;
395 [label="X[7] <= 0.768\nentropy = 0.378\nsamples = 828\nvalue = [0.0, 5.772, 1.922, 0.0, 758.216, 0.0, 3.122, 10.582\n0.0, 17.711]"] ;
381 -> 395 ;
396 [label="X[9] <= -0.983\nentropy = 0.142\nsamples = 798\nvalue = [0.0, 5.772, 1.922, 0.0, 755.333, 0.0, 3.122, 0.0, 0.0\n1.042]"] ;
395 -> 396 ;
397 [label="X[4] <= -0.158\nentropy = 0.959\nsamples = 5\nvalue = [0.0, 0.0, 1.922, 0.0, 0.0, 0.0, 3.122, 0.0, 0.0, 0.0]"] ;
396 -> 397 ;
398 [label="entropy = 0.0\nsamples = 3\nvalue = [0.0, 0.0, 0.0, 0.0, 0.0, 0.0, 3.122, 0.0, 0.0, 0.0]"] ;
397 -> 398 ;
399 [label="entropy = 0.0\nsamples = 2\nvalue = [0.0, 0.0, 1.922, 0.0, 0.0, 0.0, 0.0, 0.0, 0.0, 0.0]"] ;
397 -> 399 ;
400 [label="X[13] <= -0.558\nentropy = 0.079\nsamples = 793\nvalue = [0.0, 5.772, 0.0, 0.0, 755.333, 0.0, 0.0, 0.0, 0.0\n1.042]"] ;
396 -> 400 ;
401 [label="X[5] <= 0.314\nentropy = 0.971\nsamples = 10\nvalue = [0.0, 5.772, 0.0, 0.0, 3.844, 0.0, 0.0, 0.0, 0.0, 0.0]"] ;
400 -> 401 ;
402 [label="X[4] <= -1.182\nentropy = 0.722\nsamples = 5\nvalue = [0.0, 0.962, 0.0, 0.0, 3.844, 0.0, 0.0, 0.0, 0.0, 0.0]"] ;
401 -> 402 ;
403 [label="entropy = 0.0\nsamples = 4\nvalue = [0.0, 0.0, 0.0, 0.0, 3.844, 0.0, 0.0, 0.0, 0.0, 0.0]"] ;
402 -> 403 ;
404 [label="entropy = 0.0\nsamples = 1\nvalue = [0.0, 0.962, 0.0, 0.0, 0.0, 0.0, 0.0, 0.0, 0.0, 0.0]"] ;
402 -> 404 ;
405 [label="entropy = 0.0\nsamples = 5\nvalue = [0.0, 4.81, 0.0, 0.0, 0.0, 0.0, 0.0, 0.0, 0.0, 0.0]"] ;
401 -> 405 ;
406 [label="X[9] <= 2.004\nentropy = 0.015\nsamples = 783\nvalue = [0.0, 0.0, 0.0, 0.0, 751.489, 0.0, 0.0, 0.0, 0.0\n1.042]"] ;
400 -> 406 ;
407 [label="entropy = 0.0\nsamples = 771\nvalue = [0.0, 0.0, 0.0, 0.0, 740.918, 0.0, 0.0, 0.0, 0.0, 0.0]"] ;
406 -> 407 ;
408 [label="X[4] <= -1.358\nentropy = 0.436\nsamples = 12\nvalue = [0.0, 0.0, 0.0, 0.0, 10.571, 0.0, 0.0, 0.0, 0.0\n1.042]"] ;
406 -> 408 ;
409 [label="entropy = 0.0\nsamples = 1\nvalue = [0.0, 0.0, 0.0, 0.0, 0.0, 0.0, 0.0, 0.0, 0.0, 1.042]"] ;
408 -> 409 ;
410 [label="entropy = 0.0\nsamples = 11\nvalue = [0.0, 0.0, 0.0, 0.0, 10.571, 0.0, 0.0, 0.0, 0.0, 0.0]"] ;
408 -> 410 ;
411 [label="X[5] <= 0.979\nentropy = 1.327\nsamples = 30\nvalue = [0.0, 0.0, 0.0, 0.0, 2.883, 0.0, 0.0, 10.582, 0.0\n16.669]"] ;
395 -> 411 ;
412 [label="X[6] <= 1.414\nentropy = 0.848\nsamples = 20\nvalue = [0.0, 0.0, 0.0, 0.0, 2.883, 0.0, 0.0, 0.962, 0.0\n16.669]"] ;
411 -> 412 ;
413 [label="entropy = 0.0\nsamples = 14\nvalue = [0.0, 0.0, 0.0, 0.0, 0.0, 0.0, 0.0, 0.0, 0.0, 14.586]"] ;
412 -> 413 ;
414 [label="X[13] <= -0.227\nentropy = 1.462\nsamples = 6\nvalue = [0.0, 0.0, 0.0, 0.0, 2.883, 0.0, 0.0, 0.962, 0.0\n2.084]"] ;
412 -> 414 ;
415 [label="X[9] <= 1.307\nentropy = 0.9\nsamples = 3\nvalue = [0.0, 0.0, 0.0, 0.0, 0.0, 0.0, 0.0, 0.962, 0.0, 2.084]"] ;
414 -> 415 ;
416 [label="entropy = 0.0\nsamples = 1\nvalue = [0.0, 0.0, 0.0, 0.0, 0.0, 0.0, 0.0, 0.962, 0.0, 0.0]"] ;
415 -> 416 ;
417 [label="entropy = 0.0\nsamples = 2\nvalue = [0.0, 0.0, 0.0, 0.0, 0.0, 0.0, 0.0, 0.0, 0.0, 2.084]"] ;
415 -> 417 ;
418 [label="entropy = -0.0\nsamples = 3\nvalue = [0.0, 0.0, 0.0, 0.0, 2.883, 0.0, 0.0, 0.0, 0.0, 0.0]"] ;
414 -> 418 ;
419 [label="entropy = 0.0\nsamples = 10\nvalue = [0.0, 0.0, 0.0, 0.0, 0.0, 0.0, 0.0, 9.62, 0.0, 0.0]"] ;
411 -> 419 ;
420 [label="X[13] <= 0.737\nentropy = 2.377\nsamples = 3413\nvalue = [844.667, 0.0, 15.376, 12.502, 0.0, 527.163, 390.222\n734.995, 865.756, 32.297]"] ;
0 -> 420 [labeldistance=2.5, labelangle=-45, headlabel="False"] ;
421 [label="X[0] <= -0.063\nentropy = 1.824\nsamples = 1537\nvalue = [36.557, 0.0, 15.376, 12.502, 0.0, 6.251, 387.1, 734.033\n332.342, 11.46]"] ;
420 -> 421 ;
422 [label="X[14] <= 0.054\nentropy = 0.646\nsamples = 837\nvalue = [0.0, 0.0, 14.415, 8.335, 0.0, 1.042, 4.162, 725.374\n56.259, 1.042]"] ;
421 -> 422 ;
423 [label="X[1] <= -0.161\nentropy = 1.556\nsamples = 131\nvalue = [0.0, 0.0, 0.0, 8.335, 0.0, 1.042, 4.162, 63.494\n53.133, 1.042]"] ;
422 -> 423 ;
424 [label="X[8] <= 0.747\nentropy = 0.967\nsamples = 47\nvalue = [0.0, 0.0, 0.0, 5.209, 0.0, 0.0, 2.081, 1.924, 39.589\n0.0]"] ;
423 -> 424 ;
425 [label="X[12] <= 1.689\nentropy = 0.534\nsamples = 42\nvalue = [0.0, 0.0, 0.0, 0.0, 0.0, 0.0, 2.081, 1.924, 39.589\n0.0]"] ;
424 -> 425 ;
426 [label="X[7] <= -0.467\nentropy = 0.175\nsamples = 38\nvalue = [0.0, 0.0, 0.0, 0.0, 0.0, 0.0, 1.041, 0.0, 38.548\n0.0]"] ;
425 -> 426 ;
427 [label="entropy = 0.0\nsamples = 1\nvalue = [0.0, 0.0, 0.0, 0.0, 0.0, 0.0, 1.041, 0.0, 0.0, 0.0]"] ;
426 -> 427 ;
428 [label="entropy = 0.0\nsamples = 37\nvalue = [0.0, 0.0, 0.0, 0.0, 0.0, 0.0, 0.0, 0.0, 38.548, 0.0]"] ;
426 -> 428 ;
429 [label="X[8] <= -0.62\nentropy = 1.519\nsamples = 4\nvalue = [0.0, 0.0, 0.0, 0.0, 0.0, 0.0, 1.041, 1.924, 1.042\n0.0]"] ;
425 -> 429 ;
430 [label="X[6] <= -1.389\nentropy = 1.0\nsamples = 2\nvalue = [0.0, 0.0, 0.0, 0.0, 0.0, 0.0, 1.041, 0.0, 1.042, 0.0]"] ;
429 -> 430 ;
431 [label="entropy = 0.0\nsamples = 1\nvalue = [0.0, 0.0, 0.0, 0.0, 0.0, 0.0, 0.0, 0.0, 1.042, 0.0]"] ;
430 -> 431 ;
432 [label="entropy = 0.0\nsamples = 1\nvalue = [0.0, 0.0, 0.0, 0.0, 0.0, 0.0, 1.041, 0.0, 0.0, 0.0]"] ;
430 -> 432 ;
433 [label="entropy = -0.0\nsamples = 2\nvalue = [0.0, 0.0, 0.0, 0.0, 0.0, 0.0, 0.0, 1.924, 0.0, 0.0]"] ;
429 -> 433 ;
434 [label="entropy = 0.0\nsamples = 5\nvalue = [0.0, 0.0, 0.0, 5.209, 0.0, 0.0, 0.0, 0.0, 0.0, 0.0]"] ;
424 -> 434 ;
435 [label="X[9] <= 0.062\nentropy = 1.215\nsamples = 84\nvalue = [0.0, 0.0, 0.0, 3.125, 0.0, 1.042, 2.081, 61.57, 13.544\n1.042]"] ;
423 -> 435 ;
436 [label="X[3] <= -0.036\nentropy = 0.471\nsamples = 69\nvalue = [0.0, 0.0, 0.0, 0.0, 0.0, 0.0, 2.081, 61.57, 3.125\n0.0]"] ;
435 -> 436 ;
437 [label="X[8] <= -1.046\nentropy = 0.919\nsamples = 3\nvalue = [0.0, 0.0, 0.0, 0.0, 0.0, 0.0, 2.081, 0.0, 1.042, 0.0]"] ;
436 -> 437 ;
438 [label="entropy = 0.0\nsamples = 1\nvalue = [0.0, 0.0, 0.0, 0.0, 0.0, 0.0, 0.0, 0.0, 1.042, 0.0]"] ;
437 -> 438 ;
439 [label="entropy = 0.0\nsamples = 2\nvalue = [0.0, 0.0, 0.0, 0.0, 0.0, 0.0, 2.081, 0.0, 0.0, 0.0]"] ;
437 -> 439 ;
440 [label="X[15] <= 0.928\nentropy = 0.208\nsamples = 66\nvalue = [0.0, 0.0, 0.0, 0.0, 0.0, 0.0, 0.0, 61.57, 2.084, 0.0]"] ;
436 -> 440 ;
441 [label="entropy = 0.0\nsamples = 64\nvalue = [0.0, 0.0, 0.0, 0.0, 0.0, 0.0, 0.0, 61.57, 0.0, 0.0]"] ;
440 -> 441 ;
442 [label="entropy = 0.0\nsamples = 2\nvalue = [0.0, 0.0, 0.0, 0.0, 0.0, 0.0, 0.0, 0.0, 2.084, 0.0]"] ;
440 -> 442 ;
443 [label="X[8] <= -0.061\nentropy = 1.375\nsamples = 15\nvalue = [0.0, 0.0, 0.0, 3.125, 0.0, 1.042, 0.0, 0.0, 10.418\n1.042]"] ;
435 -> 443 ;
444 [label="entropy = 0.0\nsamples = 10\nvalue = [0.0, 0.0, 0.0, 0.0, 0.0, 0.0, 0.0, 0.0, 10.418, 0.0]"] ;
443 -> 444 ;
445 [label="X[1] <= 0.488\nentropy = 1.371\nsamples = 5\nvalue = [0.0, 0.0, 0.0, 3.125, 0.0, 1.042, 0.0, 0.0, 0.0\n1.042]"] ;
443 -> 445 ;
446 [label="entropy = 0.0\nsamples = 3\nvalue = [0.0, 0.0, 0.0, 3.125, 0.0, 0.0, 0.0, 0.0, 0.0, 0.0]"] ;
445 -> 446 ;
447 [label="X[2] <= 1.496\nentropy = 1.0\nsamples = 2\nvalue = [0.0, 0.0, 0.0, 0.0, 0.0, 1.042, 0.0, 0.0, 0.0, 1.042]"] ;
445 -> 447 ;
448 [label="entropy = 0.0\nsamples = 1\nvalue = [0.0, 0.0, 0.0, 0.0, 0.0, 1.042, 0.0, 0.0, 0.0, 0.0]"] ;
447 -> 448 ;
449 [label="entropy = 0.0\nsamples = 1\nvalue = [0.0, 0.0, 0.0, 0.0, 0.0, 0.0, 0.0, 0.0, 0.0, 1.042]"] ;
447 -> 449 ;
450 [label="X[13] <= -0.919\nentropy = 0.19\nsamples = 706\nvalue = [0.0, 0.0, 14.415, 0.0, 0.0, 0.0, 0.0, 661.88, 3.125\n0.0]"] ;
422 -> 450 ;
451 [label="entropy = 0.0\nsamples = 14\nvalue = [0.0, 0.0, 13.454, 0.0, 0.0, 0.0, 0.0, 0.0, 0.0, 0.0]"] ;
450 -> 451 ;
452 [label="X[15] <= 1.194\nentropy = 0.059\nsamples = 692\nvalue = [0.0, 0.0, 0.961, 0.0, 0.0, 0.0, 0.0, 661.88, 3.125\n0.0]"] ;
450 -> 452 ;
453 [label="X[8] <= -1.648\nentropy = 0.016\nsamples = 689\nvalue = [0.0, 0.0, 0.961, 0.0, 0.0, 0.0, 0.0, 661.88, 0.0\n0.0]"] ;
452 -> 453 ;
454 [label="X[7] <= -0.567\nentropy = 0.918\nsamples = 3\nvalue = [0.0, 0.0, 0.961, 0.0, 0.0, 0.0, 0.0, 1.924, 0.0, 0.0]"] ;
453 -> 454 ;
455 [label="entropy = 0.0\nsamples = 2\nvalue = [0.0, 0.0, 0.0, 0.0, 0.0, 0.0, 0.0, 1.924, 0.0, 0.0]"] ;
454 -> 455 ;
456 [label="entropy = -0.0\nsamples = 1\nvalue = [0.0, 0.0, 0.961, 0.0, 0.0, 0.0, 0.0, 0.0, 0.0, 0.0]"] ;
454 -> 456 ;
457 [label="entropy = -0.0\nsamples = 686\nvalue = [0.0, 0.0, 0.0, 0.0, 0.0, 0.0, 0.0, 659.956, 0.0, 0.0]"] ;
453 -> 457 ;
458 [label="entropy = -0.0\nsamples = 3\nvalue = [0.0, 0.0, 0.0, 0.0, 0.0, 0.0, 0.0, 0.0, 3.125, 0.0]"] ;
452 -> 458 ;
459 [label="X[6] <= -0.913\nentropy = 1.505\nsamples = 700\nvalue = [36.557, 0.0, 0.961, 4.167, 0.0, 5.209, 382.938, 8.658\n276.084, 10.418]"] ;
421 -> 459 ;
460 [label="X[14] <= 0.438\nentropy = 0.688\nsamples = 407\nvalue = [34.633, 0.0, 0.0, 0.0, 0.0, 0.0, 365.248, 0.0, 20.836\n0.0]"] ;
459 -> 460 ;
461 [label="X[9] <= -0.067\nentropy = 0.18\nsamples = 360\nvalue = [0.962, 0.0, 0.0, 0.0, 0.0, 0.0, 365.248, 0.0, 8.335\n0.0]"] ;
460 -> 461 ;
462 [label="X[15] <= 1.376\nentropy = 0.026\nsamples = 352\nvalue = [0.962, 0.0, 0.0, 0.0, 0.0, 0.0, 365.248, 0.0, 0.0\n0.0]"] ;
461 -> 462 ;
463 [label="entropy = 0.0\nsamples = 351\nvalue = [0.0, 0.0, 0.0, 0.0, 0.0, 0.0, 365.248, 0.0, 0.0, 0.0]"] ;
462 -> 463 ;
464 [label="entropy = -0.0\nsamples = 1\nvalue = [0.962, 0.0, 0.0, 0.0, 0.0, 0.0, 0.0, 0.0, 0.0, 0.0]"] ;
462 -> 464 ;
465 [label="entropy = 0.0\nsamples = 8\nvalue = [0.0, 0.0, 0.0, 0.0, 0.0, 0.0, 0.0, 0.0, 8.335, 0.0]"] ;
461 -> 465 ;
466 [label="X[12] <= -0.065\nentropy = 0.843\nsamples = 47\nvalue = [33.671, 0.0, 0.0, 0.0, 0.0, 0.0, 0.0, 0.0, 12.502\n0.0]"] ;
460 -> 466 ;
467 [label="entropy = 0.0\nsamples = 12\nvalue = [0.0, 0.0, 0.0, 0.0, 0.0, 0.0, 0.0, 0.0, 12.502, 0.0]"] ;
466 -> 467 ;
468 [label="entropy = -0.0\nsamples = 35\nvalue = [33.671, 0.0, 0.0, 0.0, 0.0, 0.0, 0.0, 0.0, 0.0, 0.0]"] ;
466 -> 468 ;
469 [label="X[10] <= 0.051\nentropy = 1.022\nsamples = 293\nvalue = [1.924, 0.0, 0.961, 4.167, 0.0, 5.209, 17.69, 8.658\n255.247, 10.418]"] ;
459 -> 469 ;
470 [label="X[15] <= 0.662\nentropy = 0.291\nsamples = 249\nvalue = [1.924, 0.0, 0.961, 0.0, 0.0, 0.0, 0.0, 7.696, 247.954\n0.0]"] ;
469 -> 470 ;
471 [label="X[7] <= -0.2\nentropy = 1.224\nsamples = 34\nvalue = [1.924, 0.0, 0.961, 0.0, 0.0, 0.0, 0.0, 7.696, 23.962\n0.0]"] ;
470 -> 471 ;
472 [label="X[13] <= -0.016\nentropy = 0.941\nsamples = 10\nvalue = [0.0, 0.0, 0.961, 0.0, 0.0, 0.0, 0.0, 7.696, 1.042\n0.0]"] ;
471 -> 472 ;
473 [label="X[4] <= -0.26\nentropy = 0.999\nsamples = 2\nvalue = [0.0, 0.0, 0.961, 0.0, 0.0, 0.0, 0.0, 0.0, 1.042, 0.0]"] ;
472 -> 473 ;
474 [label="entropy = 0.0\nsamples = 1\nvalue = [0.0, 0.0, 0.0, 0.0, 0.0, 0.0, 0.0, 0.0, 1.042, 0.0]"] ;
473 -> 474 ;
475 [label="entropy = -0.0\nsamples = 1\nvalue = [0.0, 0.0, 0.961, 0.0, 0.0, 0.0, 0.0, 0.0, 0.0, 0.0]"] ;
473 -> 475 ;
476 [label="entropy = 0.0\nsamples = 8\nvalue = [0.0, 0.0, 0.0, 0.0, 0.0, 0.0, 0.0, 7.696, 0.0, 0.0]"] ;
472 -> 476 ;
477 [label="X[15] <= 0.229\nentropy = 0.393\nsamples = 24\nvalue = [1.924, 0.0, 0.0, 0.0, 0.0, 0.0, 0.0, 0.0, 22.92, 0.0]"] ;
471 -> 477 ;
478 [label="X[10] <= -1.516\nentropy = 0.959\nsamples = 5\nvalue = [1.924, 0.0, 0.0, 0.0, 0.0, 0.0, 0.0, 0.0, 3.125, 0.0]"] ;
477 -> 478 ;
479 [label="entropy = 0.0\nsamples = 2\nvalue = [0.0, 0.0, 0.0, 0.0, 0.0, 0.0, 0.0, 0.0, 2.084, 0.0]"] ;
478 -> 479 ;
480 [label="X[14] <= -0.425\nentropy = 0.935\nsamples = 3\nvalue = [1.924, 0.0, 0.0, 0.0, 0.0, 0.0, 0.0, 0.0, 1.042, 0.0]"] ;
478 -> 480 ;
481 [label="entropy = 0.0\nsamples = 1\nvalue = [0.0, 0.0, 0.0, 0.0, 0.0, 0.0, 0.0, 0.0, 1.042, 0.0]"] ;
480 -> 481 ;
482 [label="entropy = 0.0\nsamples = 2\nvalue = [1.924, 0.0, 0.0, 0.0, 0.0, 0.0, 0.0, 0.0, 0.0, 0.0]"] ;
480 -> 482 ;
483 [label="entropy = 0.0\nsamples = 19\nvalue = [0.0, 0.0, 0.0, 0.0, 0.0, 0.0, 0.0, 0.0, 19.795, 0.0]"] ;
477 -> 483 ;
484 [label="entropy = 0.0\nsamples = 215\nvalue = [0.0, 0.0, 0.0, 0.0, 0.0, 0.0, 0.0, 0.0, 223.992, 0.0]"] ;
470 -> 484 ;
485 [label="X[13] <= -0.663\nentropy = 2.228\nsamples = 44\nvalue = [0.0, 0.0, 0.0, 4.167, 0.0, 5.209, 17.69, 0.962, 7.293\n10.418]"] ;
469 -> 485 ;
486 [label="X[7] <= 0.918\nentropy = 1.467\nsamples = 19\nvalue = [0.0, 0.0, 0.0, 4.167, 0.0, 5.209, 0.0, 0.0, 0.0\n10.418]"] ;
485 -> 486 ;
487 [label="X[4] <= 0.135\nentropy = 0.991\nsamples = 9\nvalue = [0.0, 0.0, 0.0, 4.167, 0.0, 5.209, 0.0, 0.0, 0.0, 0.0]"] ;
486 -> 487 ;
488 [label="entropy = 0.0\nsamples = 5\nvalue = [0.0, 0.0, 0.0, 0.0, 0.0, 5.209, 0.0, 0.0, 0.0, 0.0]"] ;
487 -> 488 ;
489 [label="entropy = 0.0\nsamples = 4\nvalue = [0.0, 0.0, 0.0, 4.167, 0.0, 0.0, 0.0, 0.0, 0.0, 0.0]"] ;
487 -> 489 ;
490 [label="entropy = 0.0\nsamples = 10\nvalue = [0.0, 0.0, 0.0, 0.0, 0.0, 0.0, 0.0, 0.0, 0.0, 10.418]"] ;
486 -> 490 ;
491 [label="X[6] <= -0.225\nentropy = 1.068\nsamples = 25\nvalue = [0.0, 0.0, 0.0, 0.0, 0.0, 0.0, 17.69, 0.962, 7.293\n0.0]"] ;
485 -> 491 ;
492 [label="entropy = -0.0\nsamples = 17\nvalue = [0.0, 0.0, 0.0, 0.0, 0.0, 0.0, 17.69, 0.0, 0.0, 0.0]"] ;
491 -> 492 ;
493 [label="X[15] <= 0.48\nentropy = 0.519\nsamples = 8\nvalue = [0.0, 0.0, 0.0, 0.0, 0.0, 0.0, 0.0, 0.962, 7.293, 0.0]"] ;
491 -> 493 ;
494 [label="entropy = 0.0\nsamples = 1\nvalue = [0.0, 0.0, 0.0, 0.0, 0.0, 0.0, 0.0, 0.962, 0.0, 0.0]"] ;
493 -> 494 ;
495 [label="entropy = 0.0\nsamples = 7\nvalue = [0.0, 0.0, 0.0, 0.0, 0.0, 0.0, 0.0, 0.0, 7.293, 0.0]"] ;
493 -> 495 ;
496 [label="X[8] <= 0.012\nentropy = 1.644\nsamples = 1876\nvalue = [808.109, 0.0, 0.0, 0.0, 0.0, 520.912, 3.122, 0.962\n533.414, 20.836]"] ;
420 -> 496 ;
497 [label="X[14] <= 1.168\nentropy = 1.147\nsamples = 991\nvalue = [20.203, 0.0, 0.0, 0.0, 0.0, 520.912, 2.081, 0.962\n486.532, 0.0]"] ;
496 -> 497 ;
498 [label="X[12] <= -1.549\nentropy = 0.521\nsamples = 471\nvalue = [20.203, 0.0, 0.0, 0.0, 0.0, 20.836, 1.041, 0.0\n446.943, 0.0]"] ;
497 -> 498 ;
499 [label="X[1] <= -0.995\nentropy = 0.276\nsamples = 21\nvalue = [0.0, 0.0, 0.0, 0.0, 0.0, 20.836, 0.0, 0.0, 1.042\n0.0]"] ;
498 -> 499 ;
500 [label="entropy = 0.0\nsamples = 1\nvalue = [0.0, 0.0, 0.0, 0.0, 0.0, 0.0, 0.0, 0.0, 1.042, 0.0]"] ;
499 -> 500 ;
501 [label="entropy = 0.0\nsamples = 20\nvalue = [0.0, 0.0, 0.0, 0.0, 0.0, 20.836, 0.0, 0.0, 0.0, 0.0]"] ;
499 -> 501 ;
502 [label="X[4] <= -0.758\nentropy = 0.28\nsamples = 450\nvalue = [20.203, 0.0, 0.0, 0.0, 0.0, 0.0, 1.041, 0.0, 445.901\n0.0]"] ;
498 -> 502 ;
503 [label="X[10] <= 0.332\nentropy = 1.094\nsamples = 51\nvalue = [20.203, 0.0, 0.0, 0.0, 0.0, 0.0, 1.041, 0.0, 30.213\n0.0]"] ;
502 -> 503 ;
504 [label="entropy = 0.0\nsamples = 25\nvalue = [0.0, 0.0, 0.0, 0.0, 0.0, 0.0, 0.0, 0.0, 26.046, 0.0]"] ;
503 -> 504 ;
505 [label="X[3] <= -1.339\nentropy = 0.88\nsamples = 26\nvalue = [20.203, 0.0, 0.0, 0.0, 0.0, 0.0, 1.041, 0.0, 4.167\n0.0]"] ;
503 -> 505 ;
506 [label="entropy = 0.0\nsamples = 4\nvalue = [0.0, 0.0, 0.0, 0.0, 0.0, 0.0, 0.0, 0.0, 4.167, 0.0]"] ;
505 -> 506 ;
507 [label="X[15] <= 0.928\nentropy = 0.282\nsamples = 22\nvalue = [20.203, 0.0, 0.0, 0.0, 0.0, 0.0, 1.041, 0.0, 0.0\n0.0]"] ;
505 -> 507 ;
508 [label="entropy = 0.0\nsamples = 1\nvalue = [0.0, 0.0, 0.0, 0.0, 0.0, 0.0, 1.041, 0.0, 0.0, 0.0]"] ;
507 -> 508 ;
509 [label="entropy = 0.0\nsamples = 21\nvalue = [20.203, 0.0, 0.0, 0.0, 0.0, 0.0, 0.0, 0.0, 0.0, 0.0]"] ;
507 -> 509 ;
510 [label="entropy = -0.0\nsamples = 399\nvalue = [0.0, 0.0, 0.0, 0.0, 0.0, 0.0, 0.0, 0.0, 415.688, 0.0]"] ;
502 -> 510 ;
511 [label="X[13] <= 1.189\nentropy = 0.416\nsamples = 520\nvalue = [0.0, 0.0, 0.0, 0.0, 0.0, 500.076, 1.041, 0.962, 39.589\n0.0]"] ;
497 -> 511 ;
512 [label="X[5] <= -0.942\nentropy = 0.594\nsamples = 43\nvalue = [0.0, 0.0, 0.0, 0.0, 0.0, 4.167, 0.0, 0.962, 39.589\n0.0]"] ;
511 -> 512 ;
513 [label="entropy = 0.0\nsamples = 4\nvalue = [0.0, 0.0, 0.0, 0.0, 0.0, 4.167, 0.0, 0.0, 0.0, 0.0]"] ;
512 -> 513 ;
514 [label="X[11] <= 0.387\nentropy = 0.162\nsamples = 39\nvalue = [0.0, 0.0, 0.0, 0.0, 0.0, 0.0, 0.0, 0.962, 39.589\n0.0]"] ;
512 -> 514 ;
515 [label="entropy = 0.0\nsamples = 38\nvalue = [0.0, 0.0, 0.0, 0.0, 0.0, 0.0, 0.0, 0.0, 39.589, 0.0]"] ;
514 -> 515 ;
516 [label="entropy = -0.0\nsamples = 1\nvalue = [0.0, 0.0, 0.0, 0.0, 0.0, 0.0, 0.0, 0.962, 0.0, 0.0]"] ;
514 -> 516 ;
517 [label="X[5] <= -0.406\nentropy = 0.022\nsamples = 477\nvalue = [0.0, 0.0, 0.0, 0.0, 0.0, 495.909, 1.041, 0.0, 0.0\n0.0]"] ;
511 -> 517 ;
518 [label="entropy = 0.0\nsamples = 428\nvalue = [0.0, 0.0, 0.0, 0.0, 0.0, 445.901, 0.0, 0.0, 0.0, 0.0]"] ;
517 -> 518 ;
519 [label="X[6] <= -0.143\nentropy = 0.144\nsamples = 49\nvalue = [0.0, 0.0, 0.0, 0.0, 0.0, 50.008, 1.041, 0.0, 0.0\n0.0]"] ;
517 -> 519 ;
520 [label="entropy = 0.0\nsamples = 1\nvalue = [0.0, 0.0, 0.0, 0.0, 0.0, 0.0, 1.041, 0.0, 0.0, 0.0]"] ;
519 -> 520 ;
521 [label="entropy = 0.0\nsamples = 48\nvalue = [0.0, 0.0, 0.0, 0.0, 0.0, 50.008, 0.0, 0.0, 0.0, 0.0]"] ;
519 -> 521 ;
522 [label="X[14] <= 0.39\nentropy = 0.483\nsamples = 885\nvalue = [787.907, 0.0, 0.0, 0.0, 0.0, 0.0, 1.041, 0.0, 46.882\n20.836]"] ;
496 -> 522 ;
523 [label="X[2] <= 0.528\nentropy = 0.169\nsamples = 823\nvalue = [775.4, 0.0, 0.0, 0.0, 0.0, 0.0, 1.041, 0.0, 15.627\n1.042]"] ;
522 -> 523 ;
524 [label="X[10] <= -0.806\nentropy = 0.091\nsamples = 814\nvalue = [775.4, 0.0, 0.0, 0.0, 0.0, 0.0, 0.0, 0.0, 7.293\n1.042]"] ;
523 -> 524 ;
525 [label="entropy = 0.0\nsamples = 4\nvalue = [0.0, 0.0, 0.0, 0.0, 0.0, 0.0, 0.0, 0.0, 4.167, 0.0]"] ;
524 -> 525 ;
526 [label="X[4] <= -0.187\nentropy = 0.052\nsamples = 810\nvalue = [775.4, 0.0, 0.0, 0.0, 0.0, 0.0, 0.0, 0.0, 3.125\n1.042]"] ;
524 -> 526 ;
527 [label="entropy = 0.0\nsamples = 744\nvalue = [715.754, 0.0, 0.0, 0.0, 0.0, 0.0, 0.0, 0.0, 0.0, 0.0]"] ;
526 -> 527 ;
528 [label="X[5] <= -1.385\nentropy = 0.401\nsamples = 66\nvalue = [59.646, 0.0, 0.0, 0.0, 0.0, 0.0, 0.0, 0.0, 3.125\n1.042]"] ;
526 -> 528 ;
529 [label="entropy = 0.0\nsamples = 62\nvalue = [59.646, 0.0, 0.0, 0.0, 0.0, 0.0, 0.0, 0.0, 0.0, 0.0]"] ;
528 -> 529 ;
530 [label="X[5] <= -1.108\nentropy = 0.811\nsamples = 4\nvalue = [0.0, 0.0, 0.0, 0.0, 0.0, 0.0, 0.0, 0.0, 3.125, 1.042]"] ;
528 -> 530 ;
531 [label="entropy = 0.0\nsamples = 1\nvalue = [0.0, 0.0, 0.0, 0.0, 0.0, 0.0, 0.0, 0.0, 0.0, 1.042]"] ;
530 -> 531 ;
532 [label="entropy = 0.0\nsamples = 3\nvalue = [0.0, 0.0, 0.0, 0.0, 0.0, 0.0, 0.0, 0.0, 3.125, 0.0]"] ;
530 -> 532 ;
533 [label="X[9] <= -0.543\nentropy = 0.503\nsamples = 9\nvalue = [0.0, 0.0, 0.0, 0.0, 0.0, 0.0, 1.041, 0.0, 8.335, 0.0]"] ;
523 -> 533 ;
534 [label="entropy = 0.0\nsamples = 1\nvalue = [0.0, 0.0, 0.0, 0.0, 0.0, 0.0, 1.041, 0.0, 0.0, 0.0]"] ;
533 -> 534 ;
535 [label="entropy = 0.0\nsamples = 8\nvalue = [0.0, 0.0, 0.0, 0.0, 0.0, 0.0, 0.0, 0.0, 8.335, 0.0]"] ;
533 -> 535 ;
536 [label="X[5] <= -0.683\nentropy = 1.489\nsamples = 62\nvalue = [12.506, 0.0, 0.0, 0.0, 0.0, 0.0, 0.0, 0.0, 31.255\n19.795]"] ;
522 -> 536 ;
537 [label="X[11] <= 1.124\nentropy = 0.949\nsamples = 31\nvalue = [11.544, 0.0, 0.0, 0.0, 0.0, 0.0, 0.0, 0.0, 0.0\n19.795]"] ;
536 -> 537 ;
538 [label="entropy = 0.0\nsamples = 12\nvalue = [11.544, 0.0, 0.0, 0.0, 0.0, 0.0, 0.0, 0.0, 0.0, 0.0]"] ;
537 -> 538 ;
539 [label="entropy = 0.0\nsamples = 19\nvalue = [0.0, 0.0, 0.0, 0.0, 0.0, 0.0, 0.0, 0.0, 0.0, 19.795]"] ;
537 -> 539 ;
540 [label="X[6] <= -0.897\nentropy = 0.194\nsamples = 31\nvalue = [0.962, 0.0, 0.0, 0.0, 0.0, 0.0, 0.0, 0.0, 31.255\n0.0]"] ;
536 -> 540 ;
541 [label="entropy = 0.0\nsamples = 1\nvalue = [0.962, 0.0, 0.0, 0.0, 0.0, 0.0, 0.0, 0.0, 0.0, 0.0]"] ;
540 -> 541 ;
542 [label="entropy = -0.0\nsamples = 30\nvalue = [0.0, 0.0, 0.0, 0.0, 0.0, 0.0, 0.0, 0.0, 31.255, 0.0]"] ;
540 -> 542 ;
}