k,GMM,Kmeans
2,0.32967436473458717,0.3420420045666782
3,0.3299261270557054,0.3493700812276905
4,0.3451026507900713,0.403412183751748
5,0.38869669343941476,0.42114905829911564
6,0.39554045882673877,0.4409312309368935
7,0.43650850844805417,0.45859402358364065
8,0.450297629638206,0.46714601123246907
9,0.40257428060851963,0.4226161496622219
10,0.37335699200003136,0.3961279466289173
15,0.3248196210377426,0.3679593651647671
20,0.27484852239020696,0.3523735479024669
25,0.2296908783881601,0.33370072610189844
30,0.2538706492689261,0.3050649873071977
35,0.23272260558560198,0.29227848284636454
40,0.2236228216480683,0.2918909707416969
