iterations,fitness,time,fevals
0,18.0,0.001931063,550
10,27.0,0.004257979,1004
20,27.0,0.005733931,1441
30,26.0,0.007170771,1884
40,27.0,0.008579563,2347
50,28.0,0.009975317,2806
60,28.0,0.012666085,3264
70,29.0,0.014085542,3731
80,29.0,0.016002778,4200
90,29.0,0.017639125,4646
100,29.0,0.019092953,5106
110,29.0,0.020592608,5556
120,30.0,0.021964658,6004
130,31.0,0.023349746,6446
140,31.0,0.026057501,6898
150,33.0,0.027491182,7362
160,33.0,0.028999924,7823
170,30.0,0.030404765,8279
180,34.0,0.031937606,8734
190,35.0,0.033313211,9181
200,34.0,0.034802199,9646
210,35.0,0.036310941,10096
220,36.0,0.039018302,10557
230,36.0,0.040405365,11012
240,35.0,0.041786107,11478
250,37.0,0.043202405,11941
260,38.0,0.044742357,12395
270,37.0,0.046117963,12849
280,37.0,0.047477371,13306
290,36.0,0.048847051,13768
300,36.0,0.051522806,14220
310,36.0,0.053154017,14674
320,37.0,0.054755599,15141
330,37.0,0.056175056,15606
340,37.0,0.057579897,16068
350,37.0,0.058956688,16518
360,37.0,0.060348096,16983
370,37.0,0.062073332,17439
380,37.0,0.065338915,17883
390,38.0,0.066701088,18339
400,38.0,0.068084991,18799
410,39.0,0.069475215,19257
420,39.0,0.070885192,19727
430,39.0,0.072482428,20185
440,38.0,0.073898726,20641
450,39.0,0.075441444,21093
460,37.0,0.07828273,21552
470,37.0,0.079727076,22018
480,37.0,0.081878979,22473
490,37.0,0.083301993,22950
500,37.0,0.08490634,23418
510,36.0,0.086319082,23880
520,37.0,0.087736565,24340
530,38.0,0.08936343,24794
540,38.0,0.092199976,25246
550,38.0,0.094553756,25707
560,41.0,0.096410153,26161
570,42.0,0.098040574,26632
580,41.0,0.099447391,27089
590,41.0,0.100854602,27547
600,42.0,0.102269319,28011
610,45.0,0.103659543,28466
620,43.0,0.106520978,28920
630,44.0,0.107916732,29364
640,44.0,0.1093034,29810
650,45.0,0.110729179,30271
660,46.0,0.112100439,30724
670,46.0,0.113511205,31202
680,45.0,0.115068934,31657
690,46.0,0.116776788,32114
700,47.0,0.119396445,32571
710,47.0,0.120790224,33030
720,47.0,0.122190719,33486
730,47.0,0.123570275,33938
740,47.0,0.125390721,34390
750,46.0,0.126820055,34848
760,47.0,0.128208303,35298
770,47.0,0.129596946,35735
780,47.0,0.13229443,36191
790,48.0,0.133686234,36648
800,48.0,0.135363273,37097
810,49.0,0.136692262,37547
820,49.0,0.138074189,38002
830,49.0,0.139775327,38449
840,48.0,0.141336217,38906
850,49.0,0.142758836,39361
860,49.0,0.144179479,39836
870,48.0,0.14746126,40303
880,48.0,0.14882857,40758
890,49.0,0.150265411,41220
900,48.0,0.151887141,41674
910,49.0,0.153230747,42116
920,49.0,0.154585415,42568
930,48.0,0.155984725,43028
940,49.0,0.157370602,43479
950,49.0,0.159995394,43925
960,49.0,0.161996778,44378
970,49.0,0.164430755,44826
980,49.0,0.165847448,45278
990,49.0,0.16735145,45737
1000,50.0,0.168766563,46200
1010,50.0,0.170200638,46651
1020,51.0,0.171602318,47111
1030,50.0,0.174428592,47564
1040,50.0,0.175810124,48020
1050,49.0,0.17722089,48489
1060,49.0,0.178625336,48948
1070,49.0,0.180004892,49399
1080,49.0,0.18139235,49853
1090,47.0,0.183073734,50300
1100,48.0,0.184416945,50751
1110,47.0,0.186988404,51203
1120,47.0,0.18836322,51669
1130,47.0,0.189734085,52121
1140,48.0,0.191808555,52579
1150,48.0,0.193189297,53047
1160,48.0,0.194557792,53493
1170,47.0,0.19594604,53948
1180,47.0,0.197335473,54404
1190,48.0,0.199986339,54859
1200,48.0,0.202019329,55317
1210,48.0,0.203389009,55765
1220,48.0,0.204738145,56204
1230,48.0,0.20613706,56671
1240,48.0,0.207512271,57127
1250,49.0,0.208912766,57591
1260,49.0,0.210266644,58044
1270,49.0,0.213527486,58502
1280,50.0,0.214900326,58954
1290,50.0,0.216285809,59423
1300,50.0,0.217652329,59883
1310,50.0,0.219611836,60343
1320,50.0,0.221248973,60798
1330,51.0,0.222663295,61259
1340,51.0,0.224203642,61721
1350,50.0,0.2268952,62190
1360,49.0,0.228292534,62653
1370,49.0,0.229660239,63106
1380,49.0,0.23135703,63559
1390,48.0,0.232714069,64011
1400,49.0,0.234040292,64463
1410,48.0,0.235537577,64918
1420,47.0,0.237213035,65368
1430,48.0,0.240356149,65839
1440,47.0,0.241714372,66291
1450,47.0,0.24373551,66772
1460,47.0,0.245090573,67224
1470,48.0,0.246464203,67678
1480,48.0,0.247976105,68137
1490,48.0,0.249359217,68609
1500,48.0,0.250760502,69055
1510,48.0,0.25345206,69502
1520,48.0,0.254828457,69955
1530,54.0,0.256197742,70415
1540,54.0,0.2577132,70885
1550,54.0,0.259052856,71339
1560,57.0,0.260435573,71792
1570,58.0,0.262205846,72251
1580,57.0,0.263627279,72711
1590,58.0,0.266444467,73166
1600,58.0,0.268401209,73610
1610,58.0,0.269753111,74064
1620,59.0,0.271573557,74513
1630,58.0,0.273089016,74974
1640,59.0,0.274452375,75424
1650,60.0,0.276484179,75887
1660,57.0,0.278050205,76340
1670,57.0,0.281205565,76805
1680,57.0,0.283176134,77260
1690,57.0,0.284584135,77717
1700,58.0,0.285948679,78171
1710,58.0,0.287303742,78630
1720,56.0,0.288636681,79076
1730,55.0,0.290056929,79535
1740,55.0,0.291410807,79985
1750,53.0,0.294076686,80451
1760,54.0,0.295451107,80909
1770,53.0,0.297013183,81351
1780,52.0,0.298545629,81806
1790,52.0,0.300447458,82269
1800,55.0,0.301871262,82725
1810,55.0,0.303275707,83201
1820,55.0,0.304643017,83657
1830,55.0,0.307707118,84108
1840,56.0,0.309077589,84564
1850,54.0,0.310459121,85021
1860,55.0,0.311832357,85472
1870,55.0,0.313196506,85930
1880,56.0,0.314548803,86375
1890,56.0,0.315892409,86829
1900,55.0,0.317913941,87270
1910,57.0,0.319534485,87728
1920,56.0,0.320952758,88171
1930,56.0,0.322607277,88627
1940,56.0,0.323964315,89090
1950,56.0,0.325336761,89556
1960,56.0,0.326798096,90016
1970,56.0,0.328174097,90489
1980,56.0,0.329616074,90922
1990,56.0,0.331207383,91381
2000,56.0,0.333865361,91829
2010,57.0,0.335382399,92290
2020,58.0,0.337223783,92745
2030,58.0,0.338602549,93200
2040,57.0,0.340059143,93646
2050,56.0,0.341454107,94113
2060,57.0,0.342801268,94563
2070,58.0,0.344194257,95027
2080,58.0,0.347331445,95490
2090,57.0,0.348696385,95947
2100,57.0,0.350237522,96411
2110,57.0,0.351621424,96862
2120,57.0,0.352986759,97312
2130,57.0,0.354403847,97777
2140,57.0,0.356352688,98231
2150,56.0,0.359280493,98675
2160,57.0,0.3619041,99136
2170,57.0,0.363276941,99600
2180,57.0,0.364800301,100066
2190,57.0,0.36616208,100529
2200,57.0,0.367522673,100985
2210,56.0,0.368878921,101448
2220,56.0,0.370223712,101903
2230,57.0,0.371594577,102364
2240,57.0,0.375399025,102824
2250,57.0,0.376776607,103279
2260,60.0,0.378159324,103752
2270,56.0,0.379519523,104206
2280,56.0,0.380875771,104652
2290,57.0,0.382320908,105112
2300,59.0,0.383792119,105564
2310,56.0,0.38526096,106019
2320,57.0,0.38783874,106473
2330,58.0,0.389239629,106948
2340,58.0,0.39058442,107405
2350,58.0,0.391944224,107858
2360,58.0,0.393279138,108304
2370,58.0,0.395195979,108769
2380,58.0,0.397729907,109214
2390,59.0,0.399098797,109675
2400,58.0,0.401932972,110143
2410,57.0,0.404354702,110601
2420,57.0,0.405737419,111064
2430,57.0,0.407109469,111517
2440,56.0,0.408470458,111966
2450,58.0,0.409825521,112418
2460,56.0,0.411179398,112873
2470,56.0,0.412861968,113335
2480,57.0,0.416068292,113792
2490,57.0,0.418355701,114251
2500,57.0,0.41975027,114693
2510,57.0,0.421240839,115133
2520,57.0,0.422569827,115581
2530,58.0,0.424057631,116032
2540,56.0,0.425534768,116493
2550,56.0,0.426993338,116941
2560,57.0,0.42958376,117399
2570,56.0,0.430932897,117860
2580,57.0,0.432385935,118317
2590,56.0,0.433744948,118766
2600,57.0,0.43525606,119231
2610,57.0,0.436804308,119683
2620,57.0,0.438151075,120132
2630,58.0,0.439525496,120595
2640,59.0,0.442129745,121056
2650,59.0,0.44346703,121503
2660,59.0,0.445022389,121964
2670,59.0,0.446917107,122430
2680,59.0,0.448209355,122878
2690,60.0,0.449590097,123336
2700,60.0,0.452372519,123795
2710,60.0,0.453754446,124258
2720,60.0,0.456277312,124719
2730,66.0,0.457619338,125193
2740,68.0,0.458919487,125638
2750,66.0,0.460828822,126089
2760,66.0,0.462193366,126532
2770,59.0,0.463546453,126995
2780,57.0,0.465047294,127455
2790,57.0,0.466504283,127907
2800,59.0,0.46896473,128372
2810,58.0,0.470275545,128822
2820,62.0,0.471583596,129270
2830,58.0,0.472940634,129743
2840,61.0,0.474381425,130194
2850,60.0,0.476076241,130638
2860,59.0,0.47740839,131085
2870,60.0,0.479000095,131539
2880,60.0,0.482101727,131991
2890,61.0,0.483430716,132448
2900,60.0,0.484736396,132893
2910,60.0,0.486061039,133341
2920,60.0,0.487367114,133780
2930,59.0,0.48870914,134245
2940,59.0,0.490169684,134698
2950,61.0,0.491543709,135158
2960,61.0,0.494744897,135614
2970,60.0,0.496089293,136066
2980,61.0,0.49743764,136528
2990,59.0,0.498801,136992
3000,59.0,0.500192804,137433
3010,61.0,0.50201483,137888
3020,60.0,0.503340263,138350
3030,60.0,0.504667671,138802
3040,59.0,0.506010882,139256
3050,59.0,0.508570094,139704
3060,60.0,0.509965848,140154
3070,59.0,0.511658689,140623
3080,59.0,0.513038245,141080
3090,59.0,0.514580962,141529
3100,60.0,0.51590837,141983
3110,59.0,0.517270544,142440
3120,59.0,0.518623631,142906
3130,58.0,0.521043781,143356
3140,60.0,0.522385411,143820
3150,61.0,0.523711239,144274
3160,61.0,0.525717364,144735
3170,63.0,0.527033316,145184
3180,61.0,0.528376922,145653
3190,64.0,0.530010504,146103
3200,62.0,0.531346209,146551
3210,63.0,0.534149569,146994
3220,63.0,0.53558562,147448
3230,62.0,0.53692251,147900
3240,62.0,0.538282313,148361
3250,63.0,0.539916289,148802
3260,63.0,0.541270167,149272
3270,66.0,0.542607847,149728
3280,66.0,0.544016243,150185
3290,61.0,0.546793134,150649
3300,62.0,0.548128049,151109
3310,62.0,0.549831952,151559
3320,63.0,0.551239953,152004
3330,62.0,0.552601336,152458
3340,64.0,0.553963115,152905
3350,65.0,0.555329634,153364
3360,65.0,0.556691807,153827
3370,65.0,0.559621982,154292
3380,66.0,0.560971909,154751
3390,66.0,0.562311959,155211
3400,66.0,0.563818726,155668
3410,66.0,0.565180504,156131
3420,67.0,0.566487369,156582
3430,67.0,0.567797,157033
3440,68.0,0.569206976,157490
3450,67.0,0.571641349,157930
3460,67.0,0.573003127,158382
3470,66.0,0.574726782,158831
3480,68.0,0.576313746,159284
3490,67.0,0.577647475,159744
3500,67.0,0.579102884,160205
3510,67.0,0.580414885,160663
3520,68.0,0.581835133,161123
3530,68.0,0.58439237,161589
3540,68.0,0.585705556,162045
3550,68.0,0.587001755,162513
3560,66.0,0.588501806,162967
3570,68.0,0.589826054,163419
3580,67.0,0.59158092,163881
3590,71.0,0.592923341,164329
3600,71.0,0.594260626,164796
3610,71.0,0.597057271,165240
3620,70.0,0.598779347,165688
3630,72.0,0.600115446,166146
3640,75.0,0.601439694,166606
3650,76.0,0.602741029,167065
3660,77.0,0.604793376,167521
3670,80.0,0.606086414,167965
3680,80.0,0.607819157,168421
3690,80.0,0.61098874,168871
3700,77.0,0.612290074,169316
3710,77.0,0.613739556,169776
3720,78.0,0.615197335,170237
3730,78.0,0.616487607,170692
3740,77.0,0.617972645,171147
3750,78.0,0.619290967,171603
3760,78.0,0.620608894,172064
3770,78.0,0.623462822,172513
3780,78.0,0.624781935,172962
3790,78.0,0.626091171,173417
3800,77.0,0.62751932,173884
3810,78.0,0.628840013,174352
3820,78.0,0.630131866,174805
3830,79.0,0.631395275,175234
3840,79.0,0.632686733,175684
3850,78.0,0.635241204,176151
3860,78.0,0.636548464,176616
3870,81.0,0.638318342,177054
3880,79.0,0.640051479,177496
3890,79.0,0.641691382,177938
3900,82.0,0.64301958,178415
3910,81.0,0.644777211,178879
3920,81.0,0.646097508,179322
3930,81.0,0.648634202,179784
3940,83.0,0.649904721,180230
3950,82.0,0.65120092,180686
3960,83.0,0.652485266,181144
3970,83.0,0.653758946,181590
3980,82.0,0.655056724,182052
3990,83.0,0.656691096,182492
4000,83.0,0.657995196,182959
4010,83.0,0.660416531,183398
4020,83.0,0.661884582,183860
4030,83.0,0.663313917,184306
4040,83.0,0.665040733,184756
4050,83.0,0.666381178,185219
4060,84.0,0.66801713,185678
4070,84.0,0.669355996,186139
4080,84.0,0.671058319,186589
4090,84.0,0.672333579,187045
4100,83.0,0.673614765,187503
4110,84.0,0.675005779,187963
4120,82.0,0.676300793,188408
4130,83.0,0.677594621,188857
4140,82.0,0.679373586,189313
4150,83.0,0.680708501,189784
4160,82.0,0.682029589,190238
4170,82.0,0.683358577,190701
4180,82.0,0.685822579,191156
4190,83.0,0.687763914,191615
4200,82.0,0.689506138,192084
4210,81.0,0.690819324,192538
4220,81.0,0.69213488,192999
4230,83.0,0.693447671,193463
4240,78.0,0.694762833,193925
4250,82.0,0.696076019,194390
4260,79.0,0.699363725,194843
4270,80.0,0.700682837,195294
4280,80.0,0.701979035,195754
4290,80.0,0.703244024,196201
4300,81.0,0.704572223,196660
4310,80.0,0.705895681,197133
4320,80.0,0.707186349,197575
4330,82.0,0.709311782,198037
4340,83.0,0.711791191,198492
4350,80.0,0.713074748,198935
4360,80.0,0.714355934,199388
4370,80.0,0.715654504,199839
4380,81.0,0.717388826,200297
4390,78.0,0.719837816,200742
4400,79.0,0.72132799,201201
4410,83.0,0.722641571,201658
4420,78.0,0.725078709,202111
4430,80.0,0.727372834,202562
4440,84.0,0.72903091,203014
4450,85.0,0.73033738,203468
4460,84.0,0.731622122,203914
4470,84.0,0.733319703,204369
4480,84.0,0.734611556,204822
4490,84.0,0.736008496,205294
4500,84.0,0.739479906,205750
4510,83.0,0.740887512,206192
4520,84.0,0.742164748,206639
4530,84.0,0.743777392,207088
4540,84.0,0.745126529,207538
4550,84.0,0.746429443,207997
4560,83.0,0.748014432,208445
4570,83.0,0.74940505,208890
4580,83.0,0.751858385,209343
4590,82.0,0.75313404,209786
4600,84.0,0.754423523,210235
4610,83.0,0.755702338,210684
4620,83.0,0.756989845,211136
4630,83.0,0.758389154,211583
4640,82.0,0.75969918,212037
4650,83.0,0.761014341,212495
4660,84.0,0.763753701,212950
4670,83.0,0.765025011,213401
4680,81.0,0.766304222,213846
4690,81.0,0.76801484,214305
4700,81.0,0.76928694,214751
4710,82.0,0.771108176,215213
4720,81.0,0.77252961,215669
4730,81.0,0.773977512,216130
4740,82.0,0.77718028,216591
4750,83.0,0.778531392,217038
4760,83.0,0.779912924,217483
4770,82.0,0.781215049,217946
4780,83.0,0.783043001,218397
4790,83.0,0.784454163,218844
4800,80.0,0.785756288,219294
4810,75.0,0.787045376,219746
4820,78.0,0.789779995,220209
4830,81.0,0.791408835,220657
4840,76.0,0.792889923,221110
4850,74.0,0.794327158,221562
4860,74.0,0.795751752,222013
4870,75.0,0.797139209,222467
4880,75.0,0.798779902,222938
4890,73.0,0.800300891,223400
4900,73.0,0.803300597,223865
4910,73.0,0.804614968,224305
4920,75.0,0.805966871,224771
4930,75.0,0.807333786,225222
4940,75.0,0.808810923,225683
4950,76.0,0.810293591,226118
4960,75.0,0.811999469,226570
4970,76.0,0.813776063,227030
4980,75.0,0.816225448,227492
4990,75.0,0.817797794,227950
5000,75.0,0.819142585,228395
