iterations,fitness,time,fevals
0,23.0,0.002022322,727
10,27.0,0.004056496,1365
20,29.0,0.00591052200001,2001
30,29.0,0.00786647400001,2636
40,29.0,0.01026371,3269
50,31.0,0.011979464,3889
60,30.0,0.013650576,4514
70,30.0,0.017562875,5139
80,31.0,0.019330777,5777
90,32.0,0.021067075,6411
100,32.0,0.022888311,7018
110,32.0,0.024692164,7647
120,33.0,0.026558832,8287
130,33.0,0.028320018,8923
140,33.0,0.03008634,9562
150,33.0,0.03349375,10196
160,33.0,0.035222936,10814
170,33.0,0.037085259,11448
180,32.0,0.038840125,12068
190,32.0,0.040720225,12688
200,32.0,0.042458893,13309
210,33.0,0.044237068,13933
220,33.0,0.0460440820001,14556
230,34.0,0.0490580100001,15183
240,35.0,0.05147974,15816
250,33.0,0.0532259140001,16443
260,34.0,0.0549392980001,17068
270,34.0,0.056581175,17699
280,35.0,0.058240436,18316
290,34.0,0.060041129,18948
300,33.0,0.062204489,19582
310,35.0,0.065223553,20204
320,34.0,0.066913628,20839
330,35.0,0.068606864,21479
340,34.0,0.07110168,22109
350,33.0,0.072807162,22750
360,34.0,0.074480249,23393
370,35.0,0.076134769,24026
380,33.0,0.077780203,24645
390,34.0,0.081658527,25273
400,33.0,0.083343072,25905
410,33.0,0.085255567,26541
420,34.0,0.087007272,27173
430,35.0,0.088708804,27800
440,34.0,0.0903961130001,28421
450,33.0,0.092100806,29052
460,33.0,0.094390586,29689
470,35.0,0.0978493550001,30332
480,35.0,0.0995951340001,30958
490,35.0,0.101276913,31587
500,39.0,0.102951976,32219
510,41.0,0.104596224,32843
520,44.0,0.106552176,33479
530,44.0,0.108231585,34102
540,46.0,0.111123439,34731
550,45.0,0.112844329,35360
560,50.0,0.11456601,35989
570,47.0,0.117255988,36624
580,46.0,0.118935001,37251
590,46.0,0.120577274,37869
600,47.0,0.122233769,38507
610,47.0,0.12387051,39136
620,47.0,0.126952784,39773
630,47.0,0.128625872,40406
640,47.0,0.130302121,41037
650,48.0,0.131977184,41659
660,48.0,0.133666469,42288
670,46.0,0.135966125,42918
680,46.0,0.137649484,43541
690,50.0,0.13934035,44171
700,46.0,0.142263414,44803
710,49.0,0.144743613,45433
720,50.0,0.146973343,46067
730,49.0,0.148661443,46696
740,50.0,0.150380753,47325
750,50.0,0.152134828,47970
760,51.0,0.153957249,48590
770,50.0,0.155617695,49209
780,50.0,0.158516266,49837
790,51.0,0.160251379,50457
800,52.0,0.162026788,51083
810,56.0,0.163723579,51715
820,61.0,0.16541405,52340
830,54.0,0.167082397,52973
840,51.0,0.168804473,53600
850,51.0,0.170618993,54230
860,52.0,0.17349544,54861
870,52.0,0.17517959,55492
880,51.0,0.177073517,56120
890,50.0,0.178756481,56751
900,50.0,0.180653174,57377
910,50.0,0.182289521,58003
920,51.0,0.183934954,58630
930,51.0,0.185595005,59261
940,51.0,0.188924983,59896
950,51.0,0.19094691,60528
960,51.0,0.192611306,61155
970,49.0,0.194225529,61763
980,50.0,0.196937629,62392
990,51.0,0.198778224,63032
1000,50.0,0.200574176,63666
1010,51.0,0.202257141,64308
1020,52.0,0.205109884,64939
1030,51.0,0.206901885,65558
1040,50.0,0.208561145,66185
1050,49.0,0.210936653,66817
1060,51.0,0.212749198,67443
1070,50.0,0.214412409,68068
1080,49.0,0.216408262,68694
1090,50.0,0.218361054,69325
1100,52.0,0.22002703,69959
1110,50.0,0.221706834,70600
1120,50.0,0.223376762,71233
1130,50.0,0.225319282,71858
1140,50.0,0.227616568,72482
1150,51.0,0.229275038,73115
1160,50.0,0.230962348,73749
1170,50.0,0.233858942,74386
1180,51.0,0.235775783,75030
1190,50.0,0.2378226,75654
1200,51.0,0.23947712,76291
1210,50.0,0.241139146,76935
1220,50.0,0.242775888,77555
1230,52.0,0.24444305,78176
1240,50.0,0.246253224,78821
1250,51.0,0.249330757,79450
1260,51.0,0.251174907,80087
1270,51.0,0.252829427,80713
1280,51.0,0.254901132,81343
1290,50.0,0.256560393,81966
1300,51.0,0.258196345,82604
1310,52.0,0.259970173,83230
1320,53.0,0.261616002,83866
1330,55.0,0.264410671,84493
1340,55.0,0.266232303,85126
1350,55.0,0.267892749,85754
1360,55.0,0.269496305,86364
1370,56.0,0.271125146,86993
1380,55.0,0.272766234,87632
1390,55.0,0.275367717,88258
1400,56.0,0.276936508,88879
1410,56.0,0.280251079,89505
1420,56.0,0.282332266,90136
1430,56.0,0.284086342,90778
1440,57.0,0.285694639,91392
1450,55.0,0.287284369,92016
1460,56.0,0.289053062,92653
1470,56.0,0.29088615,93285
1480,55.0,0.292539879,93921
1490,56.0,0.295586598,94549
1500,55.0,0.297264031,95197
1510,56.0,0.298880625,95841
1520,56.0,0.300513811,96458
1530,56.0,0.302158849,97078
1540,56.0,0.303781764,97712
1550,56.0,0.305398753,98342
1560,56.0,0.30703352,98978
1570,57.0,0.309976337,99606
1580,55.0,0.311619795,100239
1590,56.0,0.313285377,100867
1600,55.0,0.315110169,101501
1610,56.0,0.317262468,102150
1620,55.0,0.318991259,102791
1630,55.0,0.320772198,103415
1640,58.0,0.322410125,104045
1650,61.0,0.325353338,104664
1660,55.0,0.327070673,105299
1670,56.0,0.328697933,105917
1680,56.0,0.330355219,106539
1690,56.0,0.332011714,107174
1700,56.0,0.333673345,107821
1710,56.0,0.335298235,108455
1720,56.0,0.338837596,109072
1730,56.0,0.340479473,109699
1740,56.0,0.34211582,110331
1750,56.0,0.343748612,110962
1760,57.0,0.346017058,111589
1770,61.0,0.347646293,112202
1780,57.0,0.349750393,112830
1790,58.0,0.351410839,113461
1800,57.0,0.354180224,114087
1810,56.0,0.356675831,114721
1820,57.0,0.358325611,115351
1830,57.0,0.36038823,115969
1840,57.0,0.362097269,116597
1850,56.0,0.363769566,117234
1860,56.0,0.365644135,117854
1870,56.0,0.367402952,118486
1880,57.0,0.370207892,119116
1890,56.0,0.37239377,119751
1900,56.0,0.37414587,120376
1910,57.0,0.375901131,120998
1920,57.0,0.37767496,121617
1930,56.0,0.379336591,122246
1940,56.0,0.381183901,122883
1950,56.0,0.38302489,123512
1960,56.0,0.386319707,124145
1970,55.0,0.388023214,124759
1980,54.0,0.389660746,125378
1990,55.0,0.391478031,125999
2000,54.0,0.393138477,126637
2010,55.0,0.39481038,127270
2020,55.0,0.396488999,127913
2030,55.0,0.398111913,128538
2040,56.0,0.400900261,129170
2050,55.0,0.403136312,129794
2060,57.0,0.405727129,130424
2070,57.0,0.407416019,131047
2080,57.0,0.409027082,131673
2090,58.0,0.410662639,132308
2100,63.0,0.412287924,132932
2110,55.0,0.41392032,133557
2120,56.0,0.416683779,134205
2130,56.0,0.41873178,134837
2140,58.0,0.420371683,135468
2150,56.0,0.422004869,136091
2160,57.0,0.424541958,136708
2170,56.0,0.426217021,137347
2180,58.0,0.427828479,137969
2190,58.0,0.429449813,138604
2200,65.0,0.432091593,139237
2210,57.0,0.434040435,139879
2220,69.0,0.436094758,140510
2230,69.0,0.437705821,141132
2240,70.0,0.439355995,141767
2250,71.0,0.44101407,142400
2260,72.0,0.442616837,143037
2270,72.0,0.444205777,143672
2280,73.0,0.446841235,144311
2290,72.0,0.448744644,144936
2300,72.0,0.450645682,145566
2310,73.0,0.452805486,146197
2320,73.0,0.455138722,146835
2330,73.0,0.458045984,147462
2340,72.0,0.4596768,148108
2350,73.0,0.462277889,148743
2360,71.0,0.4640051,149380
2370,72.0,0.466161349,150026
2380,71.0,0.468930339,150642
2390,71.0,0.470570241,151274
2400,70.0,0.472273748,151896
2410,70.0,0.474158984,152540
2420,71.0,0.475770047,153180
2430,71.0,0.478566691,153809
2440,71.0,0.48018368,154446
2450,71.0,0.481804224,155075
2460,72.0,0.483601361,155699
2470,71.0,0.485176869,156328
2480,72.0,0.486791883,156966
2490,72.0,0.488383588,157599
2500,73.0,0.490002948,158233
2510,73.0,0.493057963,158863
2520,72.0,0.494958211,159491
2530,73.0,0.496552287,160116
2540,73.0,0.498212733,160737
2550,72.0,0.499793772,161364
2560,71.0,0.50137244,161984
2570,73.0,0.503393182,162610
2580,72.0,0.505204147,163227
2590,71.0,0.507973927,163860
2600,71.0,0.509549435,164494
2610,71.0,0.511164449,165139
2620,71.0,0.513148056,165763
2630,72.0,0.515937984,166399
2640,72.0,0.517677048,167037
2650,71.0,0.519423618,167672
2660,71.0,0.52112673,168293
2670,71.0,0.524030436,168925
2680,72.0,0.52564624,169550
2690,72.0,0.527459575,170179
2700,72.0,0.529075774,170820
2710,71.0,0.530685652,171452
2720,71.0,0.532307382,172089
2730,72.0,0.533916075,172717
2740,72.0,0.536339781,173347
2750,72.0,0.539485265,173969
2760,74.0,0.541410007,174597
2770,73.0,0.543095736,175223
2780,73.0,0.544760922,175873
2790,73.0,0.54637396,176503
2800,73.0,0.547993715,177142
2810,74.0,0.549596087,177768
2820,74.0,0.551543348,178397
2830,74.0,0.55448182,179031
2840,74.0,0.556359155,179660
2850,74.0,0.557932292,180290
2860,74.0,0.559710071,180909
2870,75.0,0.561375653,181541
2880,75.0,0.563119062,182167
2890,76.0,0.56495294,182799
2900,76.0,0.566562818,183433
2910,76.0,0.568150967,184070
2920,77.0,0.569736746,184700
2930,76.0,0.571627117,185330
2940,76.0,0.573543563,185963
2950,75.0,0.575154231,186598
2960,76.0,0.576753047,187221
2970,76.0,0.57833053,187833
2980,77.0,0.581939027,188467
2990,76.0,0.583729843,189104
3000,76.0,0.585323523,189748
3010,76.0,0.586878487,190366
3020,76.0,0.588454784,191006
3030,76.0,0.590300514,191631
3040,76.0,0.592034836,192257
3050,77.0,0.593633257,192902
3060,76.0,0.596359185,193537
3070,79.0,0.597924816,194157
3080,77.0,0.600277805,194782
3090,77.0,0.601852127,195403
3100,77.0,0.603467141,196028
3110,78.0,0.605068327,196657
3120,78.0,0.606655291,197288
3130,84.0,0.608483243,197925
3140,77.0,0.611384184,198548
3150,77.0,0.613340136,199179
3160,77.0,0.614935396,199813
3170,76.0,0.616517224,200449
3180,76.0,0.618665571,201078
3190,76.0,0.620255696,201711
3200,76.0,0.621894018,202343
3210,76.0,0.623812045,202970
3220,75.0,0.62696622,203594
3230,75.0,0.628578073,204234
3240,75.0,0.630195852,204875
3250,76.0,0.631785582,205503
3260,75.0,0.634343214,206134
3270,75.0,0.636165635,206757
3280,75.0,0.637866377,207386
3290,75.0,0.639706181,208009
3300,75.0,0.642435664,208644
3310,75.0,0.644025789,209262
3320,75.0,0.645588654,209892
3330,75.0,0.647157446,210510
3340,76.0,0.649097595,211138
3350,75.0,0.651074486,211773
3360,75.0,0.652650783,212390
3370,76.0,0.654738686,213024
3380,75.0,0.657512021,213657
3390,75.0,0.659084764,214289
3400,75.0,0.660779185,214923
3410,76.0,0.662354693,215548
3420,76.0,0.663947188,216176
3430,76.0,0.665555485,216809
3440,76.0,0.667141659,217442
3450,76.0,0.668728623,218074
3460,78.0,0.672186601,218714
3470,77.0,0.673762504,219348
3480,77.0,0.675348283,219974
3490,77.0,0.677084186,220599
3500,77.0,0.678669965,221224
3510,79.0,0.680511744,221841
3520,79.0,0.682481128,222473
3530,79.0,0.685721822,223094
3540,77.0,0.68764933,223728
3550,77.0,0.689573677,224362
3560,77.0,0.69146879,224993
3570,78.0,0.693497829,225616
3580,78.0,0.695466818,226256
3590,78.0,0.697531807,226886
3600,77.0,0.69933724,227519
3610,77.0,0.70226386,228131
3620,77.0,0.703974874,228758
3630,77.0,0.705806777,229398
3640,77.0,0.707571914,230014
3650,78.0,0.709323224,230634
3660,78.0,0.711045694,231262
3670,77.0,0.712646486,231892
3680,78.0,0.714463377,232523
3690,78.0,0.717295973,233150
3700,79.0,0.718937061,233782
3710,81.0,0.720772124,234410
3720,81.0,0.722409261,235017
3730,82.0,0.724063385,235650
3740,82.0,0.725656671,236276
3750,82.0,0.727226648,236903
3760,82.0,0.728816378,237536
3770,82.0,0.731665566,238175
3780,81.0,0.733216185,238807
3790,80.0,0.734950903,239425
3800,81.0,0.736534312,240066
3810,79.0,0.738449177,240698
3820,80.0,0.740138463,241335
3830,79.0,0.741696193,241956
3840,79.0,0.743282367,242578
3850,79.0,0.747812939,243206
3860,79.0,0.7494082,243853
3870,80.0,0.751039411,244477
3880,80.0,0.752738178,245115
3890,79.0,0.754319611,245742
3900,80.0,0.755893933,246375
3910,79.0,0.757575712,247004
3920,79.0,0.75927922,247633
3930,79.0,0.762201494,248264
3940,79.0,0.763756063,248883
3950,81.0,0.765350139,249518
3960,79.0,0.766952906,250146
3970,78.0,0.768541055,250787
3980,81.0,0.77029276,251408
3990,81.0,0.773251775,252040
4000,82.0,0.775181257,252673
4010,80.0,0.77806758,253300
4020,77.0,0.779765162,253928
4030,80.0,0.781555188,254563
4040,79.0,0.783135042,255201
4050,79.0,0.784699882,255821
4060,79.0,0.786395883,256449
4070,79.0,0.788165366,257072
4080,80.0,0.790625812,257694
4090,80.0,0.793904432,258330
4100,79.0,0.795500878,258945
4110,78.0,0.797109966,259572
4120,80.0,0.798841127,260198
4130,77.0,0.800946017,260820
4140,77.0,0.802862068,261442
4150,77.0,0.804591255,262078
4160,81.0,0.807536443,262699
4170,77.0,0.809251803,263343
4180,78.0,0.811912546,263958
4190,78.0,0.813525189,264587
4200,77.0,0.815192746,265227
4210,81.0,0.816792352,265860
4220,82.0,0.818364699,266473
4230,83.0,0.820508701,267103
4240,83.0,0.82340648,267728
4250,83.0,0.824993444,268358
4260,82.0,0.826571716,268992
4270,83.0,0.828137742,269629
4280,83.0,0.829729052,270258
4290,82.0,0.831551868,270893
4300,83.0,0.833478191,271516
4310,83.0,0.83503197,272129
4320,83.0,0.83774012,272748
4330,83.0,0.839338937,273374
4340,84.0,0.841044025,274012
4350,83.0,0.843765213,274655
4360,80.0,0.845385362,275286
4370,79.0,0.846960474,275915
4380,78.0,0.848500425,276529
4390,80.0,0.850047883,277144
4400,79.0,0.853574207,277776
4410,82.0,0.855155641,278415
4420,81.0,0.856742211,279055
4430,79.0,0.858287299,279678
4440,79.0,0.859862806,280300
4450,79.0,0.861908438,280933
4460,81.0,0.863941032,281575
4470,81.0,0.866587948,282215
4480,84.0,0.869428049,282852
4490,84.0,0.871045828,283483
4500,84.0,0.872716941,284109
4510,83.0,0.874308251,284745
4520,83.0,0.875967907,285374
4530,83.0,0.877976008,286011
4540,83.0,0.879798429,286641
4550,84.0,0.881377492,287270
4560,84.0,0.884092753,287922
4570,85.0,0.885849199,288555
4580,84.0,0.887773546,289189
4590,83.0,0.889490485,289826
4600,83.0,0.891067968,290448
4610,84.0,0.892726833,291087
4620,83.0,0.894431131,291726
4630,83.0,0.896018491,292367
4640,83.0,0.89954758,292997
4650,83.0,0.901092273,293620
4660,82.0,0.902672126,294245
4670,83.0,0.904212078,294865
4680,83.0,0.90574966,295486
4690,83.0,0.907312526,296122
4700,83.0,0.909243194,296765
4710,82.0,0.911168331,297406
4720,83.0,0.912759246,298037
4730,83.0,0.914354901,298665
4740,83.0,0.915935545,299294
4750,83.0,0.917703053,299933
4760,82.0,0.919259993,300569
4770,82.0,0.920842611,301209
4780,83.0,0.922426809,301846
4790,83.0,0.925163009,302478
4800,84.0,0.926720344,303099
4810,84.0,0.928741876,303728
4820,85.0,0.931441335,304364
4830,85.0,0.932973781,304984
4840,85.0,0.935024548,305616
4850,85.0,0.936781784,306246
4860,85.0,0.938339909,306869
4870,85.0,0.94105043,307491
4880,85.0,0.942625147,308116
4890,85.0,0.944185247,308738
4900,85.0,0.946170039,309373
4910,84.0,0.94885014,310007
4920,85.0,0.950555623,310633
4930,84.0,0.953280761,311257
4940,84.0,0.954847577,311873
4950,85.0,0.957519382,312507
4960,84.0,0.95906684,313131
4970,84.0,0.960679088,313767
4980,85.0,0.963032078,314396
4990,84.0,0.964611536,315017
5000,84.0,0.966201265,315651
