param_SVM__max_iter,train acc,test acc
1,0.6175,0.595
2,0.729375,0.6775
4,0.8325,0.795
8,0.874375,0.8275
16,0.875625,0.8275
32,0.875625,0.8275
64,0.875625,0.8275
128,0.875625,0.8275
256,0.875625,0.8275
512,0.875625,0.8275
1024,0.875625,0.8275
2048,0.875625,0.8275
