k,GMM,Kmeans
2,3.695009562012381e-06,0.000627296500188926
3,0.004289980772464181,0.0013085380448637162
4,0.0014922202015234495,0.004840872775516497
5,0.0022942244304340804,0.00402324171972945
6,0.0017756766384765346,0.004351979822940438
7,0.0026759460655249832,0.003501697417381951
8,0.0033077956564038684,0.003622194973767681
9,0.005094626816261172,0.005145232118296835
10,-0.0022821146754415243,0.0051316197565455185
15,0.0012199016779941671,0.007042002840255565
20,0.006888550755698977,0.006882614111410726
25,0.007983670512055823,0.006144202368803638
30,0.0064282131517052424,0.0055424515797836945
35,0.004557430872822421,0.00708559156616738
40,0.003546299858668193,0.008562668293037288
