steps,time,reward,delta,converged
1,0.0020879053588487295,-0.15625,0.9,False
2,0.011520022755576065,-0.11153846153846139,0.9,False
3,0.008497794563481875,-0.11578947368421046,0.9,False
4,0.0021428190475489828,-0.13600000000000004,0.9,False
5,0.0017252379757337621,-0.13333333333333336,0.9,False
6,0.0011950640889608621,-0.15625,0.9,False
7,0.0038779335861818254,-0.11285714285714274,0.9,False
8,0.0013254347168185632,-0.13750000000000004,0.08999999999999998,False
9,0.0022751649880774494,-0.12432432432432436,0.9,False
10,0.005786480565802776,-0.11011235955056163,0.9,False
11,0.0035184267030672345,-0.11451612903225797,0.9,False
12,0.0019915101067908836,-0.12647058823529417,0.08999999999999998,False
13,0.0032308211966665112,-0.11551724137931027,0.9,False
14,0.0042026749681554065,-0.11499999999999992,0.9,False
15,0.002147164735106344,-0.12368421052631584,0.9,False
16,0.0015944722854328575,-0.13103448275862073,0.08999999999999998,False
17,0.001288693903688909,-0.14090909090909093,0.08999999999999998,False
18,0.0008829647072161606,-0.15625,0.9,False
19,0.004764058793170989,-0.11084337349397574,0.9,False
20,0.0024296344290632987,-0.12903225806451618,0.08999999999999998,False
21,0.0005894332630305144,-0.18181818181818182,0.08999999999999998,False
22,0.0005823221379159804,-0.19999999999999998,0.009000000000000008,False
23,0.005318726555515241,-0.11071428571428556,0.9,False
24,0.0019061766047343554,-0.13000000000000003,0.08999999999999998,False
25,0.0047336389800420875,-0.1104651162790696,0.9,False
26,0.0018251887904625619,-0.12903225806451618,0.009000000000000008,False
27,0.003025388692094566,-0.11666666666666661,0.9,False
28,0.002034176857705461,-0.12903225806451618,0.08999999999999998,False
29,0.0028894871891225193,-0.11730769230769227,0.9,False
30,0.001577484597419243,-0.13333333333333336,0.08999999999999998,False
31,0.00258291868226479,-0.11914893617021276,0.0009000000000000008,False
32,0.0019283001054191118,-0.13333333333333336,0.9,False
33,0.0029218823146948125,-0.12250000000000005,0.9,False
34,0.0015296820338335237,-0.13333333333333336,8.999999999999009e-05,False
35,0.0009307672705745063,-0.15625,0.08999999999999998,False
36,0.006626383459661156,-0.10756302521008382,0.08999999999999998,False
37,0.007598632293593255,-0.1072580645161288,0.9,False
38,0.0019417322305343987,-0.12647058823529417,0.009000000000000008,False
39,0.005950431507017129,-0.10937499999999982,0.9,False
40,0.004109835278541141,-0.11323529411764695,0.9,False
41,0.0014324966566618968,-0.13750000000000004,8.999999999959041e-06,False
42,0.0052709239919295214,-0.1104651162790696,0.9,False
43,0.002168103048006742,-0.12307692307692314,0.9,False
44,0.002355362677235462,-0.12500000000000006,0.08999999999999998,False
45,0.005935024069003703,-0.10865384615384596,0.009000000000000008,False
46,0.0020705226083919115,-0.12571428571428578,0.9,False
47,0.002596745870050654,-0.12250000000000005,0.08999999999999998,False
48,0.003421636388566185,-0.11525423728813551,0.9,False
49,0.0021692882355637266,-0.12250000000000005,0.9,False
50,0.004401786472726599,-0.111392405063291,0.9,False
51,0.0013009408412472112,-0.14090909090909093,0.9,False
52,0.0012598543405601959,-0.14736842105263162,0.009000000000000008,False
53,0.0048466268574429705,-0.1104651162790696,0.08999999999999998,False
54,0.001633583473676481,-0.13103448275862073,0.9,False
55,0.0013807434681893938,-0.13600000000000004,0.009000000000000008,False
56,0.001411953406432076,-0.13600000000000004,0.08999999999999998,False
57,0.004357539471811833,-0.11153846153846139,0.9,False
58,0.0015723487849754747,-0.13461538461538464,0.009000000000000008,False
59,0.0025098321182213112,-0.12250000000000005,0.9,False
60,0.0016679539121469134,-0.13214285714285717,0.08999999999999998,False
61,0.0006945198902030825,-0.18181818181818182,0.009000000000000008,False
62,0.0015980278478764376,-0.13103448275862073,0.009000000000000008,False
63,0.001749731851305114,-0.14500000000000002,0.0009000000000000008,False
64,0.002194177173805656,-0.12307692307692314,0.9,False
65,0.0010820762115599791,-0.14736842105263162,0.0009000000000000008,False
66,0.002065386795948143,-0.13333333333333336,8.999999999999009e-05,False
67,0.007603373043821193,-0.10676691729323284,0.9,False
68,0.0021313622348770878,-0.12368421052631584,0.08999999999999998,False
69,0.0030554134427802637,-0.11636363636363631,0.08999999999999998,False
70,0.0011172367746894452,-0.14500000000000002,0.0009000000000000008,False
71,0.0019942755441206828,-0.12647058823529417,0.9,False
72,0.006840507339347823,-0.10789473684210506,0.9,False
73,0.0027646474361517903,-0.11914893617021276,9.000000000258801e-07,False
74,0.0007198038908882154,-0.17499999999999996,0.08999999999999998,False
75,0.0023190169265490113,-0.12195121951219516,0.9,False
76,0.0007889398300449102,-0.16923076923076924,8.999999999999009e-05,False
77,0.0016521514116902836,-0.13333333333333336,0.009000000000000008,False
78,0.003447315451467148,-0.11666666666666661,0.009000000000000008,False
79,0.0009319524581314909,-0.15625,8.999999999959041e-06,False
80,0.004044254902282773,-0.11499999999999992,0.9,False
81,0.0038562051481676463,-0.1140624999999999,0.08999999999999998,False
82,0.001829139415804093,-0.12727272727272732,0.08999999999999998,False
83,0.0007292853911167185,-0.16923076923076924,0.0009000000000000008,False
84,0.0016063241605479561,-0.13000000000000003,0.08999999999999998,False
85,0.0028318080628650932,-0.11799999999999997,0.009000000000000008,False
86,0.0024869184926501475,-0.12093023255813956,0.0009000000000000008,False
87,0.002115559734420458,-0.12368421052631584,0.009000000000000008,False
88,0.0015316573465042893,-0.13600000000000004,0.009000000000000008,False
89,0.0060669749470889656,-0.10833333333333313,0.9,False
90,0.008344905372723588,-0.1065693430656932,0.9,False
91,0.001166224525832149,-0.14736842105263162,8.999999999959041e-06,False
92,0.0033094386358243355,-0.11475409836065566,0.08999999999999998,False
93,0.006249493826089747,-0.10927835051546374,0.9,False
94,0.0019314606051921146,-0.12647058823529417,0.0009000000000000008,False
95,0.0035500317037531204,-0.11698113207547164,0.08999999999999998,False
96,0.0021941771735782822,-0.12307692307692314,0.9,False
97,0.004870330608127915,-0.11071428571428556,0.009000000000000008,False
98,0.001902225979620198,-0.12647058823529417,0.9,False
99,0.00717749565910708,-0.1074380165289254,0.9,False
100,0.002999709629193603,-0.11666666666666661,0.009000000000000008,False
101,0.0008422732687449752,-0.16428571428571428,9.000000005254804e-08,False
102,0.003045536880108557,-0.11636363636363631,0.9,False
103,0.00061432220104507,-0.19,0.0009000000000000008,False
104,0.0054475169333727536,-0.11058823529411749,0.009000000000000008,False
105,0.004200304593268811,-0.11199999999999986,0.08999999999999998,False
106,0.005349936493757923,-0.10999999999999982,0.08999999999999998,False
107,0.0010322983353034942,-0.14736842105263162,0.08999999999999998,False
108,0.0009461747085879324,-0.15294117647058827,9.000000045222834e-09,False
109,0.0027512153110365034,-0.11836734693877549,0.9,False
110,0.0017173367255054472,-0.12903225806451618,0.9,False
111,0.0014664720326891256,-0.13333333333333336,0.08999999999999998,False
112,0.00313561113216565,-0.08070175438596484,0.9,False
113,0.0009951624597306363,-0.15625,0.009000000000000008,False
114,0.002435955428836678,-0.07250000000000005,0.08999999999999998,False
115,0.0022170907993768196,-0.12250000000000005,0.9,False
116,0.00245689374196445,-0.12000000000000001,0.9,False
117,0.009796760092285695,-0.09312499999999975,0.009000000000000008,False
118,0.0026812892469934013,-0.11874999999999998,0.9,False
119,0.001537978346732416,-0.13103448275862073,0.9,False
120,0.0047265278549275536,-0.11249999999999988,0.08999999999999998,False
121,0.0023281033643343108,-0.12432432432432436,8.999999999999009e-05,False
122,0.00465818204088464,-0.11343283582089542,0.9,False
123,0.0045297867254703306,-0.08658536585365838,0.9,False
124,0.0009366932083594293,-0.15294117647058827,0.08999999999999998,False
125,0.002645733621193358,-0.12432432432432436,0.9,False
126,0.003853044647939896,-0.11428571428571419,0.9,False
127,0.0017769911642062652,-0.12903225806451618,0.08999999999999998,False
128,0.004075464840298082,-0.11199999999999986,0.9,False
129,0.0011638541507181799,-0.15625,0.0009000000000000008,False
130,0.0071518165962061175,-0.09133858267716513,0.08999999999999998,False
131,0.0009540759588162473,-0.15625,8.999999745462617e-10,False
132,0.0033252411362809653,-0.11499999999999992,0.08999999999999998,False
133,0.0013171384041470446,-0.14285714285714288,0.08999999999999998,False
134,0.007661447232521823,-0.09225352112676033,0.009000000000000008,False
135,0.0024857333053205366,-0.12045454545454547,0.0009000000000000008,False
136,0.0044009963478401914,-0.11124999999999985,0.08999999999999998,False
137,0.0041837119676984,-0.11153846153846139,0.08999999999999998,False
138,0.0011599035256040224,-0.14500000000000002,8.999999999999009e-05,False
139,0.005197047302772262,-0.10927835051546374,0.08999999999999998,False
140,0.003195660633537045,-0.07962962962962958,0.0009000000000000008,False
141,0.004424305035627185,-0.08533333333333319,8.999999999999009e-05,False
142,0.004011464714039903,-0.08225806451612894,8.999999999959041e-06,False
143,0.0069847051549913886,-0.09083333333333311,9.000000000258801e-07,False
144,0.0019591149809912167,-0.12647058823529417,0.08999999999999998,False
145,0.002152300547777486,-0.13214285714285717,0.0009000000000000008,False
146,0.0018212381655757781,-0.15294117647058827,8.999999999959041e-06,False
147,0.0020408929201494175,-0.13333333333333336,8.999999999959041e-06,False
148,0.0032114631337663013,-0.07500000000000001,9.000000005254804e-08,False
149,0.005344010556200374,-0.08624999999999985,9.000000045222834e-09,False
150,0.003053438130336872,-0.12142857142857147,0.009000000000000008,False
151,0.0018212381653484044,-0.12812500000000004,0.009000000000000008,False
152,0.003172351945295304,-0.11551724137931027,0.009000000000000008,False
153,0.009039820325597248,-0.1062068965517239,0.08999999999999998,False
154,0.0017366947884056572,-0.12903225806451618,8.999999999999009e-05,False
155,0.002531955618678694,-0.07659574468085105,8.999999745462617e-10,False
156,0.0009837056468313676,-0.15000000000000002,0.009000000000000008,False
157,0.0040426746520552115,-0.11199999999999986,0.0009000000000000008,False
158,0.004121292091440409,-0.08533333333333319,9.000000744663339e-11,False
159,0.0020389176077060256,-0.12432432432432436,0.08999999999999998,False
160,0.0019251396051913616,-0.14285714285714288,9.000000000258801e-07,False
161,0.006332852015702883,-0.09043478260869543,0.0009000000000000008,False
162,0.0065754203958476864,-0.09083333333333311,9.00000074466334e-12,False
163,0.003281784260252607,-0.12045454545454547,0.009000000000000008,False
164,0.0029708700658375164,-0.07659574468085105,8.999999999999009e-05,False
165,0.0009201005827890185,-0.15625,0.0009000000000000008,False
166,0.0015332375965044776,-0.13461538461538464,9.000000005254804e-08,False
167,0.0012361505898752512,-0.13913043478260873,0.009000000000000008,False
168,0.0035472662661959475,-0.08225806451612894,8.999800904518907e-13,False
169,0.002985092316293958,-0.07755102040816324,9.002798506685394e-14,False
170,0.002853141438208695,-0.0788461538461538,8.992806499463768e-15,False
171,0.003172747007738508,-0.07659574468085105,8.999999999959041e-06,False
172,0.00256356061936458,-0.11956521739130435,0.08999999999999998,False
173,0.0021404486724350136,-0.12307692307692314,0.009000000000000008,False
174,0.0028938328766798804,-0.07708333333333332,8.992806499463768e-16,False
175,0.0073916195390211215,-0.09112903225806429,9.000000000258801e-07,False
176,0.0008746683945446421,-0.15625,9.000000000258801e-07,False
177,0.003806822334354365,-0.0828124999999999,9.992007221626409e-17,False
178,0.001297385278803631,-0.13913043478260873,0.08999999999999998,False
179,0.0017074601628337405,-0.12903225806451618,0.0009000000000000008,False
180,0.004129983466782505,-0.08533333333333319,0.0,False
181,0.0009343228332454601,-0.15294117647058827,9.000000744663339e-11,False
182,0.0023170416138782457,-0.07179487179487185,0.0,False
183,0.0026722028094354755,-0.07708333333333332,0.0,False
184,0.0009765945217168337,-0.15294117647058827,9.00000074466334e-12,True
