iterations,fitness,time,fevals
0,22.0,0.001830718,460
10,27.0,0.003509732,833
20,27.0,0.00509906700001,1202
30,27.0,0.00656474800001,1579
40,29.0,0.00825403400001,1943
50,29.0,0.011130085,2308
60,29.0,0.012615913,2674
70,30.0,0.014158235,3045
80,30.0,0.015628261,3415
90,30.0,0.016911028,3783
100,30.0,0.018409893,4144
110,30.0,0.019625104,4509
120,30.0,0.020842686,4874
130,30.0,0.023264021,5238
140,30.0,0.024456714,5604
150,30.0,0.025650592,5968
160,31.0,0.027255729,6334
170,31.0,0.028501754,6697
180,31.0,0.029695631,7049
190,32.0,0.030900965,7413
200,31.0,0.032096818,7778
210,31.0,0.03452724,8147
220,32.0,0.036546402,8514
230,32.0,0.03774739,8879
240,32.0,0.038966551,9252
250,32.0,0.040158453,9625
260,32.0,0.041359442,9989
270,33.0,0.042541073,10347
280,32.0,0.044214556,10712
290,32.0,0.046517768,11083
300,32.0,0.047722312,11446
310,32.0,0.048926856,11807
320,32.0,0.050124685,12172
330,32.0,0.051302365,12533
340,32.0,0.053126366,12896
350,32.0,0.054771799,13265
360,33.0,0.055988195,13637
370,33.0,0.058368839,14005
380,34.0,0.059764989,14380
390,34.0,0.060992447,14739
400,34.0,0.062189485,15102
410,34.0,0.063356498,15468
420,34.0,0.064534968,15835
430,34.0,0.065711068,16196
440,34.0,0.066878872,16560
450,34.0,0.069669195,16926
460,35.0,0.070848456,17290
470,35.0,0.072108704,17658
480,35.0,0.073310483,18026
490,34.0,0.074477101,18386
500,34.0,0.075676509,18758
510,34.0,0.0770533,19116
520,34.0,0.078215177,19477
530,34.0,0.080569746,19842
540,34.0,0.081912957,20209
550,34.0,0.083254193,20572
560,34.0,0.084514045,20939
570,34.0,0.085711873,21306
580,36.0,0.086974097,21675
590,36.0,0.088171135,22045
600,34.0,0.089360272,22421
610,34.0,0.092116225,22791
620,34.0,0.093668424,23167
630,34.0,0.094835437,23531
640,34.0,0.096838402,23899
650,34.0,0.098136181,24264
660,34.0,0.09937233,24629
670,35.0,0.100555146,24997
680,34.0,0.101911789,25362
690,34.0,0.104221322,25724
700,34.0,0.105388731,26084
710,34.0,0.106614609,26450
720,34.0,0.10780177,26819
730,34.0,0.108998018,27186
740,34.0,0.110299748,27552
750,35.0,0.111475847,27909
760,34.0,0.112724638,28277
770,34.0,0.115677727,28643
780,35.0,0.116881876,29018
790,35.0,0.118056791,29378
800,35.0,0.119254224,29745
810,35.0,0.12046746,30112
820,34.0,0.121652252,30472
830,35.0,0.12285324,30839
840,35.0,0.124738477,31210
850,35.0,0.127075269,31573
860,35.0,0.128279813,31932
870,35.0,0.130017691,32302
880,36.0,0.13122263,32669
890,35.0,0.132399915,33030
900,35.0,0.133571274,33390
910,35.0,0.1347853,33756
920,35.0,0.136031721,34125
930,35.0,0.138814538,34485
940,36.0,0.140343823,34849
950,36.0,0.141555478,35222
960,36.0,0.142861553,35589
970,36.0,0.144126147,35959
980,36.0,0.145329506,36325
990,36.0,0.146526939,36694
1000,36.0,0.147701459,37056
1010,36.0,0.150137807,37424
1020,36.0,0.151315882,37795
1030,36.0,0.152530302,38164
1040,36.0,0.154554995,38531
1050,37.0,0.155979589,38903
1060,36.0,0.157263541,39282
1070,36.0,0.158613073,39656
1080,37.0,0.159810901,40024
1090,36.0,0.162214063,40394
1100,37.0,0.163411891,40767
1110,36.0,0.164602213,41133
1120,37.0,0.166093572,41492
1130,37.0,0.167605475,41851
1140,38.0,0.168835303,42227
1150,38.0,0.170075798,42597
1160,38.0,0.171299305,42968
1170,38.0,0.173704048,43345
1180,38.0,0.175708198,43716
1190,39.0,0.178288743,44085
1200,38.0,0.179481435,44452
1210,39.0,0.180751165,44818
1220,38.0,0.181955709,45189
1230,38.0,0.18320213,45562
1240,38.0,0.184409439,45928
1250,38.0,0.1867087,46293
1260,38.0,0.187904553,46655
1270,38.0,0.18928885,47016
1280,39.0,0.190547912,47381
1290,39.0,0.191779716,47750
1300,40.0,0.193329939,48110
1310,39.0,0.194526582,48479
1320,40.0,0.19575167,48853
1330,40.0,0.198314833,49226
1340,39.0,0.199501994,49600
1350,39.0,0.200685995,49969
1360,39.0,0.201921749,50339
1370,40.0,0.203100614,50708
1380,40.0,0.204278294,51072
1390,40.0,0.205465455,51443
1400,40.0,0.20670516,51808
1410,40.0,0.209730545,52183
1420,40.0,0.210922447,52557
1430,40.0,0.212202053,52919
1440,40.0,0.213393165,53289
1450,41.0,0.214590993,53653
1460,41.0,0.215985562,54023
1470,41.0,0.217230798,54383
1480,41.0,0.218437713,54748
1490,42.0,0.221028135,55111
1500,41.0,0.222229913,55477
1510,41.0,0.223439198,55851
1520,41.0,0.224640582,56215
1530,41.0,0.226122855,56584
1540,40.0,0.227338856,56944
1550,40.0,0.228567104,57313
1560,40.0,0.230035155,57686
1570,40.0,0.232270416,58048
1580,40.0,0.233823404,58422
1590,41.0,0.235038615,58794
1600,41.0,0.236228147,59160
1610,41.0,0.237441778,59529
1620,41.0,0.238638816,59897
1630,42.0,0.240413435,60264
1640,41.0,0.241856992,60634
1650,41.0,0.244180747,60994
1660,41.0,0.245524353,61364
1670,41.0,0.246730082,61732
1680,42.0,0.247949243,62095
1690,41.0,0.249248207,62462
1700,41.0,0.250561393,62826
1710,42.0,0.251776209,63194
1720,42.0,0.252977988,63556
1730,44.0,0.255281595,63925
1740,44.0,0.256954682,64290
1750,43.0,0.258449201,64654
1760,45.0,0.259635177,65013
1770,42.0,0.261017104,65385
1780,42.0,0.262219673,65751
1790,42.0,0.263419081,66111
1800,42.0,0.264611773,66475
1810,41.0,0.26685375,66838
1820,41.0,0.268072517,67208
1830,41.0,0.269273506,67571
1840,41.0,0.27092605,67932
1850,42.0,0.272147977,68300
1860,42.0,0.273530299,68669
1870,42.0,0.274738793,69038
1880,42.0,0.275952819,69406
1890,42.0,0.278155685,69766
1900,42.0,0.279352328,70124
1910,42.0,0.28057149,70499
1920,41.0,0.281789861,70860
1930,41.0,0.283256727,71224
1940,42.0,0.284493666,71591
1950,41.0,0.285714803,71961
1960,41.0,0.287294261,72324
1970,41.0,0.289593127,72696
1980,41.0,0.290788585,73054
1990,41.0,0.292012092,73423
2000,41.0,0.293197279,73790
2010,41.0,0.294389971,74152
2020,40.0,0.295583848,74522
2030,40.0,0.296780491,74882
2040,40.0,0.298024541,75255
2050,40.0,0.300382271,75625
2060,40.0,0.302172692,75996
2070,41.0,0.303413186,76371
2080,40.0,0.304611804,76737
2090,40.0,0.305926571,77104
2100,40.0,0.307398572,77470
2110,40.0,0.308604696,77834
2120,41.0,0.310803611,78197
2130,40.0,0.312087168,78561
2140,41.0,0.313282626,78934
2150,41.0,0.314478874,79305
2160,41.0,0.31626811,79675
2170,40.0,0.317569444,80036
2180,40.0,0.320046483,80401
2190,40.0,0.321233644,80771
2200,40.0,0.323480362,81140
2210,40.0,0.325204808,81507
2220,41.0,0.326434636,81877
2230,43.0,0.327645501,82247
2240,43.0,0.329303181,82614
2250,43.0,0.330468614,82983
2260,44.0,0.331651825,83351
2270,44.0,0.33334032,83712
2280,44.0,0.33569489,84074
2290,45.0,0.336892719,84446
2300,44.0,0.338227633,84807
2310,44.0,0.3394863,85180
2320,44.0,0.340664376,85544
2330,43.0,0.341844031,85910
2340,43.0,0.343027242,86282
2350,44.0,0.344314749,86646
2360,45.0,0.346659047,87016
2370,45.0,0.348236134,87385
2380,45.0,0.349625962,87751
2390,45.0,0.350822605,88110
2400,44.0,0.352052828,88476
2410,45.0,0.353905274,88839
2420,45.0,0.355109423,89204
2430,45.0,0.356294609,89574
2440,45.0,0.359661328,89943
2450,45.0,0.361831799,90310
2460,46.0,0.363157233,90677
2470,45.0,0.364408,91053
2480,45.0,0.365736593,91426
2490,45.0,0.367067952,91793
2500,45.0,0.368269336,92163
2510,45.0,0.370422424,92532
2520,44.0,0.373068945,92900
2530,45.0,0.374442575,93263
2540,44.0,0.375760107,93630
2550,45.0,0.376977688,94003
2560,44.0,0.378179072,94374
2570,44.0,0.379394283,94750
2580,44.0,0.380622926,95115
2590,44.0,0.381810878,95486
2600,45.0,0.384708263,95852
2610,44.0,0.386241894,96219
2620,45.0,0.387416019,96577
2630,44.0,0.388643477,96941
2640,44.0,0.390153009,97312
2650,44.0,0.391357158,97680
2660,44.0,0.392759628,98051
2670,44.0,0.393915579,98414
2680,45.0,0.396256322,98777
2690,44.0,0.397442694,99145
2700,44.0,0.398764966,99517
2710,45.0,0.399931979,99884
2720,44.0,0.401125067,100254
2730,44.0,0.402375043,100623
2740,45.0,0.40372497,100997
2750,44.0,0.404914107,101373
2760,45.0,0.407803196,101734
2770,44.0,0.408991543,102104
2780,45.0,0.41018226,102478
2790,44.0,0.411373372,102842
2800,44.0,0.412662065,103206
2810,45.0,0.413832238,103570
2820,45.0,0.415158856,103939
2830,45.0,0.416398956,104303
2840,45.0,0.41893723,104661
2850,44.0,0.420152046,105024
2860,44.0,0.421339998,105386
2870,44.0,0.422518863,105744
2880,44.0,0.423702469,106106
2890,44.0,0.424892396,106479
2900,44.0,0.426095755,106838
2910,45.0,0.42778662,107201
2920,44.0,0.430301585,107564
2930,44.0,0.431656647,107935
2940,44.0,0.432869092,108299
2950,44.0,0.43422297,108667
2960,45.0,0.435388008,109026
2970,44.0,0.436604404,109401
2980,44.0,0.437796306,109774
2990,44.0,0.438972801,110138
3000,44.0,0.441567569,110508
3010,44.0,0.442876805,110885
3020,44.0,0.444083719,111253
3030,45.0,0.445282732,111618
3040,45.0,0.44660224,111978
3050,45.0,0.447817846,112342
3060,45.0,0.449006983,112701
3070,45.0,0.450218243,113070
3080,45.0,0.453005406,113442
3090,45.0,0.454456469,113808
3100,45.0,0.455872767,114171
3110,45.0,0.457294991,114532
3120,45.0,0.458716029,114894
3130,45.0,0.460126795,115251
3140,45.0,0.461568377,115618
3150,44.0,0.463008774,115986
3160,45.0,0.465740233,116356
3170,45.0,0.467175889,116720
3180,45.0,0.46924878,117094
3190,45.0,0.470690756,117462
3200,45.0,0.47202251,117833
3210,45.0,0.473223103,118206
3220,45.0,0.474427252,118572
3230,46.0,0.475628636,118938
3240,46.0,0.477955551,119310
3250,46.0,0.479174318,119684
3260,46.0,0.480508838,120046
3270,46.0,0.482210765,120413
3280,47.0,0.483414914,120774
3290,47.0,0.484649483,121138
3300,46.0,0.485859558,121510
3310,47.0,0.487051855,121872
3320,48.0,0.489704696,122238
3330,48.0,0.490877635,122602
3340,49.0,0.492045834,122969
3350,49.0,0.493597638,123338
3360,50.0,0.49478954,123707
3370,49.0,0.495951417,124074
3380,50.0,0.497600406,124439
3390,50.0,0.499077938,124803
3400,50.0,0.501430927,125174
3410,61.0,0.502649693,125550
3420,60.0,0.504007126,125919
3430,61.0,0.505202189,126286
3440,61.0,0.506657203,126663
3450,61.0,0.508119723,127028
3460,61.0,0.509317946,127399
3470,62.0,0.510514194,127770
3480,61.0,0.512888912,128132
3490,61.0,0.514075678,128501
3500,62.0,0.51532842,128864
3510,61.0,0.516536915,129229
3520,61.0,0.517765953,129605
3530,62.0,0.518968127,129968
3540,61.0,0.520155684,130335
3550,61.0,0.521340475,130702
3560,62.0,0.524469761,131068
3570,62.0,0.525657318,131438
3580,62.0,0.526837763,131807
3590,62.0,0.528039541,132175
3600,62.0,0.529234208,132545
3610,62.0,0.530450209,132909
3620,62.0,0.531623544,133277
3630,62.0,0.532981767,133643
3640,62.0,0.535369521,134015
3650,63.0,0.536578806,134383
3660,62.0,0.537797177,134758
3670,62.0,0.539344635,135123
3680,62.0,0.541479946,135497
3690,62.0,0.542651305,135865
3700,62.0,0.543837281,136221
3710,62.0,0.545031159,136587
3720,63.0,0.547974371,136948
3730,63.0,0.549189187,137313
3740,63.0,0.55038267,137674
3750,63.0,0.551587609,138048
3760,63.0,0.553261092,138420
3770,63.0,0.554439562,138786
3780,63.0,0.555737736,139155
3790,62.0,0.556949786,139527
3800,63.0,0.55932727,139891
3810,62.0,0.56101458,140256
3820,62.0,0.562219914,140622
3830,62.0,0.563439471,140992
3840,62.0,0.564839176,141353
3850,62.0,0.566050436,141724
3860,62.0,0.567267227,142091
3870,62.0,0.568998784,142460
3880,62.0,0.571362045,142831
3890,62.0,0.572552367,143196
3900,62.0,0.573756911,143564
3910,62.0,0.574997801,143928
3920,62.0,0.576408568,144290
3930,62.0,0.577956816,144663
3940,62.0,0.579492027,145041
3950,62.0,0.580684324,145400
3960,62.0,0.583131338,145772
3970,63.0,0.584470599,146146
3980,62.0,0.585804724,146515
3990,62.0,0.587023885,146887
4000,62.0,0.58829559,147247
4010,62.0,0.589490258,147616
4020,62.0,0.590692432,147985
4030,62.0,0.591874063,148353
4040,62.0,0.594779744,148721
4050,62.0,0.596233177,149082
4060,62.0,0.597641968,149442
4070,62.0,0.599066957,149811
4080,63.0,0.600480094,150176
4090,62.0,0.601903503,150547
4100,62.0,0.603322171,150918
4110,62.0,0.604731358,151286
4120,62.0,0.608171954,151658
4130,63.0,0.610355857,152025
4140,65.0,0.611773734,152395
4150,65.0,0.61318371,152763
4160,65.0,0.614588551,153129
4170,65.0,0.616286132,153503
4180,64.0,0.617713887,153870
4190,63.0,0.618906579,154239
4200,63.0,0.621384408,154611
4210,64.0,0.622826385,154985
4220,64.0,0.624000904,155349
4230,63.0,0.625196362,155721
4240,65.0,0.626378387,156082
4250,63.0,0.627572659,156449
4260,63.0,0.628841993,156815
4270,63.0,0.630214044,157182
4280,63.0,0.632505009,157552
4290,64.0,0.633716664,157922
4300,63.0,0.635781653,158289
4310,64.0,0.637067185,158651
4320,64.0,0.638396174,159020
4330,65.0,0.639760718,159395
4340,64.0,0.641666892,159761
4350,64.0,0.643189066,160123
4360,64.0,0.645432623,160493
4370,64.0,0.646627291,160860
4380,65.0,0.648065712,161225
4390,65.0,0.649262355,161593
4400,67.0,0.650443986,161954
4410,66.0,0.651630752,162320
4420,65.0,0.652819888,162692
4430,64.0,0.65400626,163057
4440,65.0,0.656548879,163427
4450,64.0,0.658443992,163790
4460,64.0,0.659629968,164157
4470,65.0,0.660867302,164522
4480,66.0,0.662114513,164889
4490,67.0,0.663313526,165251
4500,66.0,0.665046663,165614
4510,66.0,0.666246072,165985
4520,65.0,0.668575753,166357
4530,65.0,0.670282026,166724
4540,66.0,0.671468002,167086
4550,66.0,0.672663064,167455
4560,65.0,0.673859707,167826
4570,65.0,0.675045683,168196
4580,65.0,0.676227709,168563
4590,65.0,0.679544254,168932
4600,67.0,0.680736156,169293
4610,65.0,0.681915811,169651
4620,65.0,0.683102182,170017
4630,67.0,0.684305146,170382
4640,66.0,0.68583048,170751
4650,69.0,0.687679765,171119
4660,67.0,0.688888655,171478
4670,68.0,0.691362139,171840
4680,70.0,0.692740115,172206
4690,71.0,0.693960067,172567
4700,66.0,0.695175673,172935
4710,71.0,0.696333995,173291
4720,71.0,0.697535378,173662
4730,70.0,0.698720564,174033
4740,69.0,0.699891924,174395
4750,70.0,0.702310098,174761
4760,70.0,0.703585358,175127
4770,70.0,0.704928964,175489
4780,71.0,0.70611731,175846
4790,71.0,0.707444323,176218
4800,71.0,0.708834941,176586
4810,71.0,0.710034745,176947
4820,71.0,0.711215585,177311
4830,72.0,0.7151346,177678
4840,72.0,0.716355342,178043
4850,71.0,0.717534208,178412
4860,72.0,0.718730456,178779
4870,71.0,0.719923938,179137
4880,72.0,0.721097667,179499
4890,71.0,0.72258073,179874
4900,71.0,0.723727595,180244
4910,70.0,0.726130362,180617
4920,70.0,0.727637524,180979
4930,71.0,0.72888671,181347
4940,71.0,0.730046612,181706
4950,71.0,0.731211255,182073
4960,71.0,0.73241975,182439
4970,72.0,0.733597035,182812
4980,72.0,0.734902715,183180
4990,72.0,0.737350124,183549
5000,72.0,0.738572051,183913
