k,Mobile Price Data sse (left)
2,13843.594526454315
3,12207.509131291568
4,11238.787606847849
5,10451.692806551386
6,9849.081553182365
7,9357.852414236644
8,8929.867736105789
9,8643.050931861839
10,8326.626392061178
15,7389.814192592808
20,6797.826322234314
25,6314.48433140398
30,5941.948030185998
35,5637.356359310021
40,5358.796087177399
