iterations,fitness,time,fevals
0,23.0,0.001353087,443
10,24.0,0.00259792700001,774
20,23.0,0.00391111300002,1100
30,23.0,0.00541867000001,1439
40,23.0,0.00662400400002,1773
50,26.0,0.00783605400001,2110
60,25.0,0.010279907,2445
70,25.0,0.011457191,2775
80,26.0,0.01282213,3114
90,26.0,0.014020748,3434
100,28.0,0.015248995,3775
110,29.0,0.01645275,4105
120,31.0,0.017643072,4435
130,32.0,0.01881206,4773
140,31.0,0.022026285,5111
150,34.0,0.02377562,5446
160,34.0,0.025841795,5782
170,34.0,0.027009203,6115
180,35.0,0.028294735,6451
190,35.0,0.029465304,6785
200,36.0,0.030657997,7124
210,36.0,0.031834097,7458
220,36.0,0.034681309,7791
230,36.0,0.03590047,8123
240,36.0,0.037091582,8452
250,37.0,0.038266101,8784
260,36.0,0.039444177,9115
270,35.0,0.040644771,9446
280,36.0,0.041828772,9778
290,36.0,0.044094058,10117
300,37.0,0.046483788,10453
310,37.0,0.047654357,10791
320,38.0,0.048834012,11127
330,38.0,0.049991939,11458
340,38.0,0.05114236,11795
350,38.0,0.052318855,12130
360,39.0,0.053471251,12465
370,39.0,0.054648141,12800
380,39.0,0.058077675,13122
390,39.0,0.059372293,13460
400,39.0,0.060526665,13792
410,39.0,0.061666419,14117
420,40.0,0.062899012,14453
430,41.0,0.064066815,14793
440,41.0,0.065223161,15122
450,41.0,0.066404001,15463
460,42.0,0.068762521,15791
470,41.0,0.069967855,16130
480,41.0,0.071980696,16462
490,42.0,0.073444006,16805
500,43.0,0.074635118,17133
510,44.0,0.076274626,17471
520,43.0,0.077492207,17799
530,43.0,0.078667912,18132
540,45.0,0.081090827,18471
550,44.0,0.082283125,18798
560,45.0,0.083749201,19139
570,45.0,0.084902782,19479
580,45.0,0.086223475,19802
590,45.0,0.087375476,20129
600,45.0,0.088616762,20460
610,45.0,0.089965504,20790
620,45.0,0.092321654,21121
630,45.0,0.09350526,21454
640,45.0,0.094699928,21795
650,45.0,0.095875633,22125
660,46.0,0.097305362,22454
670,46.0,0.098628425,22795
680,46.0,0.100090154,23135
690,46.0,0.101274945,23468
700,46.0,0.103667441,23804
710,46.0,0.104840776,24139
720,46.0,0.106358999,24470
730,46.0,0.107505864,24805
740,46.0,0.1086551,25135
750,46.0,0.109830014,25470
760,46.0,0.11098557,25797
770,46.0,0.112145867,26132
780,46.0,0.114512683,26471
790,46.0,0.116556734,26809
800,46.0,0.117731649,27144
810,47.0,0.118886415,27481
820,47.0,0.120151009,27814
830,47.0,0.121547553,28164
840,46.0,0.122702319,28494
850,46.0,0.123846419,28822
860,46.0,0.125007506,29150
870,46.0,0.127388545,29476
880,46.0,0.129388349,29810
890,46.0,0.130601584,30157
900,47.0,0.131773338,30492
910,47.0,0.132956548,30838
920,47.0,0.134105388,31163
930,47.0,0.135283858,31505
940,49.0,0.13672939,31846
950,49.0,0.139602281,32178
960,49.0,0.140751516,32511
970,49.0,0.141947369,32853
980,49.0,0.143095814,33182
990,49.0,0.144261642,33521
1000,49.0,0.145537692,33849
1010,49.0,0.147107273,34170
1020,50.0,0.148309842,34501
1030,50.0,0.151016807,34833
1040,50.0,0.152200808,35160
1050,50.0,0.153380858,35480
1060,51.0,0.154524168,35804
1070,50.0,0.155691577,36143
1080,50.0,0.156842788,36470
1090,50.0,0.158307283,36798
1100,50.0,0.159490099,37129
1110,50.0,0.162187978,37475
1120,50.0,0.163423732,37819
1130,52.0,0.164542153,38151
1140,53.0,0.165694944,38484
1150,53.0,0.16687697,38821
1160,53.0,0.168066501,39146
1170,53.0,0.169255638,39477
1180,53.0,0.170770306,39813
1190,53.0,0.173455542,40144
1200,53.0,0.174629272,40481
1210,53.0,0.176198854,40818
1220,53.0,0.177440139,41157
1230,53.0,0.178635202,41491
1240,53.0,0.179887549,41839
1250,53.0,0.181121328,42168
1260,53.0,0.182297428,42495
1270,53.0,0.184694269,42831
1280,53.0,0.186065134,43165
1290,53.0,0.187226221,43508
1300,53.0,0.188392049,43847
1310,53.0,0.189537334,44182
1320,54.0,0.191033829,44510
1330,55.0,0.193026522,44837
1340,55.0,0.194436104,45161
1350,55.0,0.196758279,45502
1360,55.0,0.19793833,45846
1370,55.0,0.199077294,46179
1380,55.0,0.200209542,46510
1390,56.0,0.201339814,46845
1400,57.0,0.20252658,47184
1410,56.0,0.203661198,47512
1420,56.0,0.204828606,47845
1430,60.0,0.208097744,48187
1440,61.0,0.209401449,48522
1450,68.0,0.210595721,48861
1460,69.0,0.211733105,49193
1470,69.0,0.212865353,49529
1480,70.0,0.21402723,49861
1490,69.0,0.215378343,50197
1500,70.0,0.216533899,50529
1510,69.0,0.218850938,50853
1520,69.0,0.219963038,51184
1530,69.0,0.22127899,51517
1540,68.0,0.2224622,51864
1550,68.0,0.223835831,52198
1560,67.0,0.225444919,52522
1570,68.0,0.226590994,52860
1580,68.0,0.227717316,53191
1590,68.0,0.230072676,53529
1600,68.0,0.231229417,53866
1610,68.0,0.232475443,54197
1620,69.0,0.233742802,54536
1630,68.0,0.234911791,54871
1640,69.0,0.23605668,55210
1650,70.0,0.237420829,55554
1660,71.0,0.238563744,55884
1670,70.0,0.240887104,56215
1680,70.0,0.242089673,56551
1690,69.0,0.243239699,56883
1700,68.0,0.244371552,57216
1710,69.0,0.246148541,57543
1720,68.0,0.247281183,57874
1730,68.0,0.248458073,58208
1740,68.0,0.249579259,58536
1750,68.0,0.251878126,58862
1760,69.0,0.253000102,59198
1770,70.0,0.254199115,59532
1780,67.0,0.255360993,59867
1790,67.0,0.256981537,60203
1800,68.0,0.25815092,60540
1810,67.0,0.259460156,60883
1820,68.0,0.260620454,61206
1830,67.0,0.262935122,61548
1840,66.0,0.264071716,61887
1850,66.0,0.26521147,62218
1860,67.0,0.266332656,62543
1870,66.0,0.267829151,62875
1880,66.0,0.268982732,63213
1890,67.0,0.270134338,63554
1900,66.0,0.271253549,63880
1910,68.0,0.272402785,64222
1920,67.0,0.273533453,64554
1930,67.0,0.274993602,64899
1940,65.0,0.276172862,65231
1950,67.0,0.277360023,65574
1960,66.0,0.278504518,65904
1970,66.0,0.279633211,66235
1980,68.0,0.280765459,66567
1990,67.0,0.281929707,66903
2000,68.0,0.285105215,67239
2010,68.0,0.286312524,67590
2020,68.0,0.287477562,67933
2030,67.0,0.288636279,68268
2040,67.0,0.29052191,68594
2050,68.0,0.291754504,68941
2060,68.0,0.292874109,69268
2070,68.0,0.29399727,69601
2080,68.0,0.296769025,69935
2090,68.0,0.297930902,70271
2100,69.0,0.29906473,70615
2110,68.0,0.300191842,70945
2120,68.0,0.301311448,71285
2130,68.0,0.302428683,71626
2140,68.0,0.30355382,71970
2150,67.0,0.304759154,72300
2160,68.0,0.307909378,72623
2170,67.0,0.309061774,72958
2180,67.0,0.310184541,73288
2190,69.0,0.311582666,73632
2200,68.0,0.312989877,73968
2210,68.0,0.31412252,74302
2220,69.0,0.315245681,74633
2230,66.0,0.316473533,74976
2240,66.0,0.318719066,75302
2250,66.0,0.319836301,75636
2260,67.0,0.321301191,75980
2270,69.0,0.322446871,76317
2280,70.0,0.323588206,76648
2290,69.0,0.324718083,76976
2300,67.0,0.325857442,77307
2310,69.0,0.327357887,77635
2320,75.0,0.329780802,77974
2330,75.0,0.330919766,78314
2340,74.0,0.33205794,78646
2350,74.0,0.333211521,78974
2360,74.0,0.334358386,79307
2370,74.0,0.336114437,79647
2380,74.0,0.337238784,79989
2390,74.0,0.33836076,80324
2400,74.0,0.340760367,80663
2410,73.0,0.341894985,80997
2420,73.0,0.34317459,81322
2430,73.0,0.34431869,81665
2440,73.0,0.345471086,82002
2450,74.0,0.346585555,82332
2460,72.0,0.348029112,82665
2470,75.0,0.34919494,83003
2480,72.0,0.351848571,83345
2490,72.0,0.352982004,83688
2500,72.0,0.354301511,84017
2510,73.0,0.35547445,84356
2520,74.0,0.356640278,84691
2530,73.0,0.357757909,85017
2540,75.0,0.359088083,85355
2550,74.0,0.360209664,85684
2560,74.0,0.362470999,86013
2570,74.0,0.363600481,86351
2580,74.0,0.365025075,86684
2590,75.0,0.366196829,87014
2600,75.0,0.367295891,87335
2610,76.0,0.368455793,87675
2620,76.0,0.369593572,88005
2630,76.0,0.371068339,88350
2640,76.0,0.373978366,88692
2650,76.0,0.375109824,89025
2660,77.0,0.376320294,89361
2670,78.0,0.377549727,89704
2680,78.0,0.378678419,90037
2690,79.0,0.379920099,90357
2700,78.0,0.381046025,90690
2710,77.0,0.382170371,91019
2720,77.0,0.384450274,91344
2730,77.0,0.385579757,91677
2740,77.0,0.38681393,92006
2750,77.0,0.387950523,92340
2760,79.0,0.389488104,92668
2770,79.0,0.390624303,93002
2780,80.0,0.391725735,93332
2790,79.0,0.392844155,93655
2800,80.0,0.395280108,93996
2810,80.0,0.396630035,94341
2820,80.0,0.397760308,94676
2830,80.0,0.398908358,95021
2840,80.0,0.40003231,95349
2850,80.0,0.401165743,95676
2860,79.0,0.402292065,96011
2870,79.0,0.403693351,96339
2880,79.0,0.406877155,96671
2890,79.0,0.408009403,97013
2900,79.0,0.409514194,97341
2910,80.0,0.410623133,97671
2920,79.0,0.411727726,98001
2930,79.0,0.412857998,98341
2940,79.0,0.414007234,98683
2950,79.0,0.415150148,99029
2960,79.0,0.417464026,99368
2970,78.0,0.419166348,99709
2980,79.0,0.420279238,100040
2990,79.0,0.421379486,100367
3000,79.0,0.42248566,100689
3010,79.0,0.42360013,101025
3020,79.0,0.424730402,101364
3030,80.0,0.426209909,101701
3040,81.0,0.427346502,102044
3050,81.0,0.429622059,102389
3060,81.0,0.430755492,102734
3070,80.0,0.431906308,103081
3080,80.0,0.4332191,103409
3090,80.0,0.434771694,103749
3100,80.0,0.435880238,104078
3110,80.0,0.436989177,104409
3120,81.0,0.438095746,104740
3130,82.0,0.440283204,105067
3140,80.0,0.441400045,105409
3150,80.0,0.44283254,105743
3160,80.0,0.443955307,106073
3170,80.0,0.445061086,106411
3180,79.0,0.446179112,106750
3190,80.0,0.447293187,107089
3200,79.0,0.448427805,107418
3210,79.0,0.451231165,107757
3220,79.0,0.452605586,108093
3230,79.0,0.453733093,108431
3240,79.0,0.454994131,108768
3250,79.0,0.456297441,109106
3260,79.0,0.457422973,109445
3270,80.0,0.45851611,109759
3280,80.0,0.459639271,110104
3290,80.0,0.461962235,110444
3300,80.0,0.463860903,110770
3310,79.0,0.465198979,111102
3320,79.0,0.466325696,111441
3330,80.0,0.4674615,111783
3340,79.0,0.468579131,112118
3350,79.0,0.46990575,112442
3360,79.0,0.471026146,112770
3370,80.0,0.473784864,113109
3380,79.0,0.47509884,113450
3390,80.0,0.476237804,113791
3400,81.0,0.47770704,114128
3410,80.0,0.478795041,114447
3420,79.0,0.479915042,114778
3430,80.0,0.48124166,115122
3440,79.0,0.482342698,115455
3450,80.0,0.485165811,115784
3460,80.0,0.486302405,116122
3470,80.0,0.487969172,116451
3480,81.0,0.48904058,116769
3490,80.0,0.490464779,117104
3500,80.0,0.491616385,117451
3510,80.0,0.492728485,117784
3520,80.0,0.49384335,118118
3530,80.0,0.496132735,118445
3540,79.0,0.498057082,118784
3550,80.0,0.499449281,119120
3560,80.0,0.500567702,119451
3570,80.0,0.501814123,119794
3580,80.0,0.502919506,120124
3590,80.0,0.504050569,120469
3600,80.0,0.505170965,120811
3610,79.0,0.507467461,121142
3620,80.0,0.5085764,121466
3630,80.0,0.510142426,121806
3640,80.0,0.511384501,122133
3650,79.0,0.512502922,122458
3660,79.0,0.513768701,122800
3670,79.0,0.514873295,123125
3680,79.0,0.515967222,123448
3690,79.0,0.518375125,123787
3700,78.0,0.519495521,124108
3710,79.0,0.520612361,124450
3720,79.0,0.522229745,124782
3730,80.0,0.523350931,125116
3740,79.0,0.524467376,125449
3750,79.0,0.525606735,125784
3760,78.0,0.526713304,126111
3770,79.0,0.529271331,126441
3780,79.0,0.530646542,126789
3790,79.0,0.531789852,127128
3800,79.0,0.532932371,127472
3810,80.0,0.534042495,127800
3820,79.0,0.535178694,128131
3830,80.0,0.53677672,128469
3840,81.0,0.538103339,128807
3850,81.0,0.540394304,129147
3860,81.0,0.541510354,129486
3870,82.0,0.542620478,129818
3880,82.0,0.54374601,130153
3890,82.0,0.544965172,130487
3900,82.0,0.546081617,130817
3910,82.0,0.547205173,131153
3920,83.0,0.548309371,131488
3930,83.0,0.55062878,131832
3940,83.0,0.551741669,132166
3950,82.0,0.553052485,132495
3960,81.0,0.555516487,132834
3970,81.0,0.556627006,133161
3980,80.0,0.557752538,133491
3990,81.0,0.558851206,133818
4000,80.0,0.559931305,134161
4010,81.0,0.562209628,134492
4020,81.0,0.563330419,134826
4030,81.0,0.564432642,135157
4040,82.0,0.565975754,135496
4050,82.0,0.567077977,135827
4060,82.0,0.56820904,136161
4070,82.0,0.569640744,136495
4080,83.0,0.570777733,136824
4090,82.0,0.571890623,137161
4100,82.0,0.574181193,137494
4110,82.0,0.575303959,137830
4120,82.0,0.57642554,138156
4130,82.0,0.578155516,138498
4140,82.0,0.579275516,138830
4150,82.0,0.580386036,139170
4160,82.0,0.581473642,139490
4170,82.0,0.582596013,139829
4180,83.0,0.585051719,140167
4190,83.0,0.586172905,140501
4200,82.0,0.587430782,140826
4210,83.0,0.588543276,141163
4220,82.0,0.589665648,141489
4230,82.0,0.590778538,141812
4240,81.0,0.591890242,142134
4250,80.0,0.5934697,142475
4260,79.0,0.595973603,142807
4270,80.0,0.597110591,143140
4280,80.0,0.598237308,143478
4290,81.0,0.599354939,143818
4300,81.0,0.600941903,144160
4310,81.0,0.602320669,144494
4320,81.0,0.603900127,144832
4330,79.0,0.60503514,145165
4340,79.0,0.607399981,145509
4350,78.0,0.608518797,145838
4360,78.0,0.60974665,146182
4370,78.0,0.611005713,146505
4380,78.0,0.612286504,146842
4390,78.0,0.613412826,147176
4400,78.0,0.614542703,147516
4410,78.0,0.61567021,147860
4420,78.0,0.617952088,148202
4430,78.0,0.619060632,148531
4440,78.0,0.620314164,148872
4450,79.0,0.621432585,149201
4460,80.0,0.622584981,149543
4470,80.0,0.623677328,149861
4480,81.0,0.624917823,150192
4490,82.0,0.626073379,150530
4500,81.0,0.628953776,150853
4510,82.0,0.630085234,151192
4520,82.0,0.631379852,151523
4530,83.0,0.632525532,151873
4540,82.0,0.633894817,152201
4550,83.0,0.635002176,152537
4560,82.0,0.636112695,152871
4570,81.0,0.637210968,153196
4580,81.0,0.639530377,153531
4590,82.0,0.640672106,153862
4600,82.0,0.641803169,154197
4610,82.0,0.643511812,154530
4620,83.0,0.645042678,154859
4630,83.0,0.646178481,155193
4640,83.0,0.647715272,155532
4650,83.0,0.648861347,155867
4660,84.0,0.651042089,156195
4670,84.0,0.652376608,156529
4680,84.0,0.653554288,156863
4690,84.0,0.654745005,157191
4700,84.0,0.656621945,157527
4710,84.0,0.65827765,157857
4720,84.0,0.659386194,158188
4730,84.0,0.660526343,158526
4740,85.0,0.66334432,158863
4750,85.0,0.664817901,159198
4760,85.0,0.66605168,159539
4770,84.0,0.667238841,159872
4780,84.0,0.668358051,160207
4790,84.0,0.669568521,160548
4800,84.0,0.670702744,160887
4810,83.0,0.671898597,161229
4820,84.0,0.675450205,161559
4830,83.0,0.676579687,161899
4840,84.0,0.677685465,162233
4850,84.0,0.678893959,162570
4860,84.0,0.68001712,162918
4870,84.0,0.681141861,163260
4880,84.0,0.682264232,163594
4890,84.0,0.683401616,163934
4900,83.0,0.685567346,164264
4910,83.0,0.68667431,164588
4920,83.0,0.687929422,164915
4930,82.0,0.689053768,165249
4940,83.0,0.690167448,165575
4950,83.0,0.691297325,165918
4960,84.0,0.692427202,166255
4970,83.0,0.693567746,166598
4980,82.0,0.696282217,166927
4990,83.0,0.69766691,167272
5000,83.0,0.698762021,167603
