,x,y,target
0,-8.396106719970703,-15.657641410827637,3.0
1,-18.620494842529297,10.337509155273438,3.0
2,-2.723661184310913,13.926409721374512,1.0
3,5.920470237731934,27.840373992919922,0.0
4,-2.607041597366333,-37.760562896728516,1.0
5,3.323430299758911,-3.166586399078369,0.0
6,12.942397117614746,2.4267518520355225,0.0
7,37.60924530029297,20.511796951293945,3.0
8,38.780216217041016,20.833391189575195,0.0
9,16.79102897644043,15.892245292663574,0.0
10,-22.098690032958984,-17.92125701904297,0.0
11,2.212311267852783,20.193132400512695,0.0
12,29.757570266723633,13.084444046020508,1.0
13,-20.960412979125977,-7.328366756439209,0.0
14,-21.059261322021484,-11.553235054016113,0.0
15,-2.095837116241455,-31.077651977539062,1.0
16,-3.424069881439209,8.388978004455566,2.0
17,-31.532047271728516,5.008148193359375,0.0
18,8.111095428466797,-31.84638023376465,1.0
19,18.484067916870117,-14.469206809997559,1.0
20,12.097556114196777,-12.791708946228027,0.0
21,10.724629402160645,25.12588882446289,2.0
22,26.326181411743164,24.166715621948242,2.0
23,-4.932044506072998,22.153051376342773,3.0
24,-8.04134750366211,-26.240007400512695,3.0
25,-16.742965698242188,-18.826936721801758,3.0
26,20.97147560119629,2.657402515411377,2.0
27,7.7104692459106445,32.3807258605957,3.0
28,5.449446678161621,33.48277282714844,3.0
29,-8.746841430664062,-36.5296630859375,1.0
30,38.9882698059082,23.997570037841797,0.0
31,-28.28851318359375,-17.16083526611328,3.0
32,13.406535148620605,-6.238662242889404,3.0
33,-15.144293785095215,2.3146462440490723,1.0
34,5.844071865081787,34.19950866699219,2.0
35,7.053328514099121,31.356489181518555,3.0
36,4.820213317871094,27.261661529541016,1.0
37,24.337419509887695,-4.745389461517334,3.0
38,31.543415069580078,27.25973892211914,3.0
39,3.4250924587249756,28.117229461669922,3.0
40,-27.406078338623047,-3.416504144668579,0.0
41,-13.33307933807373,-32.23767852783203,3.0
42,-34.07929611206055,12.50109577178955,0.0
43,-37.1919059753418,-4.447495937347412,0.0
44,2.31941294670105,-29.267318725585938,3.0
45,2.5149998664855957,33.4157600402832,2.0
46,2.3375139236450195,18.568891525268555,0.0
47,37.677024841308594,14.190977096557617,0.0
48,38.67267608642578,19.70113182067871,3.0
49,40.3093376159668,15.539246559143066,0.0
50,9.89682388305664,-13.098163604736328,2.0
51,6.090100288391113,-23.567235946655273,1.0
52,18.22652816772461,31.884708404541016,3.0
53,-3.8119380474090576,22.35883140563965,2.0
54,-23.330751419067383,-14.200624465942383,2.0
55,-6.069226264953613,-18.52060890197754,2.0
56,4.915893077850342,-13.92944049835205,2.0
57,-21.226703643798828,12.740775108337402,3.0
58,36.49208450317383,25.647747039794922,2.0
59,-0.06586632132530212,-1.0303986072540283,0.0
60,-5.483914375305176,-10.54615592956543,1.0
61,7.102356910705566,-18.827138900756836,1.0
62,9.119721412658691,33.78424835205078,3.0
63,-33.733978271484375,-6.69080924987793,1.0
64,-14.996790885925293,-33.506046295166016,3.0
65,-18.183271408081055,-20.0881290435791,2.0
66,-11.876681327819824,-25.664812088012695,2.0
67,20.810829162597656,-12.692543983459473,1.0
68,14.837634086608887,-6.585597515106201,2.0
69,-14.110451698303223,-1.3416904211044312,0.0
70,-13.924955368041992,-31.616010665893555,3.0
71,-15.96393871307373,-20.07662010192871,3.0
72,-8.914843559265137,-34.137733459472656,0.0
73,36.56204605102539,14.149794578552246,2.0
74,17.237056732177734,10.677093505859375,1.0
75,31.698556900024414,15.477472305297852,2.0
76,-36.54878616333008,-4.987681865692139,1.0
77,32.423484802246094,24.607221603393555,0.0
78,-5.361882209777832,22.795940399169922,3.0
79,-28.129993438720703,14.082836151123047,0.0
80,-5.085128307342529,10.310673713684082,0.0
81,10.80679702758789,2.8230667114257812,0.0
82,9.310236930847168,3.8778834342956543,3.0
83,-7.777066707611084,-38.075408935546875,0.0
84,-8.2991943359375,-2.7252607345581055,0.0
85,16.361482620239258,1.8292958736419678,2.0
86,-25.497859954833984,13.350287437438965,0.0
87,-24.688446044921875,-11.835755348205566,1.0
88,-22.526737213134766,8.971065521240234,1.0
89,-24.762630462646484,-0.13946464657783508,2.0
90,21.32463264465332,30.091964721679688,3.0
91,-4.078342914581299,-16.50069808959961,3.0
92,11.722729682922363,-3.6243371963500977,0.0
93,14.441095352172852,4.261679649353027,2.0
94,-1.7401528358459473,16.031524658203125,3.0
95,-14.186121940612793,-26.522371292114258,2.0
96,-30.220060348510742,1.5527511835098267,0.0
97,-16.320430755615234,-17.264009475708008,3.0
98,20.49461555480957,17.3000431060791,2.0
99,-7.67376708984375,-11.971895217895508,2.0
100,-30.386449813842773,-2.4928996562957764,0.0
101,9.579062461853027,20.470840454101562,2.0
102,32.16789245605469,21.465517044067383,0.0
103,-14.985712051391602,-19.276979446411133,3.0
104,-7.667384147644043,-3.6699376106262207,0.0
105,-28.59715461730957,-16.445098876953125,2.0
106,7.131514549255371,-25.96405601501465,3.0
107,18.269474029541016,16.225818634033203,0.0
108,19.495155334472656,0.8199023008346558,3.0
109,-17.970088958740234,-20.569238662719727,2.0
110,-26.21636390686035,15.676669120788574,0.0
111,11.541717529296875,-26.187416076660156,3.0
112,-30.1164608001709,9.344682693481445,1.0
113,-32.161155700683594,-0.5815661549568176,0.0
114,-21.32025146484375,-10.040841102600098,0.0
115,2.2544307708740234,-25.63705825805664,3.0
116,33.23368835449219,11.26575756072998,3.0
117,-11.130091667175293,-1.5168249607086182,0.0
118,-3.7833759784698486,10.177188873291016,3.0
119,-26.738922119140625,6.536672115325928,1.0
120,-10.076640129089355,-22.260990142822266,2.0
121,30.967269897460938,14.303977012634277,2.0
122,-6.936147689819336,24.416004180908203,3.0
123,-22.744714736938477,11.600162506103516,1.0
124,13.797993659973145,32.8560791015625,3.0
125,10.580045700073242,-6.612082481384277,2.0
126,28.52374267578125,11.320582389831543,2.0
127,-1.2408931255340576,-25.551010131835938,3.0
128,-10.328295707702637,-23.041749954223633,1.0
129,-25.586566925048828,-15.902908325195312,3.0
130,13.982623100280762,-5.365211486816406,2.0
131,15.544215202331543,-13.904643058776855,0.0
132,33.400699615478516,21.98680877685547,2.0
133,6.793603897094727,-27.905794143676758,2.0
134,0.8610117435455322,-19.22452163696289,2.0
135,-11.567155838012695,-9.206135749816895,2.0
136,25.154367446899414,-5.667490005493164,3.0
137,7.263025283813477,33.935150146484375,3.0
138,-9.802287101745605,3.796096086502075,2.0
139,0.9813418388366699,0.8762518167495728,0.0
140,-5.488047122955322,-3.0476434230804443,0.0
141,24.917373657226562,18.78034019470215,0.0
142,9.116429328918457,-12.49048137664795,3.0
143,-17.83035659790039,4.7497148513793945,3.0
144,13.076701164245605,-9.399045944213867,2.0
145,10.06938648223877,26.796831130981445,1.0
146,12.746076583862305,27.94315528869629,3.0
147,-8.184575080871582,-17.821975708007812,3.0
148,31.852441787719727,12.90981674194336,3.0
149,16.452529907226562,31.123401641845703,2.0
150,30.4808292388916,25.69610023498535,2.0
151,21.458803176879883,18.114578247070312,1.0
152,-0.8290973901748657,-22.982200622558594,2.0
153,4.328732967376709,-19.7543888092041,1.0
154,6.744070053100586,10.170308113098145,1.0
155,-2.3789165019989014,-34.918758392333984,3.0
156,12.364069938659668,-11.259116172790527,3.0
157,20.611021041870117,5.261993885040283,2.0
158,-0.3743762969970703,15.512680053710938,1.0
159,23.187931060791016,11.365973472595215,0.0
160,4.234658241271973,-3.381632089614868,1.0
161,9.355242729187012,19.391626358032227,1.0
162,3.282304048538208,-12.558389663696289,0.0
163,-0.041161034256219864,-19.214109420776367,1.0
164,21.47624969482422,3.405595302581787,2.0
165,-5.456990718841553,26.2650203704834,3.0
166,-1.074920654296875,5.596934795379639,2.0
167,23.830238342285156,14.257355690002441,2.0
168,-27.440492630004883,1.3852930068969727,2.0
169,-12.889444351196289,6.978119373321533,1.0
170,-34.55183029174805,5.010106563568115,0.0
171,-31.357080459594727,11.494955062866211,1.0
172,-1.6582053899765015,-20.447437286376953,0.0
173,-27.659868240356445,-8.796140670776367,1.0
174,-9.995681762695312,0.3077860474586487,2.0
175,26.638391494750977,16.698379516601562,1.0
176,19.44651222229004,10.390634536743164,1.0
177,-12.223347663879395,-11.812775611877441,3.0
178,9.992920875549316,2.417241334915161,1.0
179,-6.100818634033203,-2.6312966346740723,1.0
180,13.457730293273926,-12.290329933166504,1.0
181,26.076637268066406,28.652650833129883,3.0
182,-28.074831008911133,-9.513742446899414,1.0
183,-12.204751014709473,-37.92538070678711,1.0
184,32.31471633911133,11.538118362426758,3.0
185,-17.825149536132812,9.732419967651367,2.0
186,8.001299858093262,-21.6408748626709,3.0
187,-33.307682037353516,-1.248877763748169,1.0
188,-29.081724166870117,-8.389493942260742,0.0
189,3.853222131729126,29.33435821533203,2.0
190,7.748178958892822,-23.399085998535156,3.0
191,-10.959796905517578,1.3297111988067627,1.0
192,-26.001264572143555,13.262606620788574,2.0
193,8.927276611328125,-10.937743186950684,3.0
194,25.587726593017578,-1.8570106029510498,3.0
195,8.944788932800293,-5.221863269805908,2.0
196,30.93037986755371,20.525020599365234,2.0
197,-27.342735290527344,3.515256643295288,2.0
198,-26.311635971069336,10.635828971862793,0.0
199,20.712881088256836,-1.8997581005096436,2.0
200,9.349581718444824,0.7862664461135864,0.0
201,6.614891052246094,-26.87190055847168,3.0
202,12.082620620727539,-20.885583877563477,1.0
203,-3.8525304794311523,18.487457275390625,2.0
204,18.914995193481445,0.9646679759025574,3.0
205,36.67802429199219,13.211183547973633,2.0
206,25.319284439086914,-3.3783462047576904,3.0
207,34.186283111572266,12.965924263000488,1.0
208,-7.986556053161621,3.0193772315979004,2.0
209,-12.38510799407959,3.291898012161255,3.0
210,-25.197582244873047,-14.351126670837402,1.0
211,31.948768615722656,21.57656478881836,1.0
212,-35.3514518737793,1.7954081296920776,0.0
213,-3.0358219146728516,-1.932486653327942,1.0
214,2.34138822555542,-22.897260665893555,3.0
215,-5.637375831604004,-35.65853500366211,1.0
216,-25.9517879486084,-14.540440559387207,2.0
217,-13.667396545410156,-21.997793197631836,3.0
218,-14.913947105407715,5.806601524353027,0.0
219,11.250472068786621,12.000879287719727,1.0
220,-18.518217086791992,-16.363998413085938,3.0
221,13.299853324890137,-2.7700467109680176,0.0
222,4.583233833312988,14.857032775878906,1.0
223,21.691007614135742,12.908926963806152,0.0
224,8.6004638671875,13.05703353881836,1.0
225,-13.13129997253418,-13.398944854736328,2.0
226,-35.04996109008789,-9.38952350616455,0.0
227,18.421920776367188,14.578232765197754,1.0
228,21.274314880371094,27.603700637817383,0.0
229,7.016791820526123,0.34847262501716614,1.0
230,10.744834899902344,-21.321584701538086,3.0
231,4.357716083526611,-16.50391387939453,0.0
232,9.36536979675293,-23.74066162109375,1.0
233,25.378026962280273,12.086155891418457,0.0
234,31.263782501220703,14.627163887023926,1.0
235,-14.379341125488281,-23.988807678222656,3.0
236,-16.125680923461914,-14.668255805969238,1.0
237,38.45364761352539,17.45322036743164,0.0
238,13.806525230407715,15.7685546875,2.0
239,-33.986881256103516,-2.217984676361084,0.0
240,3.307915449142456,24.832904815673828,2.0
241,-12.848579406738281,-32.193965911865234,2.0
242,9.597793579101562,24.893234252929688,0.0
243,-6.6683149337768555,-3.889442205429077,0.0
244,5.245631217956543,29.99078369140625,3.0
245,-1.2286772727966309,-31.697383880615234,1.0
246,9.07210636138916,13.769651412963867,1.0
247,5.242856025695801,29.672399520874023,3.0
248,-33.80878829956055,0.02838383987545967,0.0
249,-10.7413330078125,7.451434135437012,1.0
250,20.651742935180664,9.960220336914062,1.0
251,-19.131643295288086,-0.552249550819397,3.0
252,5.881039619445801,31.97757339477539,2.0
253,17.759002685546875,0.18830715119838715,0.0
254,-15.45484447479248,-12.610757827758789,3.0
255,13.907867431640625,8.297880172729492,2.0
256,10.935598373413086,-16.790231704711914,3.0
257,4.759788990020752,-10.550760269165039,1.0
258,-9.566734313964844,-0.04187509045004845,3.0
259,11.479323387145996,-15.508302688598633,3.0
260,-23.74672508239746,-15.780953407287598,3.0
261,4.880678176879883,-13.078940391540527,0.0
262,29.515888214111328,22.778047561645508,3.0
263,36.28931427001953,19.599275588989258,0.0
264,24.11093521118164,12.519667625427246,0.0
265,-4.744314193725586,-37.49010467529297,2.0
266,-7.169991970062256,6.039052963256836,1.0
267,-33.45524978637695,-8.384754180908203,2.0
268,-28.7739315032959,-12.264520645141602,3.0
269,10.467558860778809,5.1530303955078125,2.0
270,36.63348388671875,25.15947914123535,2.0
271,-12.134027481079102,-30.194557189941406,3.0
272,20.660839080810547,-10.667049407958984,0.0
273,9.730061531066895,12.671829223632812,2.0
274,36.31733322143555,15.834990501403809,1.0
275,-11.082870483398438,-4.2942938804626465,2.0
276,-34.71582794189453,11.671269416809082,0.0
277,-32.07438659667969,-7.518001556396484,1.0
278,-25.25307846069336,-4.610214710235596,0.0
279,17.12562370300293,5.787409782409668,2.0
280,19.73843765258789,7.881050109863281,0.0
281,34.4865837097168,24.453290939331055,2.0
282,-10.559270858764648,-35.271240234375,2.0
283,-10.656277656555176,-36.82453155517578,0.0
284,16.357763290405273,-7.605575084686279,2.0
285,11.409773826599121,-12.672903060913086,1.0
286,-21.053974151611328,3.170804977416992,1.0
287,-8.684093475341797,-12.961243629455566,3.0
288,4.159440040588379,-24.922744750976562,3.0
289,1.6235660314559937,19.198408126831055,0.0
290,-4.541808605194092,-23.70050621032715,2.0
291,4.791015148162842,-25.003124237060547,3.0
292,-8.036405563354492,14.70425033569336,3.0
293,34.75286865234375,10.059003829956055,3.0
294,6.917445659637451,18.201465606689453,2.0
295,25.318269729614258,25.736839294433594,2.0
296,3.7382748126983643,-1.4321136474609375,0.0
297,-21.2430477142334,-3.0304300785064697,3.0
298,11.16191577911377,11.045157432556152,0.0
299,2.6093738079071045,27.040884017944336,3.0
300,-27.475770950317383,9.97352123260498,0.0
301,18.065950393676758,18.304893493652344,0.0
302,-36.79762268066406,-0.5028982162475586,0.0
303,34.30953598022461,15.314746856689453,3.0
304,-14.010483741760254,0.727717936038971,3.0
305,-17.473934173583984,-16.27457046508789,3.0
306,-21.480945587158203,-15.103313446044922,2.0
307,-3.64711332321167,-33.97894287109375,3.0
308,-26.637426376342773,-19.876012802124023,1.0
309,19.747295379638672,-11.902545928955078,0.0
310,-0.2383580207824707,-4.91878604888916,2.0
311,17.10645866394043,32.161128997802734,3.0
312,-0.20682726800441742,27.801177978515625,2.0
313,-32.66880416870117,6.701989650726318,0.0
314,4.934635639190674,19.53154945373535,0.0
315,4.929839134216309,4.61995267868042,2.0
316,-10.248163223266602,4.117496967315674,3.0
317,25.607282638549805,3.595738649368286,0.0
318,-6.725908279418945,-19.76291275024414,3.0
319,-27.065507888793945,-12.672069549560547,3.0
320,34.24690628051758,10.514095306396484,3.0
321,6.424954414367676,7.071081638336182,3.0
322,-12.013904571533203,5.972655296325684,2.0
323,20.247758865356445,-2.3363430500030518,1.0
324,6.8022260665893555,33.894996643066406,2.0
325,0.1587725281715393,-15.69927978515625,2.0
326,25.2409725189209,3.5848324298858643,0.0
327,-12.521647453308105,-32.08928680419922,1.0
328,3.7383084297180176,8.597392082214355,3.0
329,-18.582536697387695,-2.0113840103149414,2.0
330,13.023876190185547,-21.07693862915039,3.0
331,-32.30712127685547,-2.95504093170166,0.0
332,-26.394582748413086,-19.91021728515625,2.0
333,-9.088993072509766,-25.757564544677734,2.0
334,-3.8293259143829346,-30.79386329650879,1.0
335,-12.241734504699707,2.1076788902282715,3.0
336,-17.040454864501953,-5.442722797393799,0.0
337,0.6541100144386292,-0.8050652146339417,0.0
338,14.110967636108398,3.057565689086914,0.0
339,-23.6729736328125,-18.63324737548828,3.0
340,-30.80332374572754,-9.73155403137207,1.0
341,37.43732452392578,20.274429321289062,0.0
342,-15.383584022521973,-6.3674397468566895,0.0
343,-11.540432929992676,-29.809507369995117,2.0
344,-2.752077341079712,-9.275816917419434,3.0
345,7.649335861206055,24.86762237548828,1.0
346,4.809898376464844,34.06916046142578,3.0
347,-28.237810134887695,-3.822049617767334,0.0
348,-2.1912636756896973,-35.043575286865234,1.0
349,3.6816048622131348,33.21430969238281,1.0
350,-4.751805305480957,-31.559581756591797,2.0
351,19.611007690429688,7.191700458526611,1.0
352,-27.348161697387695,-16.630971908569336,0.0
353,-34.60844421386719,5.160123825073242,0.0
354,5.296034336090088,-23.401634216308594,2.0
355,9.582185745239258,23.205768585205078,1.0
356,15.31724739074707,2.686375617980957,1.0
357,-9.737807273864746,-13.407557487487793,2.0
358,7.760807037353516,17.443653106689453,0.0
359,-19.33017921447754,-10.41474437713623,0.0
360,18.582361221313477,9.986753463745117,2.0
361,-13.05843448638916,-4.7334723472595215,1.0
362,-0.7243982553482056,31.491127014160156,3.0
363,26.96375274658203,26.67879295349121,3.0
364,-11.285880088806152,-20.374605178833008,3.0
365,3.9421794414520264,-11.490860939025879,1.0
366,-8.534186363220215,-10.193490028381348,3.0
367,21.70405387878418,11.759973526000977,2.0
368,7.629831790924072,-1.7727082967758179,0.0
369,-0.7781282663345337,-34.06818389892578,3.0
370,-0.009963641874492168,23.3447265625,3.0
371,4.033382892608643,-27.552762985229492,3.0
372,-35.854705810546875,-5.006236553192139,1.0
373,16.214120864868164,8.887662887573242,2.0
374,-4.562756538391113,-25.537254333496094,3.0
375,-3.3452398777008057,-37.942081451416016,1.0
376,-14.24608039855957,-10.603235244750977,3.0
377,-26.967971801757812,4.859015941619873,1.0
378,-3.6709237098693848,23.534339904785156,3.0
379,23.39759635925293,12.157929420471191,0.0
380,30.207914352416992,11.510336875915527,2.0
381,-33.764278411865234,12.815230369567871,0.0
382,16.798307418823242,-11.808610916137695,0.0
383,-18.729114532470703,-1.4557844400405884,3.0
384,-24.422176361083984,14.930562019348145,0.0
385,-18.95415496826172,-13.93757438659668,0.0
386,18.53109359741211,-7.425656795501709,1.0
387,-28.72494888305664,10.260653495788574,0.0
388,-8.999966621398926,-7.430450916290283,3.0
389,7.662708759307861,22.691904067993164,0.0
390,14.893997192382812,-5.747464179992676,1.0
391,-0.7254701852798462,-13.36920166015625,3.0
392,4.8108811378479,20.100313186645508,1.0
393,-6.34169864654541,17.792495727539062,1.0
394,-31.85767364501953,0.0005229596281424165,0.0
395,-1.783010482788086,-38.21382141113281,1.0
396,-7.892313003540039,-12.069734573364258,2.0
397,19.233325958251953,14.930877685546875,2.0
398,-12.955107688903809,2.398169755935669,2.0
399,11.237822532653809,20.120929718017578,3.0
400,-10.876063346862793,-33.82579040527344,1.0
401,7.761352062225342,-27.280675888061523,3.0
402,-13.505423545837402,-18.92443084716797,3.0
403,11.958924293518066,5.358103275299072,3.0
404,-32.1049919128418,2.0199599266052246,1.0
405,35.2360954284668,13.657959938049316,0.0
406,36.877193450927734,11.318973541259766,1.0
407,24.568485260009766,23.444475173950195,2.0
408,5.101257801055908,22.846887588500977,0.0
409,-19.642602920532227,-9.778709411621094,1.0
410,34.23183822631836,7.485922336578369,3.0
411,-15.104909896850586,-26.939788818359375,2.0
412,8.104436874389648,8.147912979125977,3.0
413,29.877765655517578,19.95222282409668,1.0
414,-26.618608474731445,11.332736015319824,1.0
415,5.276783466339111,16.837371826171875,0.0
416,-25.822052001953125,-12.361234664916992,0.0
417,1.5491106510162354,-15.6127347946167,2.0
418,2.2022833824157715,28.85365104675293,3.0
419,1.1773953437805176,22.81644058227539,2.0
420,-4.152520656585693,14.131280899047852,2.0
421,15.48693561553955,-18.305007934570312,3.0
422,24.018003463745117,19.58095932006836,0.0
423,19.322010040283203,-10.120126724243164,1.0
424,-22.482208251953125,-18.548912048339844,2.0
425,-1.8636471033096313,-0.6109902262687683,0.0
426,-6.514492034912109,17.070741653442383,2.0
427,3.9196276664733887,21.58010482788086,1.0
428,-19.08601951599121,-8.651143074035645,2.0
429,23.6204833984375,-4.768994331359863,3.0
430,-18.622133255004883,-20.269895553588867,3.0
431,5.892034530639648,15.282773971557617,1.0
432,-3.9194672107696533,-2.087908983230591,1.0
433,-20.22798728942871,10.270759582519531,3.0
434,-6.077398300170898,-31.567718505859375,2.0
435,-2.4109301567077637,-40.1290283203125,0.0
436,-35.88457489013672,-3.0966267585754395,0.0
437,16.79668426513672,15.312914848327637,0.0
438,-5.504703044891357,25.982784271240234,3.0
439,-5.032292366027832,16.06715965270996,3.0
440,29.64204216003418,23.947107315063477,2.0
441,-32.54254150390625,13.546546936035156,0.0
442,3.783813953399658,32.51715850830078,2.0
443,-2.5070652961730957,-32.120765686035156,2.0
444,17.260831832885742,29.740493774414062,2.0
445,-13.567622184753418,-24.85613250732422,2.0
446,-19.49332046508789,-8.530755043029785,2.0
447,-0.6501932144165039,25.096736907958984,3.0
448,-29.746583938598633,8.420124053955078,2.0
449,-23.50882339477539,-5.535584926605225,0.0
450,-12.867977142333984,-16.970182418823242,1.0
451,-1.3653111457824707,21.32884407043457,1.0
452,28.410680770874023,19.263765335083008,1.0
453,25.133577346801758,6.949850559234619,1.0
454,15.819318771362305,14.131908416748047,0.0
455,-8.979907989501953,1.5337082147598267,1.0
456,32.807533264160156,21.14847183227539,2.0
457,-3.566255807876587,8.882125854492188,1.0
458,-10.873839378356934,-16.661510467529297,1.0
459,-4.468628883361816,-35.938987731933594,0.0
460,6.3441009521484375,-18.91805076599121,1.0
461,-5.713456630706787,-30.62668228149414,3.0
462,7.227790355682373,8.946038246154785,3.0
463,-37.168121337890625,-1.7909553050994873,1.0
464,15.875953674316406,-10.048733711242676,1.0
465,-28.515708923339844,3.877007007598877,0.0
466,20.40831756591797,-12.805635452270508,1.0
467,-35.2918701171875,-4.695993900299072,1.0
468,38.47186279296875,16.414522171020508,0.0
469,10.320314407348633,-8.77972412109375,2.0
470,0.5229251384735107,5.610476493835449,3.0
471,6.799496173858643,-24.858779907226562,2.0
472,-25.499359130859375,10.519488334655762,0.0
473,-8.445069313049316,10.046573638916016,0.0
474,3.6124162673950195,14.566903114318848,0.0
475,-34.56155776977539,-4.2748637199401855,2.0
476,10.413990020751953,-26.448535919189453,3.0
477,-19.43831443786621,-12.014954566955566,1.0
478,-11.463109016418457,-29.29137420654297,2.0
479,-4.058584213256836,-26.274377822875977,3.0
480,-25.9296817779541,16.21126937866211,0.0
481,22.410289764404297,12.206453323364258,0.0
482,17.585464477539062,31.355928421020508,2.0
483,10.304314613342285,-16.32540512084961,1.0
484,-11.495265007019043,6.372677803039551,1.0
485,24.31907844543457,11.696341514587402,0.0
486,15.970354080200195,20.508283615112305,0.0
487,-31.526893615722656,7.987852573394775,1.0
488,14.976962089538574,-17.74147605895996,2.0
489,-3.781684398651123,-25.647937774658203,3.0
490,-2.869356870651245,-36.78602600097656,1.0
491,16.513134002685547,-3.180208206176758,3.0
492,-7.972356796264648,-32.85442352294922,0.0
493,14.741247177124023,1.4111485481262207,0.0
494,-0.5475038886070251,-26.212247848510742,3.0
495,7.151591777801514,20.39746856689453,0.0
496,-3.6817004680633545,-9.606799125671387,3.0
497,-29.590110778808594,-16.446882247924805,3.0
498,12.565072059631348,29.242589950561523,3.0
499,18.389307022094727,-11.37486743927002,1.0
500,11.831014633178711,-0.8309208750724792,0.0
501,25.524084091186523,1.0104042291641235,1.0
502,-5.698440074920654,19.49159812927246,2.0
503,9.386565208435059,4.397270679473877,1.0
504,-14.644848823547363,-18.135847091674805,3.0
505,35.01655578613281,8.690213203430176,3.0
506,22.295873641967773,14.154067993164062,0.0
507,-30.21112060546875,12.43807601928711,0.0
508,-9.164649963378906,-3.4476478099823,2.0
509,-0.8701089024543762,25.304645538330078,2.0
510,34.311737060546875,10.935859680175781,3.0
511,4.481240272521973,-20.998275756835938,1.0
512,12.370748519897461,-11.24224853515625,2.0
513,32.54287338256836,9.325127601623535,2.0
514,-21.29772186279297,14.686748504638672,2.0
515,0.8409764170646667,-7.350574016571045,0.0
516,9.264759063720703,-26.749588012695312,3.0
517,-11.334033012390137,-4.55521821975708,0.0
518,-0.3694019615650177,13.757219314575195,2.0
519,-6.593523979187012,-39.09999084472656,3.0
520,36.626319885253906,22.185874938964844,1.0
521,-21.060842514038086,-16.76908302307129,2.0
522,-9.620997428894043,-10.423822402954102,1.0
523,4.08416223526001,5.354583263397217,2.0
524,-13.226381301879883,-21.707561492919922,3.0
525,39.83855056762695,15.087778091430664,1.0
526,-7.441169261932373,-24.558090209960938,3.0
527,4.759775638580322,-19.05021858215332,0.0
528,-25.40365219116211,-5.286367893218994,0.0
529,-1.0843183994293213,-19.975656509399414,1.0
530,-12.250496864318848,-5.971414566040039,1.0
531,-25.606382369995117,-5.0510029792785645,0.0
532,-12.168612480163574,-14.724736213684082,3.0
533,3.4808993339538574,29.939393997192383,3.0
534,-6.640366554260254,24.349044799804688,3.0
535,-5.262324810028076,-24.613962173461914,3.0
536,-3.7331457138061523,5.947891712188721,3.0
537,16.279287338256836,2.4252803325653076,3.0
538,-16.713550567626953,-6.459376335144043,0.0
539,18.577022552490234,17.852123260498047,0.0
540,-0.06578145921230316,31.450374603271484,2.0
541,12.820928573608398,31.433635711669922,3.0
542,-24.194255828857422,-17.114028930664062,3.0
543,-21.823062896728516,-7.170040607452393,1.0
544,-8.280272483825684,12.781455039978027,1.0
545,2.1934638023376465,-29.591392517089844,3.0
546,-4.802104949951172,21.295455932617188,1.0
547,-27.33308219909668,-13.974159240722656,2.0
548,-13.57280158996582,11.801060676574707,0.0
549,-3.263465404510498,-0.6990395188331604,1.0
550,18.954511642456055,-12.843231201171875,0.0
551,-10.553895950317383,-32.52852249145508,2.0
552,26.754011154174805,26.21578598022461,2.0
553,23.701234817504883,17.61345100402832,0.0
554,10.954512596130371,-14.153952598571777,2.0
555,-4.773396968841553,-2.2988128662109375,0.0
556,-27.60995101928711,15.043011665344238,0.0
557,5.331967353820801,-16.891237258911133,1.0
558,37.89686965942383,11.7405366897583,3.0
559,-23.078876495361328,-13.539798736572266,1.0
560,-1.9109630584716797,6.7597527503967285,1.0
561,35.76640701293945,22.94666862487793,1.0
562,-15.994736671447754,-22.008590698242188,3.0
563,17.254093170166016,-7.0623393058776855,0.0
564,-7.450622081756592,-14.920947074890137,1.0
565,-2.8605363368988037,-23.060718536376953,2.0
566,40.239295959472656,18.876026153564453,1.0
567,24.085159301757812,19.132394790649414,0.0
568,34.84159469604492,19.749753952026367,0.0
569,10.592658042907715,19.31780242919922,2.0
570,24.846477508544922,9.689057350158691,1.0
571,-9.072925567626953,-16.21339225769043,3.0
572,40.88554382324219,14.856163024902344,0.0
573,-8.989209175109863,-34.559940338134766,0.0
574,-12.064175605773926,-11.90690803527832,2.0
575,-0.2661007344722748,1.5397206544876099,0.0
576,11.214043617248535,17.113300323486328,0.0
577,12.563679695129395,4.665763854980469,2.0
578,-25.985904693603516,4.245713233947754,2.0
579,-18.73335838317871,1.2497873306274414,3.0
580,0.8873274922370911,-4.643162250518799,0.0
581,-14.386161804199219,-9.75515079498291,2.0
582,8.930402755737305,-24.231327056884766,1.0
583,-26.8494815826416,1.0642648935317993,0.0
584,-10.374645233154297,-12.348282814025879,3.0
585,18.02690887451172,9.607823371887207,2.0
586,4.46102237701416,2.3704097270965576,3.0
587,-6.703446865081787,-20.553251266479492,2.0
588,9.574124336242676,31.869325637817383,2.0
589,-29.466310501098633,9.448894500732422,0.0
590,-14.978032112121582,-14.312427520751953,0.0
591,-14.149983406066895,-34.47721481323242,2.0
592,6.827485084533691,7.4315619468688965,2.0
593,20.814603805541992,13.456999778747559,1.0
594,-13.939142227172852,-35.07659149169922,1.0
595,-19.51991844177246,1.6213059425354004,3.0
596,-34.24863815307617,-7.3424577713012695,0.0
597,-28.55596351623535,-14.534723281860352,1.0
598,-10.263900756835938,-29.99639320373535,2.0
599,-10.05671501159668,-23.86403465270996,3.0
600,-21.494522094726562,-14.180749893188477,2.0
601,-11.348573684692383,-34.08541488647461,2.0
602,10.050435066223145,32.43983840942383,2.0
603,15.314409255981445,13.075989723205566,0.0
604,-12.683164596557617,-35.05926513671875,1.0
605,6.580810070037842,21.737646102905273,1.0
606,-35.12920379638672,-2.3913893699645996,0.0
607,12.296414375305176,-25.53778076171875,2.0
608,-4.989100933074951,-19.14571189880371,2.0
609,-35.437110900878906,11.106175422668457,0.0
610,-29.98672103881836,-15.42592716217041,1.0
611,-19.454627990722656,12.825100898742676,2.0
612,23.932966232299805,6.47626256942749,2.0
613,27.196928024291992,1.4796062707901,0.0
614,18.291629791259766,5.68125057220459,1.0
615,-15.709855079650879,-18.605430603027344,3.0
616,-11.976097106933594,-6.0934224128723145,2.0
617,-32.406375885009766,2.2101547718048096,0.0
618,10.3072509765625,-21.779640197753906,2.0
619,-31.5079288482666,-1.4637603759765625,0.0
620,11.08759593963623,-7.100015163421631,1.0
621,-16.70886993408203,-10.10172176361084,3.0
622,-29.123226165771484,-10.931941032409668,3.0
623,2.380739450454712,-34.92613983154297,1.0
624,9.721492767333984,11.162443161010742,1.0
625,28.62375831604004,14.549222946166992,1.0
626,-30.077472686767578,-2.5733487606048584,0.0
627,-11.089889526367188,-19.82122039794922,1.0
628,-0.5373159646987915,-13.65614128112793,2.0
629,17.399574279785156,-6.147500991821289,0.0
630,-20.022350311279297,-4.168532848358154,2.0
631,-3.186232566833496,-24.186433792114258,3.0
632,14.406072616577148,-10.972127914428711,2.0
633,-25.75446128845215,11.699969291687012,0.0
634,-5.478482246398926,12.238851547241211,1.0
635,4.851952075958252,23.484907150268555,1.0
636,1.4763790369033813,31.814590454101562,3.0
637,-5.62059211730957,16.887903213500977,2.0
638,2.761854887008667,32.71512222290039,3.0
639,39.69739532470703,22.965789794921875,1.0
640,27.707719802856445,11.64632797241211,3.0
641,8.874170303344727,-28.016246795654297,3.0
642,-0.1448940485715866,33.01738739013672,3.0
643,7.49205207824707,24.882984161376953,0.0
644,-20.382732391357422,0.8446252942085266,3.0
645,25.91990089416504,-4.811439037322998,3.0
646,1.4857122898101807,-23.868757247924805,1.0
647,4.538405418395996,-3.584923028945923,0.0
648,-23.407560348510742,13.448930740356445,1.0
649,-30.877473831176758,-3.8282079696655273,0.0
650,9.714316368103027,35.40031051635742,2.0
651,-34.93930435180664,-0.4770563244819641,0.0
652,-34.399871826171875,9.920913696289062,1.0
653,2.334101676940918,20.403547286987305,2.0
654,5.465776443481445,-19.765586853027344,2.0
655,-15.027606964111328,-9.918351173400879,2.0
656,12.982850074768066,0.0839950293302536,2.0
657,7.303116321563721,-21.2370548248291,3.0
658,-12.145223617553711,-8.822826385498047,3.0
659,0.6553657650947571,-22.2370662689209,2.0
660,23.233684539794922,4.75569486618042,1.0
661,-5.3180365562438965,-14.481134414672852,1.0
662,-10.336688995361328,-11.32991886138916,3.0
663,-6.890420436859131,25.737220764160156,3.0
664,-12.674164772033691,-17.172405242919922,2.0
665,-8.950172424316406,-7.340063571929932,3.0
666,-7.1525444984436035,-37.106475830078125,0.0
667,-36.81035232543945,-5.609344959259033,1.0
668,2.3862197399139404,17.084758758544922,0.0
669,-7.553478240966797,-38.830387115478516,1.0
670,-16.961986541748047,-10.18445110321045,3.0
671,13.360342979431152,-23.91924476623535,3.0
672,-30.80270767211914,-5.59059476852417,0.0
673,-4.315244674682617,-17.770044326782227,3.0
674,-2.997303009033203,18.45448112487793,1.0
675,-21.934423446655273,-17.081954956054688,1.0
676,-26.94291114807129,2.9362993240356445,2.0
677,21.433530807495117,5.479317665100098,0.0
678,18.86939239501953,7.1878252029418945,2.0
679,-3.0691065788269043,-4.163748264312744,0.0
680,-20.423805236816406,-6.359035968780518,1.0
681,-15.911484718322754,4.448567867279053,1.0
682,-14.511794090270996,-16.876951217651367,2.0
683,-6.9649481773376465,-32.06950378417969,2.0
684,-30.492937088012695,6.690600872039795,0.0
685,-16.254440307617188,-6.300283908843994,0.0
686,-26.641664505004883,14.761885643005371,0.0
687,16.037506103515625,-10.813098907470703,1.0
688,3.874309539794922,16.127241134643555,1.0
689,9.766767501831055,-16.372751235961914,0.0
690,-7.4634504318237305,5.349679470062256,2.0
691,-14.316511154174805,-14.498614311218262,2.0
692,28.896381378173828,25.42395782470703,3.0
693,12.150689125061035,22.14037322998047,1.0
694,5.43267297744751,-14.429162979125977,1.0
695,5.822880268096924,-16.00645637512207,1.0
696,7.748510837554932,9.50314712524414,2.0
697,10.455045700073242,17.242507934570312,0.0
698,-29.447612762451172,-8.752912521362305,0.0
699,11.252513885498047,31.687002182006836,3.0
700,-30.440893173217773,-6.581212997436523,0.0
701,40.76061248779297,18.246002197265625,0.0
702,11.940049171447754,-3.0517776012420654,1.0
703,5.364264488220215,15.696832656860352,0.0
704,-2.663607358932495,-2.9378671646118164,0.0
705,6.5846171379089355,-1.8807802200317383,0.0
706,9.76353931427002,13.554161071777344,0.0
707,-25.06018829345703,-20.929271697998047,3.0
708,32.314125061035156,22.422910690307617,2.0
709,-21.195289611816406,-13.959125518798828,2.0
710,-3.380584716796875,-10.071582794189453,3.0
711,-1.9755487442016602,16.613109588623047,3.0
712,5.827451705932617,-2.3064677715301514,0.0
713,-34.07208251953125,5.425057888031006,0.0
714,13.42471694946289,-21.734909057617188,2.0
715,25.683238983154297,-0.9060129523277283,1.0
716,25.3643856048584,15.895936965942383,0.0
717,-34.27171325683594,10.757102966308594,0.0
718,7.857431411743164,-30.178619384765625,3.0
719,-26.041194915771484,10.202999114990234,2.0
720,-21.919530868530273,12.745704650878906,1.0
721,-1.2555142641067505,-4.975511074066162,1.0
722,33.49701690673828,19.492448806762695,2.0
723,5.077322483062744,27.662811279296875,0.0
724,28.463245391845703,13.925863265991211,1.0
725,-27.53866195678711,-12.10594367980957,1.0
726,33.9346923828125,18.600887298583984,0.0
727,-22.08192253112793,-1.7341909408569336,1.0
728,38.99592590332031,24.59543800354004,0.0
729,-20.505172729492188,10.475995063781738,3.0
730,-4.825753688812256,-18.308513641357422,3.0
731,30.174800872802734,15.262190818786621,2.0
732,-26.403854370117188,6.946150302886963,2.0
733,12.30329704284668,-31.847309112548828,3.0
734,-14.219301223754883,-36.47724914550781,0.0
735,14.770925521850586,-3.069920778274536,2.0
736,32.879066467285156,13.461989402770996,1.0
737,12.022330284118652,33.396705627441406,3.0
738,0.7871636748313904,-16.710399627685547,3.0
739,20.602935791015625,8.906682014465332,1.0
740,-25.014890670776367,-20.02701759338379,2.0
741,29.857120513916016,23.797395706176758,1.0
742,-28.18467903137207,0.8650884628295898,0.0
743,-26.68880844116211,-9.13380241394043,0.0
744,13.928235054016113,17.25967025756836,0.0
745,-26.785999298095703,12.922989845275879,1.0
746,28.21182632446289,19.50777244567871,1.0
747,34.22453689575195,7.168176651000977,3.0
748,-16.40102195739746,-19.98828887939453,3.0
749,13.513309478759766,0.562675416469574,1.0
750,10.77635383605957,12.016707420349121,1.0
751,27.651979446411133,27.684524536132812,2.0
752,-12.315957069396973,-1.417205572128296,0.0
753,17.391277313232422,-7.49166202545166,1.0
754,-7.83331298828125,-39.63867950439453,2.0
755,-16.377960205078125,-21.540239334106445,3.0
756,-24.452123641967773,12.511324882507324,1.0
757,-28.39984703063965,-15.479510307312012,1.0
758,-34.514854431152344,-9.699332237243652,1.0
759,-23.619943618774414,-5.031167507171631,0.0
760,5.217748641967773,-3.2739083766937256,0.0
761,12.095833778381348,-2.02846360206604,0.0
762,-18.6863956451416,-17.7571964263916,1.0
763,-14.168985366821289,-6.049180507659912,2.0
764,1.5574110746383667,-27.496150970458984,1.0
765,33.97739791870117,18.7336483001709,0.0
766,9.230297088623047,21.673215866088867,0.0
767,25.33820152282715,27.65159034729004,3.0
768,8.69419002532959,22.315093994140625,2.0
769,-2.0197746753692627,7.316808700561523,2.0
770,-9.5859956741333,-3.2388904094696045,2.0
771,36.898468017578125,23.951007843017578,2.0
772,18.91014862060547,29.347522735595703,3.0
773,8.39235782623291,10.175877571105957,2.0
774,-3.667011260986328,-23.945816040039062,2.0
775,-19.06943702697754,-5.070505142211914,2.0
776,12.556928634643555,2.5513107776641846,0.0
777,13.332703590393066,18.65087127685547,0.0
778,-9.24541187286377,-14.729511260986328,3.0
779,-21.525436401367188,-19.880950927734375,2.0
780,-28.868955612182617,-18.527795791625977,3.0
781,21.683624267578125,19.84853744506836,0.0
782,4.974931716918945,35.84808349609375,3.0
783,-9.184258460998535,-39.223968505859375,3.0
784,1.6736549139022827,-20.398481369018555,3.0
785,-2.508856773376465,7.470381736755371,1.0
786,16.52086639404297,3.1301116943359375,2.0
787,-26.057405471801758,-18.935592651367188,3.0
788,1.8422095775604248,-21.546785354614258,2.0
789,15.544485092163086,-2.542524576187134,3.0
790,27.140714645385742,24.965961456298828,2.0
791,-25.621374130249023,-17.467992782592773,2.0
792,-30.58523178100586,0.1982567310333252,0.0
793,3.3906986713409424,16.092945098876953,2.0
794,11.902423858642578,4.340800762176514,1.0
795,-5.3999409675598145,23.685319900512695,3.0
796,29.530174255371094,26.35270881652832,2.0
797,21.28631019592285,28.066200256347656,1.0
798,30.11126708984375,17.996047973632812,2.0
799,1.8547488451004028,23.248485565185547,3.0
800,4.2375407218933105,10.625353813171387,2.0
801,21.898229598999023,4.430453777313232,1.0
802,-23.99477195739746,2.560370445251465,3.0
803,-29.312721252441406,7.61929178237915,0.0
804,-2.94988751411438,0.017273442819714546,1.0
805,-13.817198753356934,-15.941207885742188,3.0
806,4.115645408630371,-2.8941526412963867,1.0
807,39.432350158691406,25.09776496887207,0.0
808,39.63134765625,21.87451934814453,1.0
809,-21.55643081665039,10.08981990814209,2.0
810,-17.561033248901367,-15.459766387939453,2.0
811,-33.227481842041016,-5.774653911590576,0.0
812,-6.648108959197998,13.752923011779785,1.0
813,14.135120391845703,-4.008583068847656,3.0
814,7.550633430480957,-6.613935947418213,0.0
815,25.370033264160156,23.563642501831055,1.0
816,-0.7472813129425049,12.81735610961914,1.0
817,-10.216595649719238,-14.657796859741211,2.0
818,-26.904001235961914,3.2719733715057373,1.0
819,18.303956985473633,32.717472076416016,3.0
820,-3.5093917846679688,14.1842622756958,2.0
821,3.8587422370910645,-30.783632278442383,1.0
822,24.184993743896484,3.008995771408081,1.0
823,-20.834209442138672,1.9582645893096924,1.0
824,31.77025032043457,19.296859741210938,3.0
825,4.274553298950195,-22.29915428161621,2.0
826,25.745859146118164,27.803592681884766,3.0
827,-9.124642372131348,-18.194608688354492,3.0
828,-19.632965087890625,12.240321159362793,2.0
829,25.364748001098633,6.940153121948242,2.0
830,-0.16020724177360535,-19.05990219116211,2.0
831,-2.1631596088409424,-13.803099632263184,2.0
832,-6.286548614501953,-9.280069351196289,2.0
833,18.887683868408203,3.8826780319213867,0.0
834,-35.121826171875,3.1345908641815186,0.0
835,13.689806938171387,-9.903993606567383,2.0
836,14.722171783447266,31.67353630065918,3.0
837,-6.4328389167785645,-12.289712905883789,2.0
838,-8.871796607971191,-24.154348373413086,2.0
839,31.420169830322266,26.238906860351562,3.0
840,3.3739898204803467,26.714698791503906,3.0
841,40.769554138183594,17.566913604736328,1.0
842,11.58683967590332,27.446300506591797,1.0
843,38.53768539428711,13.55142593383789,0.0
844,14.678977012634277,3.8421883583068848,1.0
845,19.19404411315918,-11.216967582702637,1.0
846,-14.141979217529297,2.1495168209075928,2.0
847,-15.203408241271973,-0.6576449275016785,0.0
848,37.2092170715332,10.98377799987793,2.0
849,-9.561277389526367,-35.8859748840332,1.0
850,17.59896469116211,19.551345825195312,1.0
851,-32.317996978759766,-5.945006847381592,1.0
852,-35.561927795410156,-3.201856851577759,1.0
853,10.408882141113281,1.694440245628357,0.0
854,-5.003180027008057,17.97162628173828,3.0
855,-7.480410575866699,21.310791015625,2.0
856,7.005764484405518,35.94231033325195,2.0
857,20.440656661987305,15.184782028198242,1.0
858,36.39240646362305,14.417723655700684,1.0
859,31.200727462768555,25.387767791748047,1.0
860,2.846616506576538,-27.73863410949707,3.0
861,26.55157470703125,17.47068977355957,0.0
862,6.030674934387207,25.444311141967773,0.0
863,8.010457038879395,-31.080062866210938,3.0
864,-19.42815399169922,-2.722194194793701,1.0
865,-16.95586395263672,4.657917499542236,1.0
866,2.003262758255005,-26.058279037475586,3.0
867,17.0728702545166,7.254458904266357,1.0
868,3.5638840198516846,-30.723247528076172,2.0
869,-22.377239227294922,-9.332890510559082,1.0
870,1.742922067642212,29.306262969970703,3.0
871,5.727343559265137,23.528148651123047,0.0
872,5.982520580291748,-12.668750762939453,3.0
873,32.03596878051758,13.108611106872559,3.0
874,-11.031293869018555,-13.497735977172852,3.0
875,-8.2755708694458,-15.218544006347656,2.0
876,-27.311437606811523,13.810503959655762,1.0
877,39.7851676940918,16.620973587036133,0.0
878,8.194656372070312,-33.46221160888672,1.0
879,7.2578444480896,21.378477096557617,1.0
880,18.253095626831055,7.8115458488464355,2.0
881,-11.078995704650879,-36.34141540527344,1.0
882,-3.3738183975219727,26.30712127685547,1.0
883,-10.454413414001465,-2.946782112121582,2.0
884,14.610048294067383,18.471837997436523,0.0
885,13.096968650817871,21.892921447753906,1.0
886,8.743194580078125,-25.397607803344727,3.0
887,29.469697952270508,16.065086364746094,3.0
888,12.233783721923828,21.539710998535156,1.0
889,14.046340942382812,29.17351531982422,2.0
890,3.862138032913208,-12.547086715698242,2.0
891,-14.536394119262695,5.622170448303223,1.0
892,-5.548871994018555,-16.670379638671875,3.0
893,17.411598205566406,-13.289117813110352,0.0
894,-0.5252294540405273,-26.080303192138672,3.0
895,11.94000244140625,31.705820083618164,3.0
896,25.605731964111328,15.876738548278809,1.0
897,13.289203643798828,-4.990058898925781,2.0
898,-7.670500755310059,4.007012367248535,2.0
899,-31.46770477294922,7.182102203369141,0.0
900,-18.072710037231445,-6.50733757019043,0.0
901,7.449142932891846,-6.035189628601074,1.0
902,5.623402118682861,-4.453144073486328,0.0
903,16.747085571289062,20.159223556518555,0.0
904,-37.09986877441406,-0.08046422153711319,0.0
905,-22.093765258789062,-12.284266471862793,0.0
906,18.485193252563477,29.132722854614258,3.0
907,2.7147326469421387,-35.005279541015625,0.0
908,18.4898624420166,-9.077432632446289,2.0
909,-0.3613719642162323,-22.551687240600586,0.0
910,-1.9066026210784912,-34.26385498046875,3.0
911,-32.16203689575195,-1.5703870058059692,0.0
912,2.1246819496154785,-21.882631301879883,1.0
913,-13.657431602478027,-29.926563262939453,3.0
914,4.486998558044434,2.034114360809326,3.0
915,13.39684009552002,-7.544321537017822,3.0
916,-0.14309155941009521,26.232942581176758,3.0
917,-6.700936317443848,-8.298643112182617,2.0
918,5.6792426109313965,10.261870384216309,2.0
919,13.258793830871582,29.45578384399414,3.0
920,-31.413654327392578,2.8418283462524414,1.0
921,28.442121505737305,26.063446044921875,2.0
922,2.2461118698120117,-4.154026985168457,0.0
923,-34.06639099121094,11.136591911315918,0.0
924,0.7523736953735352,19.121065139770508,1.0
925,0.7091021537780762,-7.199193000793457,0.0
926,-33.742183685302734,-8.993202209472656,0.0
927,14.418591499328613,-8.495035171508789,2.0
928,25.974807739257812,-0.508758008480072,1.0
929,2.07613468170166,16.406023025512695,0.0
930,9.951220512390137,28.883228302001953,3.0
931,10.497051239013672,-0.8434098362922668,0.0
932,8.158745765686035,-6.08056116104126,1.0
933,-25.318416595458984,0.26346224546432495,0.0
934,-34.02709197998047,-5.972596168518066,1.0
935,4.943817138671875,-11.202181816101074,1.0
936,-19.96980094909668,-15.120382308959961,1.0
937,-18.100385665893555,-8.099488258361816,3.0
938,-20.224746704101562,-13.070338249206543,2.0
939,7.490185260772705,-23.92220687866211,2.0
940,21.623046875,-0.1763116419315338,2.0
941,-32.79907989501953,-0.28074148297309875,1.0
942,13.69973373413086,15.782084465026855,1.0
943,-14.862417221069336,-23.483518600463867,3.0
944,24.774961471557617,9.778099060058594,1.0
945,-29.395593643188477,3.383272171020508,0.0
946,-2.80314564704895,-34.38311004638672,3.0
947,-31.49382781982422,0.8252353072166443,2.0
948,17.038076400756836,21.409160614013672,1.0
949,4.519983768463135,-29.575523376464844,2.0
950,12.023030281066895,17.012924194335938,0.0
951,26.42198944091797,18.09531593322754,0.0
952,11.505279541015625,24.769084930419922,3.0
953,-4.5668416023254395,-32.761600494384766,3.0
954,-18.573375701904297,12.495244026184082,2.0
955,2.1094810962677,11.41037654876709,1.0
956,-3.5688178539276123,21.193931579589844,2.0
957,-25.196544647216797,-3.4712631702423096,1.0
958,13.941320419311523,27.908632278442383,2.0
959,6.344071865081787,35.353084564208984,0.0
960,-31.142715454101562,-8.905674934387207,1.0
961,31.000608444213867,11.699769973754883,3.0
962,4.121041774749756,-17.608821868896484,1.0
963,6.675189971923828,-20.557968139648438,1.0
964,22.642683029174805,-4.79168176651001,2.0
965,-25.78092384338379,-3.0725414752960205,0.0
966,13.384822845458984,3.707186222076416,2.0
967,-17.213245391845703,-14.487504959106445,1.0
968,35.73136520385742,15.768653869628906,1.0
969,6.198256492614746,-27.7466983795166,2.0
970,-8.630329132080078,-17.453155517578125,3.0
971,-15.03493595123291,-0.7004355788230896,0.0
972,-31.3524169921875,13.205391883850098,0.0
973,-8.45455551147461,10.178175926208496,0.0
974,-5.499395370483398,-32.45414733886719,1.0
975,2.9904115200042725,-16.687040328979492,0.0
976,21.642269134521484,17.852825164794922,2.0
977,-21.582738876342773,-2.593081474304199,2.0
978,14.124678611755371,27.411609649658203,3.0
979,10.494970321655273,33.36705017089844,2.0
