iterations,fitness,time,fevals
0,21.0,0.00169916200001,583
10,22.0,0.00330904,1050
20,23.0,0.004890078,1540
30,23.0,0.00644346300001,2029
40,26.0,0.00796484700001,2516
50,26.0,0.00977541600001,2998
60,27.0,0.012413641,3477
70,27.0,0.014057889,3960
80,27.0,0.015522779,4453
90,27.0,0.016940657,4941
100,27.0,0.018328905,5422
110,27.0,0.019740066,5899
120,28.0,0.021303327,6395
130,27.0,0.022661155,6875
140,28.0,0.025355478,7355
150,28.0,0.026925059,7844
160,27.0,0.028442887,8322
170,28.0,0.029842592,8808
180,27.0,0.031265605,9289
190,28.0,0.032940668,9786
200,29.0,0.034386595,10268
210,27.0,0.036462251,10742
220,28.0,0.039979093,11232
230,28.0,0.041470057,11716
240,28.0,0.042968132,12203
250,28.0,0.044406158,12667
260,29.0,0.045846159,13140
270,28.0,0.047685568,13619
280,28.0,0.049145322,14099
290,29.0,0.051337522,14594
300,29.0,0.055155402,15085
310,29.0,0.057193132,15560
320,30.0,0.058702665,16050
330,29.0,0.061064345,16533
340,31.0,0.06256163,17008
350,30.0,0.064028891,17481
360,30.0,0.065541979,17953
370,30.0,0.06697803,18438
380,31.0,0.070446675,18916
390,30.0,0.071862182,19382
400,31.0,0.073289936,19863
410,31.0,0.074728356,20348
420,31.0,0.076207468,20837
430,31.0,0.077685,21323
440,32.0,0.079265644,21815
450,33.0,0.08178456,22280
460,33.0,0.084413303,22758
470,34.0,0.086295774,23240
480,35.0,0.087765009,23725
490,34.0,0.089187232,24212
500,34.0,0.090614197,24696
510,35.0,0.092024964,25174
520,35.0,0.093418348,25645
530,35.0,0.094980818,26130
540,36.0,0.098443931,26609
550,35.0,0.099914747,27098
560,34.0,0.101339736,27574
570,34.0,0.102764725,28051
580,34.0,0.104187738,28529
590,34.0,0.106252332,29005
600,34.0,0.107787148,29481
610,34.0,0.10920384,29961
620,33.0,0.11178241,30449
630,34.0,0.113234658,30945
640,34.0,0.114673078,31429
650,34.0,0.116510512,31913
660,34.0,0.118320291,32394
670,34.0,0.119812441,32884
680,34.0,0.121900739,33372
690,34.0,0.124047902,33857
700,34.0,0.126684151,34336
710,35.0,0.128156942,34824
720,37.0,0.129630918,35312
730,36.0,0.131127018,35782
740,36.0,0.133313291,36261
750,35.0,0.134763564,36750
760,35.0,0.136164849,37226
770,36.0,0.137585491,37705
780,36.0,0.140239913,38190
790,37.0,0.142300161,38683
800,36.0,0.143760705,39169
810,36.0,0.145216113,39646
820,38.0,0.146957152,40135
830,38.0,0.148415326,40606
840,36.0,0.15018718,41087
850,37.0,0.151987082,41575
860,36.0,0.155079233,42048
870,36.0,0.156521605,42522
880,36.0,0.157962001,43007
890,37.0,0.159417805,43492
900,36.0,0.160966054,43963
910,38.0,0.162406845,44444
920,36.0,0.163863438,44922
930,39.0,0.165286847,45400
940,37.0,0.168021072,45886
950,37.0,0.169476086,46383
960,37.0,0.171228581,46864
970,37.0,0.173304237,47345
980,37.0,0.175821968,47821
990,37.0,0.177470562,48304
1000,37.0,0.179029082,48783
1010,37.0,0.180517281,49273
1020,37.0,0.183169727,49754
1030,36.0,0.184610518,50219
1040,37.0,0.186084495,50696
1050,40.0,0.18767778,51165
1060,39.0,0.189153337,51648
1070,37.0,0.19060677,52124
1080,37.0,0.192016747,52603
1090,39.0,0.193449637,53094
1100,37.0,0.19601201,53580
1110,39.0,0.198062383,54060
1120,37.0,0.199520952,54551
1130,37.0,0.201764904,55034
1140,37.0,0.203178831,55514
1150,37.0,0.20482703,56009
1160,38.0,0.206570044,56474
1170,37.0,0.207998589,56968
1180,39.0,0.211233357,57451
1190,39.0,0.213516421,57935
1200,38.0,0.215322644,58415
1210,39.0,0.217006399,58906
1220,41.0,0.218485116,59381
1230,41.0,0.219934993,59859
1240,46.0,0.221410945,60349
1250,43.0,0.222864773,60833
1260,44.0,0.226114553,61319
1270,45.0,0.227549418,61793
1280,53.0,0.229002061,62281
1290,54.0,0.230704778,62762
1300,53.0,0.232309124,63245
1310,53.0,0.233733718,63723
1320,53.0,0.235149225,64213
1330,54.0,0.236547745,64698
1340,54.0,0.2390315,65189
1350,54.0,0.240864193,65671
1360,54.0,0.242568095,66172
1370,54.0,0.243979652,66653
1380,54.0,0.245404641,67132
1390,54.0,0.246829235,67608
1400,55.0,0.248274767,68099
1410,54.0,0.250823312,68582
1420,54.0,0.252258177,69062
1430,54.0,0.25371161,69533
1440,52.0,0.255128302,70003
1450,54.0,0.256534327,70483
1460,53.0,0.257930081,70960
1470,53.0,0.259347564,71440
1480,54.0,0.260966923,71923
1490,54.0,0.263495715,72415
1500,53.0,0.265038432,72907
1510,53.0,0.266778285,73391
1520,55.0,0.26817483,73870
1530,53.0,0.26957809,74352
1540,53.0,0.271105005,74832
1550,53.0,0.272512611,75305
1560,53.0,0.27394234,75785
1570,53.0,0.277219774,76255
1580,54.0,0.278699281,76742
1590,54.0,0.280134937,77229
1600,54.0,0.281725457,77711
1610,55.0,0.283257507,78205
1620,55.0,0.284668273,78687
1630,55.0,0.286182941,79164
1640,55.0,0.287726448,79649
1650,55.0,0.290295141,80143
1660,54.0,0.291692871,80623
1670,55.0,0.29309218,81106
1680,54.0,0.294547194,81587
1690,54.0,0.296073318,82074
1700,55.0,0.29761327,82567
1710,53.0,0.299071444,83064
1720,54.0,0.300457322,83552
1730,55.0,0.303116089,84028
1740,55.0,0.304634708,84520
1750,54.0,0.306470957,85012
1760,55.0,0.30788923,85483
1770,54.0,0.309312243,85961
1780,55.0,0.310733677,86446
1790,55.0,0.312135357,86922
1800,53.0,0.313525186,87397
1810,53.0,0.316073731,87878
1820,53.0,0.317483707,88361
1830,56.0,0.318918177,88854
1840,54.0,0.320319462,89329
1850,54.0,0.32170297,89808
1860,54.0,0.323552651,90281
1870,55.0,0.325002528,90763
1880,54.0,0.326560257,91255
1890,55.0,0.330202333,91743
1900,54.0,0.331648656,92222
1910,54.0,0.333038879,92700
1920,54.0,0.334438979,93183
1930,55.0,0.336078487,93657
1940,56.0,0.338137551,94138
1950,56.0,0.339645898,94628
1960,57.0,0.341169257,95103
1970,56.0,0.343951284,95583
1980,57.0,0.345360865,96059
1990,57.0,0.346764126,96547
2000,57.0,0.348163831,97032
2010,58.0,0.349578153,97524
2020,57.0,0.350947043,97989
2030,57.0,0.353174798,98474
2040,57.0,0.354652724,98959
2050,58.0,0.357631097,99439
2060,59.0,0.359027641,99912
2070,58.0,0.360412728,100391
2080,59.0,0.362210655,100873
2090,59.0,0.363653026,101355
2100,59.0,0.365188632,101833
2110,59.0,0.367280485,102314
2120,59.0,0.368769079,102797
2130,59.0,0.371233871,103278
2140,58.0,0.372670317,103756
2150,58.0,0.37421422,104239
2160,58.0,0.375634073,104729
2170,58.0,0.377410667,105203
2180,59.0,0.379197137,105687
2190,59.0,0.380782126,106163
2200,61.0,0.382276646,106635
2210,61.0,0.384739068,107118
2220,59.0,0.386148649,107607
2230,60.0,0.389742133,108089
2240,59.0,0.391210974,108559
2250,58.0,0.392910926,109045
2260,59.0,0.394365939,109526
2270,60.0,0.395764063,110000
2280,60.0,0.39727241,110483
2290,63.0,0.399821746,110972
2300,63.0,0.401220265,111448
2310,63.0,0.403491082,111919
2320,64.0,0.405129009,112411
2330,65.0,0.406523183,112894
2340,64.0,0.407922098,113376
2350,64.0,0.409302444,113853
2360,64.0,0.410981458,114340
2370,64.0,0.413521707,114813
2380,64.0,0.414928128,115293
2390,65.0,0.416340475,115780
2400,64.0,0.418129316,116252
2410,64.0,0.419685465,116738
2420,64.0,0.421112825,117237
2430,62.0,0.422510159,117722
2440,64.0,0.423899592,118195
2450,61.0,0.426770508,118683
2460,61.0,0.428165867,119155
2470,61.0,0.429567942,119633
2480,61.0,0.430972783,120109
2490,61.0,0.432392241,120587
2500,62.0,0.433811304,121074
2510,63.0,0.436837084,121549
2520,62.0,0.439493086,122028
2530,61.0,0.442271557,122502
2540,62.0,0.443681138,122977
2550,63.0,0.445725979,123460
2560,62.0,0.447121338,123930
2570,61.0,0.44853329,124418
2580,61.0,0.450023859,124912
2590,62.0,0.451395514,125394
2600,63.0,0.452907811,125877
2610,62.0,0.456120456,126355
2620,61.0,0.457651716,126833
2630,62.0,0.459341001,127322
2640,61.0,0.46076915,127809
2650,60.0,0.462192559,128290
2660,62.0,0.463580017,128766
2670,61.0,0.464982882,129249
2680,61.0,0.466383377,129728
2690,61.0,0.468903873,130216
2700,61.0,0.470489258,130705
2710,61.0,0.471913852,131195
2720,61.0,0.473306446,131671
2730,61.0,0.474706546,132159
2740,60.0,0.476097164,132640
2750,60.0,0.477498844,133126
2760,61.0,0.479469414,133605
2770,60.0,0.482470701,134081
2780,61.0,0.483852233,134565
2790,61.0,0.485368481,135050
2800,61.0,0.486888284,135534
2810,63.0,0.488734804,136009
2820,62.0,0.490144781,136496
2830,61.0,0.491766906,136979
2840,62.0,0.493184388,137471
2850,63.0,0.495777576,137947
2860,61.0,0.49736059,138425
2870,62.0,0.498851159,138906
2880,62.0,0.500572444,139390
2890,63.0,0.502258964,139864
2900,64.0,0.503723854,140344
2910,64.0,0.505245238,140821
2920,64.0,0.506620054,141297
2930,64.0,0.509162673,141772
2940,65.0,0.510629539,142260
2950,64.0,0.511992503,142744
2960,64.0,0.51337759,143222
2970,64.0,0.514859862,143708
2980,65.0,0.516274579,144198
2990,65.0,0.517697198,144689
3000,64.0,0.519140755,145185
3010,65.0,0.522221449,145655
3020,63.0,0.523598635,146139
3030,65.0,0.525180068,146619
3040,63.0,0.526556069,147102
3050,64.0,0.527950243,147593
3060,62.0,0.529622146,148086
3070,63.0,0.531010394,148572
3080,63.0,0.532363876,149047
3090,63.0,0.53490847,149542
3100,63.0,0.536312125,150018
3110,63.0,0.537699188,150489
3120,63.0,0.539369906,150960
3130,62.0,0.540882204,151442
3140,63.0,0.542304032,151922
3150,63.0,0.544258009,152419
3160,63.0,0.545743047,152898
3170,63.0,0.548471741,153385
3180,65.0,0.549986409,153879
3190,65.0,0.551422064,154365
3200,65.0,0.5528992,154848
3210,65.0,0.554280732,155332
3220,66.0,0.555754708,155814
3230,64.0,0.557117277,156296
3240,64.0,0.558830266,156771
3250,65.0,0.561744639,157250
3260,64.0,0.563888641,157735
3270,64.0,0.565423852,158223
3280,64.0,0.56681052,158701
3290,64.0,0.568186126,159170
3300,64.0,0.569779016,159660
3310,64.0,0.571194523,160161
3320,64.0,0.572580795,160642
3330,63.0,0.57598702,161134
3340,63.0,0.577386725,161608
3350,62.0,0.578784454,162084
3360,63.0,0.58022327,162575
3370,63.0,0.58165458,163054
3380,63.0,0.583029396,163530
3390,63.0,0.584471373,164016
3400,63.0,0.585873054,164492
3410,63.0,0.588403031,164964
3420,64.0,0.589816563,165443
3430,63.0,0.591219034,165923
3440,64.0,0.592618344,166408
3450,63.0,0.594038988,166887
3460,63.0,0.595406298,167365
3470,64.0,0.596800867,167833
3480,64.0,0.598168572,168308
3490,64.0,0.600633364,168796
3500,65.0,0.602014501,169288
3510,64.0,0.603347046,169757
3520,66.0,0.604689467,170229
3530,66.0,0.606053221,170717
3540,66.0,0.607963741,171212
3550,66.0,0.609314458,171686
3560,66.0,0.610713373,172171
3570,66.0,0.613127992,172644
3580,66.0,0.614649771,173124
3590,67.0,0.616551994,173616
3600,65.0,0.617954859,174105
3610,66.0,0.619391305,174589
3620,67.0,0.620764541,175070
3630,67.0,0.622148839,175547
3640,66.0,0.623690371,176043
3650,67.0,0.626146077,176528
3660,67.0,0.627925831,177012
3670,67.0,0.629344499,177502
3680,67.0,0.630744204,177985
3690,67.0,0.63243349,178465
3700,67.0,0.633814627,178942
3710,66.0,0.635178776,179411
3720,66.0,0.63657453,179901
3730,66.0,0.639029446,180381
3740,66.0,0.640428361,180866
3750,67.0,0.642223523,181349
3760,67.0,0.643648907,181838
3770,68.0,0.645146587,182316
3780,69.0,0.646773847,182798
3790,68.0,0.648140366,183281
3800,68.0,0.649492268,183754
3810,68.0,0.651863035,184238
3820,69.0,0.65322995,184729
3830,70.0,0.654716963,185220
3840,69.0,0.656473409,185707
3850,69.0,0.657839534,186189
3860,70.0,0.659200127,186676
3870,69.0,0.661257215,187164
3880,69.0,0.663147587,187659
3890,69.0,0.664509761,188139
3900,70.0,0.665888132,188623
3910,70.0,0.667363689,189106
3920,69.0,0.669014258,189590
3930,69.0,0.670378407,190071
3940,69.0,0.67183184,190554
3950,70.0,0.673191249,191040
3960,71.0,0.676041227,191512
3970,71.0,0.67752824,191989
3980,71.0,0.67892518,192480
3990,71.0,0.680279848,192963
4000,71.0,0.681635701,193454
4010,72.0,0.682976146,193928
4020,73.0,0.68443432,194408
4030,72.0,0.685797284,194885
4040,72.0,0.689718274,195358
4050,72.0,0.691146423,195834
4060,72.0,0.692642918,196313
4070,72.0,0.694031166,196784
4080,72.0,0.695545439,197264
4090,75.0,0.697151761,197746
4100,75.0,0.698478774,198210
4110,72.0,0.699830281,198687
4120,72.0,0.702470086,199176
4130,72.0,0.703936556,199668
4140,72.0,0.705295964,200141
4150,72.0,0.706635225,200607
4160,72.0,0.708089053,201079
4170,71.0,0.709433054,201557
4180,71.0,0.711220709,202049
4190,71.0,0.712557994,202539
4200,72.0,0.715001058,203009
4210,71.0,0.717380121,203504
4220,71.0,0.718880566,203982
4230,71.0,0.7202459,204447
4240,72.0,0.721679185,204940
4250,71.0,0.72317568,205424
4260,71.0,0.724525212,205901
4270,72.0,0.725889362,206376
4280,72.0,0.728406303,206862
4290,72.0,0.729762156,207350
4300,72.0,0.73115791,207824
4310,73.0,0.732707343,208310
4320,72.0,0.734084135,208793
4330,72.0,0.735459346,209276
4340,72.0,0.736780038,209753
4350,72.0,0.738088484,210234
4360,72.0,0.740625177,210726
4370,72.0,0.742697672,211209
4380,72.0,0.744299254,211695
4390,72.0,0.74561086,212179
4400,73.0,0.746962367,212651
4410,75.0,0.748325726,213124
4420,79.0,0.749953777,213613
4430,78.0,0.751342025,214099
4440,78.0,0.754227558,214584
4450,78.0,0.755583016,215077
4460,79.0,0.756915955,215556
4470,79.0,0.758240203,216028
4480,79.0,0.759627661,216494
4490,79.0,0.761114675,216969
4500,79.0,0.762472899,217452
4510,78.0,0.763981641,217928
4520,79.0,0.766676754,218407
4530,79.0,0.76894283,218895
4540,79.0,0.770291572,219374
4550,79.0,0.771647425,219858
4560,79.0,0.773085055,220342
4570,79.0,0.774425105,220820
4580,80.0,0.77586234,221294
4590,79.0,0.777199625,221775
4600,78.0,0.780825505,222267
4610,78.0,0.782200322,222752
4620,78.0,0.783672323,223243
4630,78.0,0.785016324,223727
4640,77.0,0.786481609,224207
4650,77.0,0.78782798,224690
4660,78.0,0.789242302,225191
4670,77.0,0.79059381,225674
4680,77.0,0.793085467,226148
4690,77.0,0.794431444,226621
4700,79.0,0.796138112,227107
4710,79.0,0.797532681,227591
4720,77.0,0.798904731,228073
4730,77.0,0.800352239,228555
4740,76.0,0.801696636,229035
4750,76.0,0.803159156,229512
4760,77.0,0.805690713,229984
4770,76.0,0.807007455,230450
4780,76.0,0.808375159,230937
4790,76.0,0.809723506,231409
4800,77.0,0.811056051,231879
4810,78.0,0.812878867,232377
4820,77.0,0.814830869,232859
4830,77.0,0.816173685,233339
4840,80.0,0.818609242,233832
4850,78.0,0.819948897,234317
4860,79.0,0.821286972,234804
4870,79.0,0.822625837,235281
4880,80.0,0.824092703,235761
4890,79.0,0.825422877,236242
4900,80.0,0.826741989,236717
4910,80.0,0.82808283,237204
4920,80.0,0.830559474,237681
4930,80.0,0.832601154,238178
4940,80.0,0.834075131,238668
4950,81.0,0.835453897,239144
4960,83.0,0.836786047,239619
4970,81.0,0.838115826,240100
4980,81.0,0.839450741,240583
4990,81.0,0.840769853,241053
5000,81.0,0.843649855,241532
