,x,y,target
0,30.373754501342773,-13.470438003540039,1.0
1,-49.63536834716797,11.083236694335938,0.0
2,9.293065071105957,23.83879852294922,0.0
3,31.23238754272461,-16.912353515625,2.0
4,-38.93709945678711,-7.852028846740723,2.0
5,-15.34404182434082,-8.36990737915039,1.0
6,22.279935836791992,-4.76032018661499,0.0
7,-14.23838996887207,-16.006731033325195,0.0
8,-46.305572509765625,11.663421630859375,0.0
9,22.03618049621582,19.555843353271484,3.0
10,10.537802696228027,-10.790362358093262,0.0
11,-39.344032287597656,3.592069387435913,3.0
12,16.98463249206543,-13.331594467163086,3.0
13,17.233142852783203,-17.49169158935547,1.0
14,1.1648699045181274,22.848434448242188,1.0
15,9.031654357910156,-9.264434814453125,0.0
16,28.982145309448242,-8.260247230529785,2.0
17,20.478506088256836,8.217975616455078,0.0
18,35.78030776977539,5.229191303253174,0.0
19,-36.907962799072266,-6.199548244476318,0.0
20,-8.782806396484375,5.277645111083984,0.0
21,24.58726692199707,6.592396259307861,3.0
22,-35.853511810302734,-13.448164939880371,3.0
23,24.883453369140625,8.29644775390625,1.0
24,3.809016704559326,-17.82959747314453,1.0
25,21.60063362121582,-11.225354194641113,2.0
26,-41.700042724609375,0.07443272322416306,0.0
27,28.043542861938477,-14.340615272521973,0.0
28,-13.168206214904785,-3.0248141288757324,3.0
29,42.94058609008789,-5.595475196838379,3.0
30,26.429075241088867,-11.271394729614258,2.0
31,20.207218170166016,4.901744365692139,2.0
32,-39.17283248901367,-15.590861320495605,3.0
33,2.403318405151367,10.532115936279297,1.0
34,-55.80963134765625,2.151914358139038,1.0
35,-50.08150100708008,13.26744270324707,2.0
36,-25.97774887084961,8.951869010925293,3.0
37,26.808582305908203,9.005977630615234,3.0
38,-44.694610595703125,12.082564353942871,0.0
39,11.201781272888184,13.899325370788574,1.0
40,-10.694663047790527,-19.46829605102539,0.0
41,-35.28010559082031,8.987935066223145,1.0
42,8.3297700881958,-2.9317686557769775,0.0
43,-0.9572689533233643,-15.092554092407227,1.0
44,16.875383377075195,-4.772553443908691,1.0
45,31.715566635131836,9.380048751831055,1.0
46,1.2108409404754639,-0.7374999523162842,3.0
47,-7.824226379394531,15.057116508483887,1.0
48,35.882320404052734,-3.337162494659424,1.0
49,17.276962280273438,-14.433487892150879,3.0
50,-56.17131423950195,8.283493041992188,0.0
51,-44.89927673339844,-3.5895168781280518,3.0
52,-46.89590835571289,-2.6093437671661377,3.0
53,-19.428377151489258,-10.095745086669922,2.0
54,37.17746353149414,-10.73280143737793,2.0
55,-37.11060333251953,-15.351436614990234,3.0
56,32.33567428588867,-18.856220245361328,0.0
57,-52.969459533691406,3.7272448539733887,1.0
58,-41.78911590576172,10.700678825378418,0.0
59,-7.232257843017578,-23.89715576171875,1.0
60,-56.686344146728516,4.134467124938965,1.0
61,14.221320152282715,32.93605041503906,1.0
62,20.870481491088867,7.362765312194824,1.0
63,-3.4457361698150635,-4.21035623550415,0.0
64,29.635133743286133,-1.3053069114685059,0.0
65,-33.19301223754883,-9.66130256652832,2.0
66,-13.737119674682617,-11.943293571472168,3.0
67,-46.05144500732422,0.5758854746818542,2.0
68,-41.27722930908203,-10.320352554321289,3.0
69,23.910900115966797,-19.253257751464844,2.0
70,9.036385536193848,9.899059295654297,3.0
71,30.141122817993164,-18.805999755859375,2.0
72,42.35015106201172,8.568795204162598,2.0
73,-15.690543174743652,-21.594709396362305,2.0
74,14.929481506347656,-6.60026741027832,0.0
75,23.132997512817383,-13.04281997680664,2.0
76,-6.819437026977539,-19.17851448059082,3.0
77,-43.71965789794922,13.135377883911133,1.0
78,19.3985595703125,23.114543914794922,2.0
79,9.869939804077148,-12.335865020751953,1.0
80,-11.491730690002441,-13.734427452087402,1.0
81,28.809133529663086,7.138780117034912,0.0
82,20.881366729736328,-8.401376724243164,0.0
83,-34.25096893310547,8.859310150146484,1.0
84,-1.0438876152038574,-14.355637550354004,3.0
85,21.682321548461914,-8.227581024169922,1.0
86,-27.735910415649414,-3.2041285037994385,3.0
87,27.435216903686523,-10.08850383758545,0.0
88,-27.51757049560547,11.523123741149902,2.0
89,-42.60319900512695,-7.243227481842041,2.0
90,30.537256240844727,-12.371232032775879,1.0
91,27.623687744140625,9.732037544250488,3.0
92,-38.43380355834961,-15.373268127441406,3.0
93,2.536468982696533,3.9417996406555176,0.0
94,-4.245795726776123,-14.626693725585938,3.0
95,18.38784408569336,21.86794090270996,3.0
96,9.378067970275879,31.522958755493164,3.0
97,17.76335906982422,18.196502685546875,0.0
98,3.9941203594207764,-17.37822914123535,0.0
99,32.0172233581543,3.0579323768615723,0.0
100,4.648653030395508,10.568448066711426,2.0
101,7.609431743621826,5.864775657653809,2.0
102,25.4791259765625,-8.118545532226562,2.0
103,-14.719487190246582,-7.833883285522461,1.0
104,5.683613300323486,11.18936824798584,0.0
105,36.48125457763672,1.5186021327972412,3.0
106,39.45770263671875,-16.353178024291992,1.0
107,-18.215253829956055,1.1800203323364258,2.0
108,-49.15687561035156,-14.281630516052246,1.0
109,7.768250465393066,19.146726608276367,3.0
110,-50.60075378417969,-9.236336708068848,1.0
111,34.84811019897461,5.537235736846924,3.0
112,-48.27589416503906,-9.44031047821045,1.0
113,18.49553680419922,29.49204444885254,0.0
114,5.565466403961182,28.139909744262695,1.0
115,-17.351083755493164,8.639652252197266,2.0
116,20.980304718017578,11.476020812988281,2.0
117,-16.404865264892578,-19.360977172851562,1.0
118,-40.098411560058594,3.211473226547241,3.0
119,44.21321105957031,5.654041290283203,1.0
120,42.70494079589844,4.326054573059082,1.0
121,34.298248291015625,7.835198402404785,0.0
122,-37.94855499267578,-0.3171641528606415,3.0
123,-36.35527801513672,-12.106707572937012,1.0
124,10.625625610351562,34.2576904296875,3.0
125,-2.020292043685913,-23.3348445892334,3.0
126,17.024803161621094,11.723678588867188,0.0
127,39.987056732177734,-5.725387096405029,1.0
128,21.226335525512695,3.0936119556427,0.0
129,-9.561676979064941,-25.265296936035156,3.0
130,9.666031837463379,6.999053478240967,3.0
131,-1.434920310974121,-28.321306228637695,1.0
132,44.469322204589844,3.389314651489258,2.0
133,-11.704008102416992,-12.57234001159668,2.0
134,22.953060150146484,-5.963237285614014,3.0
135,24.699430465698242,-17.89138412475586,1.0
136,-0.842153787612915,-10.186413764953613,2.0
137,-53.088844299316406,9.460712432861328,0.0
138,-47.74557113647461,-1.6767770051956177,3.0
139,-31.672883987426758,-6.137897491455078,3.0
140,21.52370834350586,6.1865949630737305,3.0
141,8.597920417785645,27.34648895263672,0.0
142,18.150617599487305,-10.1279296875,2.0
143,19.461694717407227,-10.783055305480957,1.0
144,11.844757080078125,4.0461297035217285,3.0
145,-49.65781021118164,-9.568336486816406,0.0
146,-43.86964416503906,-6.725117206573486,0.0
147,-17.510807037353516,6.821901798248291,0.0
148,-0.5485143065452576,-6.735768795013428,3.0
149,-2.0923545360565186,16.046754837036133,3.0
150,0.1038622111082077,-25.39203453063965,2.0
151,-33.05844497680664,-3.938246250152588,0.0
152,-19.551185607910156,-9.470951080322266,1.0
153,10.537107467651367,-0.3658679127693176,3.0
154,0.0654517337679863,-7.026634216308594,3.0
155,-3.8400514125823975,0.5057227611541748,1.0
156,-45.83302307128906,9.818339347839355,0.0
157,-50.44307327270508,13.386540412902832,2.0
158,-0.014369994401931763,5.050076007843018,1.0
159,9.449297904968262,26.50589942932129,2.0
160,23.41792106628418,-16.048803329467773,0.0
161,5.141348838806152,-11.002755165100098,2.0
162,-45.036163330078125,14.537665367126465,3.0
163,-19.459430694580078,6.871214389801025,3.0
164,-43.09464645385742,6.819370746612549,2.0
165,26.574316024780273,-15.435571670532227,2.0
166,8.436171531677246,21.736757278442383,3.0
167,5.1013970375061035,25.451000213623047,1.0
168,3.7425410747528076,10.404091835021973,1.0
169,-46.408538818359375,6.093677520751953,3.0
170,-51.01570510864258,-2.51828932762146,3.0
171,-47.537349700927734,10.041862487792969,2.0
172,-48.83884048461914,11.66506290435791,1.0
173,34.1805534362793,-17.28435707092285,3.0
174,19.427553176879883,6.300769329071045,0.0
175,-45.95200729370117,-13.199849128723145,1.0
176,19.646690368652344,-9.894922256469727,1.0
177,42.9521484375,-4.200308799743652,2.0
178,34.68227767944336,11.80162525177002,2.0
179,8.818510055541992,9.273212432861328,2.0
180,-35.289913177490234,-13.983236312866211,3.0
181,19.37049102783203,25.351369857788086,3.0
182,-40.165794372558594,-10.295381546020508,1.0
183,-7.101301670074463,14.286338806152344,1.0
184,7.257940769195557,21.901201248168945,3.0
185,44.77595901489258,2.2118923664093018,2.0
186,41.43149185180664,5.943678855895996,2.0
187,-31.697126388549805,4.8835835456848145,2.0
188,-4.601163387298584,-16.753280639648438,0.0
189,38.69581985473633,-15.810111045837402,2.0
190,14.87747859954834,31.53635025024414,2.0
191,27.655166625976562,-9.068526268005371,2.0
192,29.891372680664062,-6.834551811218262,1.0
193,24.04840660095215,10.518588066101074,0.0
194,43.11628723144531,-6.95463228225708,1.0
195,7.901778221130371,11.308385848999023,2.0
196,-44.106849670410156,7.021695613861084,3.0
197,3.225198268890381,-0.27777600288391113,1.0
198,-53.78038787841797,-12.12491226196289,0.0
199,-15.348174095153809,15.88039493560791,2.0
200,-8.535497665405273,-26.24378776550293,2.0
201,-4.668801784515381,20.7647705078125,3.0
202,-11.351896286010742,7.727478981018066,1.0
203,-2.890587091445923,-24.49977684020996,3.0
204,-49.594017028808594,7.973417282104492,3.0
205,-47.9391975402832,-11.724763870239258,1.0
206,13.122567176818848,-11.863791465759277,0.0
207,28.30246925354004,-21.738061904907227,1.0
208,0.47480228543281555,7.713759422302246,2.0
209,10.357658386230469,1.3495937585830688,1.0
210,-3.3106002807617188,-23.9332218170166,3.0
211,11.86185073852539,-3.948491096496582,2.0
212,-36.55670928955078,3.3845956325531006,1.0
213,16.963773727416992,-5.344954967498779,3.0
214,3.4718990325927734,11.687219619750977,0.0
215,-26.857032775878906,10.368194580078125,1.0
216,0.4091171324253082,-15.625251770019531,0.0
217,40.38368225097656,8.287373542785645,2.0
218,-43.62257766723633,-6.13383674621582,1.0
219,-38.427921295166016,-12.878207206726074,2.0
220,-10.560018539428711,-19.4738826751709,0.0
221,16.055696487426758,27.746383666992188,1.0
222,-13.78873348236084,-10.381514549255371,3.0
223,-40.67778015136719,-10.794278144836426,2.0
224,-15.507372856140137,0.06238585337996483,2.0
225,14.729479789733887,28.20557403564453,1.0
226,18.940425872802734,4.1813740730285645,1.0
227,-2.7667315006256104,0.03210391476750374,3.0
228,-36.778289794921875,3.8677239418029785,0.0
229,-1.1898726224899292,-25.239072799682617,3.0
230,37.28564453125,2.6808478832244873,3.0
231,2.295139789581299,-31.88589859008789,2.0
232,-4.1188507080078125,-4.6475605964660645,1.0
233,-16.522886276245117,-20.692235946655273,2.0
234,39.8508415222168,-10.491990089416504,3.0
235,-7.235576152801514,19.009056091308594,3.0
236,28.7940731048584,-12.621070861816406,0.0
237,30.366249084472656,6.409963607788086,1.0
238,-9.949324607849121,6.251077175140381,2.0
239,-54.73902130126953,4.617518901824951,1.0
240,-17.394775390625,-13.44978141784668,1.0
241,-9.576869010925293,15.144773483276367,2.0
242,19.0208683013916,0.40986397862434387,0.0
243,8.620025634765625,-4.1266255378723145,0.0
244,-19.395448684692383,-20.26252555847168,1.0
245,34.81766128540039,2.531505823135376,0.0
246,24.35421371459961,-16.578718185424805,3.0
247,9.433866500854492,-5.118040561676025,2.0
248,24.488605499267578,2.200150489807129,1.0
249,-36.0501708984375,1.097348690032959,1.0
250,-9.11852741241455,-18.153369903564453,2.0
251,4.345251083374023,23.116085052490234,3.0
252,18.867197036743164,18.874858856201172,3.0
253,26.44300079345703,4.669459819793701,2.0
254,17.25025749206543,14.522499084472656,1.0
255,-18.82631492614746,9.69100284576416,3.0
256,31.59137725830078,1.0326731204986572,2.0
257,-5.4914374351501465,-3.3173768520355225,2.0
258,15.206921577453613,3.181288957595825,3.0
259,15.321147918701172,-14.001436233520508,0.0
260,-10.57487678527832,15.406342506408691,1.0
261,36.51057052612305,-9.091601371765137,2.0
262,11.106894493103027,26.485090255737305,2.0
263,-50.916046142578125,-8.951286315917969,1.0
264,41.70466232299805,-2.7248544692993164,3.0
265,-37.34023666381836,-0.8605038523674011,3.0
266,37.86137008666992,-7.8643975257873535,3.0
267,18.877544403076172,-4.296092510223389,3.0
268,30.61078453063965,-4.756917953491211,0.0
269,17.907081604003906,4.7282209396362305,3.0
270,-3.3183791637420654,-11.887543678283691,1.0
271,42.223758697509766,2.7310097217559814,2.0
272,25.750247955322266,13.509032249450684,0.0
273,-10.894827842712402,16.149696350097656,0.0
274,-21.066946029663086,-10.007855415344238,0.0
275,23.198516845703125,18.449893951416016,2.0
276,-51.128353118896484,-2.055448055267334,0.0
277,-3.87398624420166,-3.6608831882476807,3.0
278,-12.456933975219727,-2.7154881954193115,3.0
279,-31.91679573059082,6.432046890258789,0.0
280,15.515294075012207,22.342782974243164,3.0
281,-5.963522911071777,-27.379514694213867,2.0
282,-15.349761962890625,-4.603882312774658,2.0
283,25.743772506713867,6.76476526260376,0.0
284,26.055904388427734,2.9444844722747803,0.0
285,23.14908218383789,8.434253692626953,0.0
286,34.049442291259766,-4.002293586730957,3.0
287,-1.719222903251648,-18.89215087890625,0.0
288,-41.093936920166016,0.649187445640564,3.0
289,-53.440547943115234,12.864527702331543,0.0
290,-30.668466567993164,1.2398353815078735,1.0
291,22.190288543701172,4.819884300231934,0.0
292,16.38519287109375,6.436634540557861,3.0
293,-49.07273864746094,-8.779544830322266,3.0
294,-33.02518844604492,-8.565530776977539,0.0
295,7.50534725189209,22.527273178100586,2.0
296,-38.92502975463867,7.047974586486816,2.0
297,-53.26399612426758,-3.5823259353637695,3.0
298,22.90474510192871,9.488166809082031,3.0
299,-49.539573669433594,-3.9849865436553955,3.0
300,-17.481698989868164,-6.986013889312744,1.0
301,10.219399452209473,4.2158660888671875,2.0
302,-9.034441947937012,-2.437690496444702,3.0
303,4.618570804595947,11.894758224487305,3.0
304,-40.19072341918945,-7.695037841796875,0.0
305,-13.449858665466309,-14.594501495361328,3.0
306,-38.65451431274414,-8.014702796936035,0.0
307,-2.3320682048797607,-18.676490783691406,3.0
308,9.9196138381958,31.24067497253418,0.0
309,17.33133316040039,18.795705795288086,0.0
310,41.50271987915039,7.720520973205566,1.0
311,-38.177513122558594,-2.1405763626098633,0.0
312,6.2466325759887695,21.353878021240234,0.0
313,44.18465805053711,-0.8391934633255005,3.0
314,-49.28719711303711,0.7554817199707031,1.0
315,-1.8963614702224731,15.647900581359863,3.0
316,13.726306915283203,-12.310525894165039,3.0
317,36.01166534423828,9.83188247680664,3.0
318,31.880706787109375,11.905423164367676,0.0
319,-56.03742218017578,0.33164092898368835,2.0
320,6.828895092010498,18.66444206237793,0.0
321,31.047536849975586,-17.656204223632812,0.0
322,-3.4404587745666504,21.207799911499023,1.0
323,17.33169937133789,-7.6790900230407715,2.0
324,17.45839500427246,21.60362434387207,3.0
325,-32.442481994628906,-6.347250938415527,0.0
326,32.35513687133789,-8.674674034118652,2.0
327,27.930042266845703,-1.3035122156143188,2.0
328,3.0449259281158447,0.584911048412323,2.0
329,-53.307315826416016,14.027664184570312,3.0
330,10.043458938598633,-8.906350135803223,3.0
331,26.7098445892334,-7.910581588745117,1.0
332,31.941354751586914,-15.21373462677002,1.0
333,-8.078907012939453,-19.798250198364258,2.0
334,-46.6270637512207,0.017653467133641243,3.0
335,37.296695709228516,0.5055580139160156,1.0
336,1.5200954675674438,-10.295732498168945,1.0
337,-14.08981990814209,14.74026870727539,3.0
338,12.720006942749023,0.06826142221689224,2.0
339,6.417660236358643,13.337223052978516,3.0
340,-31.300254821777344,0.4724539816379547,3.0
341,31.16303062438965,13.191947937011719,1.0
342,-5.004642009735107,18.801166534423828,0.0
343,14.290502548217773,-3.9391114711761475,3.0
344,0.05854210630059242,-14.723280906677246,0.0
345,-26.064773559570312,8.752043724060059,3.0
346,14.028109550476074,-9.548514366149902,3.0
347,17.596576690673828,26.284626007080078,3.0
348,8.169179916381836,28.013935089111328,3.0
349,25.1336727142334,-19.924806594848633,0.0
350,-34.29041290283203,-6.8037333488464355,2.0
351,12.120381355285645,-9.453947067260742,2.0
352,29.482145309448242,7.6581597328186035,1.0
353,32.915855407714844,13.196699142456055,0.0
354,-7.126150131225586,-25.77088737487793,2.0
355,14.609319686889648,21.372989654541016,1.0
356,-50.024169921875,-13.507028579711914,3.0
357,16.36001968383789,15.958740234375,3.0
358,-15.341739654541016,-11.559770584106445,0.0
359,38.631103515625,-14.042167663574219,0.0
360,-31.963359832763672,-8.703580856323242,1.0
361,-15.59333324432373,-5.748624801635742,2.0
362,27.81812286376953,6.713775157928467,2.0
363,-51.354530334472656,-0.5334848761558533,1.0
364,7.515692710876465,-3.852886915206909,3.0
365,-57.05127716064453,0.3221034109592438,2.0
366,-16.315786361694336,-0.21428127586841583,2.0
367,-18.46383285522461,-9.591217041015625,1.0
368,8.886456489562988,28.327070236206055,1.0
369,-49.66096496582031,5.59215784072876,2.0
370,8.484451293945312,8.434319496154785,1.0
371,-17.190771102905273,1.1900802850723267,3.0
372,-0.433098167181015,-17.428630828857422,0.0
373,14.4933500289917,29.162498474121094,0.0
374,25.650001525878906,-9.113764762878418,1.0
375,-51.261417388916016,-11.142945289611816,2.0
376,35.4837532043457,-6.625458717346191,0.0
377,-16.56949234008789,-4.4531755447387695,2.0
378,-35.402400970458984,-0.1735469400882721,1.0
379,12.988821029663086,20.550949096679688,1.0
380,35.90922546386719,11.254677772521973,1.0
381,-53.085243225097656,13.253800392150879,0.0
382,11.258626937866211,31.676706314086914,1.0
383,-9.768949508666992,4.582665920257568,1.0
384,-14.613821029663086,-20.096923828125,1.0
385,15.881429672241211,24.14967918395996,3.0
386,34.40911865234375,-12.607545852661133,3.0
387,-9.566011428833008,-3.8325085639953613,1.0
388,1.0026265382766724,-12.673013687133789,1.0
389,2.288534164428711,6.304399013519287,3.0
390,30.543760299682617,13.715559005737305,1.0
391,17.54160499572754,14.928529739379883,3.0
392,28.52622413635254,-7.698947429656982,1.0
393,-34.168670654296875,-8.29073715209961,2.0
394,-36.46385192871094,-4.139163970947266,2.0
395,18.76768684387207,32.48386001586914,2.0
396,5.142882823944092,30.726518630981445,0.0
397,27.201759338378906,-17.34226417541504,2.0
398,-39.43618392944336,-1.3966636657714844,2.0
399,32.54908752441406,-19.86975860595703,0.0
400,-33.969017028808594,-1.9423154592514038,0.0
401,25.364723205566406,-11.57575798034668,3.0
402,12.990636825561523,-14.171672821044922,2.0
403,38.72028732299805,-2.2526261806488037,2.0
404,-55.435821533203125,7.901332378387451,3.0
405,-38.27516555786133,-6.608849048614502,0.0
406,35.14849090576172,-11.043304443359375,2.0
407,43.50069808959961,-1.3416210412979126,0.0
408,0.9780623316764832,5.551042079925537,3.0
409,-10.28674602508545,-13.94540023803711,2.0
410,-47.609107971191406,-2.752228260040283,0.0
411,28.80891227722168,1.7180663347244263,1.0
412,28.745790481567383,-4.87999963760376,0.0
413,33.73792266845703,4.2124247550964355,3.0
414,19.688047409057617,19.363359451293945,2.0
415,-18.43602752685547,-17.424144744873047,3.0
416,-49.444095611572266,-11.071822166442871,0.0
417,28.48369789123535,-15.342287063598633,3.0
418,17.143476486206055,5.2136359214782715,1.0
419,-49.21013641357422,9.305601119995117,0.0
420,1.9951987266540527,25.310544967651367,3.0
421,-7.237790107727051,-1.4941571950912476,3.0
422,15.225401878356934,32.908409118652344,2.0
423,-37.50017166137695,10.429315567016602,1.0
424,1.41094172000885,0.22240589559078217,2.0
425,11.954764366149902,-8.562785148620605,2.0
426,46.12187194824219,3.6619324684143066,3.0
427,19.24802017211914,22.38636016845703,3.0
428,1.854217529296875,29.568113327026367,2.0
429,7.919249534606934,14.42370319366455,2.0
430,14.130218505859375,0.2721341550350189,2.0
431,9.006056785583496,-3.243201732635498,1.0
432,5.17904806137085,-11.403722763061523,2.0
433,-52.26870346069336,8.101323127746582,0.0
434,13.571937561035156,31.816850662231445,2.0
435,-12.898807525634766,6.952458381652832,1.0
436,16.15675163269043,12.126508712768555,0.0
437,14.674720764160156,-7.195873737335205,0.0
438,19.98143768310547,1.5140107870101929,0.0
439,4.635316371917725,-12.547810554504395,0.0
440,30.71011734008789,-1.6575415134429932,0.0
441,-38.837181091308594,0.18631276488304138,0.0
442,-7.9518842697143555,-25.421422958374023,2.0
443,-48.238494873046875,-0.27745115756988525,3.0
444,20.08734130859375,3.533609628677368,1.0
445,34.12417221069336,-7.5662126541137695,1.0
446,10.404255867004395,25.151105880737305,0.0
447,10.20114803314209,-1.8504599332809448,2.0
448,41.54624938964844,9.818709373474121,3.0
449,25.474699020385742,-18.433664321899414,3.0
450,-19.183185577392578,-18.4730224609375,1.0
451,39.59296417236328,-4.732426643371582,3.0
452,11.734293937683105,32.9213981628418,3.0
453,30.104101181030273,0.3957536518573761,1.0
454,45.34259033203125,5.7823805809021,2.0
455,-35.59270477294922,-10.96568489074707,2.0
456,-46.1409797668457,-12.279142379760742,0.0
457,-3.4106686115264893,19.835046768188477,3.0
458,-4.599276542663574,-12.664880752563477,1.0
459,17.557836532592773,31.56131362915039,2.0
460,-17.631935119628906,4.628473281860352,3.0
461,-22.046119689941406,-15.784688949584961,1.0
462,11.215250015258789,33.438472747802734,2.0
463,-33.34446334838867,-7.187788009643555,2.0
464,-41.57318115234375,2.2145707607269287,2.0
465,-1.8502390384674072,1.0979405641555786,3.0
466,-17.505496978759766,10.400291442871094,2.0
467,-39.36037063598633,-6.502601623535156,0.0
468,-17.99831771850586,8.873101234436035,3.0
469,17.563817977905273,12.244697570800781,2.0
470,2.339296579360962,30.180335998535156,3.0
471,3.480992078781128,27.59561538696289,0.0
472,-29.027151107788086,-3.069035291671753,0.0
473,-50.334537506103516,-10.674444198608398,3.0
474,37.82526779174805,-15.727559089660645,1.0
475,-41.39717483520508,-6.022312164306641,0.0
476,0.637519121170044,-1.207632303237915,3.0
477,1.791524887084961,-8.81648063659668,0.0
478,33.83894729614258,8.721597671508789,0.0
479,11.690505027770996,6.1018195152282715,3.0
480,23.263221740722656,21.544055938720703,1.0
481,0.10984892398118973,5.75795841217041,2.0
482,19.182403564453125,24.30762481689453,2.0
483,-18.21343231201172,-20.056753158569336,1.0
484,45.27595138549805,4.904696464538574,3.0
485,-12.606690406799316,-12.770520210266113,2.0
486,-32.722137451171875,10.148305892944336,3.0
487,-48.048492431640625,-7.4126296043396,0.0
488,-40.43889236450195,-4.694731712341309,0.0
489,-45.431602478027344,-2.588313341140747,1.0
490,42.168087005615234,3.984006404876709,3.0
491,19.816917419433594,-7.008136749267578,0.0
492,-14.125288009643555,15.609983444213867,2.0
493,-26.70278549194336,11.678665161132812,3.0
494,27.689319610595703,-5.787116050720215,1.0
495,-5.9315924644470215,-14.76325798034668,2.0
496,38.474666595458984,8.93653392791748,0.0
497,-41.522823333740234,-7.1775078773498535,1.0
498,2.4556140899658203,29.208566665649414,1.0
499,18.667343139648438,20.34479331970215,3.0
500,-35.537681579589844,-5.653160095214844,0.0
501,12.941129684448242,-3.5646474361419678,1.0
502,-44.158050537109375,3.558563232421875,1.0
503,15.82268238067627,1.983544945716858,2.0
504,13.352121353149414,-1.859620451927185,1.0
505,1.655603051185608,-11.03731632232666,1.0
506,-48.12617874145508,10.589405059814453,3.0
507,35.44301223754883,-17.24449348449707,1.0
508,-44.31892776489258,-1.2691400051116943,3.0
509,24.156827926635742,4.249989032745361,0.0
510,-31.330684661865234,-11.48288631439209,3.0
511,42.9382438659668,3.5117719173431396,0.0
512,-37.55244445800781,-13.477850914001465,0.0
513,37.859169006347656,-0.10796303302049637,3.0
514,-7.5177388191223145,-26.934146881103516,0.0
515,15.077442169189453,-3.325138568878174,1.0
516,2.8067471981048584,-17.793170928955078,1.0
517,-45.17512893676758,2.32289457321167,0.0
518,-35.977500915527344,-1.6265767812728882,3.0
519,40.23324203491211,-2.3584680557250977,0.0
520,-16.17131233215332,7.339598178863525,3.0
521,-50.923282623291016,12.601211547851562,0.0
522,-50.8342399597168,0.45038604736328125,0.0
523,17.79616355895996,3.1129279136657715,0.0
524,12.031651496887207,30.881975173950195,2.0
525,18.98678207397461,27.93993377685547,2.0
526,-50.68540573120117,11.725153923034668,1.0
527,-54.097618103027344,7.303545951843262,0.0
528,-46.06756591796875,-0.2763952612876892,3.0
529,-44.74824142456055,13.012947082519531,1.0
530,-51.32173538208008,-1.3845754861831665,1.0
531,12.845221519470215,-0.4912949204444885,1.0
532,-5.685590744018555,-11.005127906799316,0.0
533,-52.86174392700195,2.0547707080841064,0.0
534,-33.71088409423828,9.254584312438965,2.0
535,1.7797224521636963,-2.6123573780059814,1.0
536,-4.11079740524292,-16.712919235229492,0.0
537,-47.40742492675781,2.880314350128174,3.0
538,26.156585693359375,-14.2628755569458,1.0
539,-44.59844207763672,8.192219734191895,2.0
540,1.975711703300476,-14.742301940917969,0.0
541,4.362005233764648,31.86175537109375,3.0
542,-49.411224365234375,-14.567253112792969,0.0
543,1.3199774026870728,-7.751282691955566,2.0
544,-32.710052490234375,-1.0645437240600586,0.0
545,13.28265380859375,-9.109256744384766,2.0
546,-4.093096733093262,-12.1481351852417,1.0
547,32.926239013671875,11.737110137939453,2.0
548,1.0078153610229492,24.368192672729492,2.0
549,-15.906770706176758,-4.773396968841553,0.0
550,-12.748727798461914,7.617051124572754,2.0
551,22.122215270996094,11.06718921661377,3.0
552,-1.9766201972961426,7.180192947387695,1.0
553,13.873923301696777,6.594441890716553,1.0
554,-55.17392349243164,10.100796699523926,2.0
555,-15.661481857299805,1.5178812742233276,2.0
556,-15.923667907714844,-8.065383911132812,3.0
557,2.8039205074310303,6.685131549835205,3.0
558,10.7749605178833,10.126513481140137,3.0
559,-1.07288658618927,-10.477400779724121,2.0
560,10.491334915161133,13.651946067810059,2.0
561,-1.1555672883987427,1.0940712690353394,1.0
562,-46.7432746887207,4.8374433517456055,0.0
563,7.576059341430664,16.685728073120117,3.0
564,29.012765884399414,-7.453227996826172,0.0
565,-36.80827713012695,4.555635929107666,0.0
566,15.699613571166992,15.24405574798584,2.0
567,-26.2105770111084,11.691264152526855,3.0
568,3.540907621383667,21.427295684814453,2.0
569,35.30199432373047,0.07261049747467041,3.0
570,-30.550655364990234,4.337480068206787,3.0
571,21.23019790649414,4.769829273223877,0.0
572,22.422636032104492,1.937727451324463,0.0
573,-28.229488372802734,-3.074054002761841,1.0
574,-44.31184768676758,-2.582491397857666,3.0
575,0.19800911843776703,6.495420455932617,1.0
576,9.432581901550293,-7.802706718444824,1.0
577,15.362791061401367,5.431427955627441,0.0
578,16.64878273010254,27.156206130981445,3.0
579,2.3342466354370117,-11.680550575256348,2.0
580,27.66888427734375,12.155318260192871,3.0
581,20.394325256347656,11.224594116210938,3.0
582,29.056657791137695,4.916439533233643,1.0
583,17.26456069946289,32.70601272583008,2.0
584,17.080917358398438,8.274892807006836,2.0
585,33.504085540771484,7.953105449676514,1.0
586,-9.283576011657715,-25.80031967163086,0.0
587,1.8453513383865356,-0.6942224502563477,2.0
588,-18.746843338012695,-11.479406356811523,2.0
589,-11.147364616394043,-14.962706565856934,0.0
590,30.808353424072266,11.670174598693848,0.0
591,35.70634460449219,-15.156527519226074,1.0
592,28.055097579956055,-20.661052703857422,1.0
593,31.81196403503418,-9.966375350952148,0.0
594,20.031822204589844,30.697181701660156,2.0
595,7.0087103843688965,10.923491477966309,3.0
596,-7.051449775695801,-18.47971534729004,0.0
597,-0.10873089730739594,23.38776206970215,2.0
598,11.790420532226562,-15.43898868560791,2.0
599,33.03267288208008,-17.155895233154297,3.0
600,-48.594058990478516,-3.989328384399414,2.0
601,30.01616668701172,-0.2718983590602875,0.0
602,24.008329391479492,-13.285895347595215,3.0
603,21.4583797454834,-7.252620220184326,0.0
604,-26.263965606689453,7.97533655166626,3.0
605,12.37539291381836,28.851537704467773,1.0
606,20.260238647460938,24.77315902709961,0.0
607,39.5119514465332,-3.076611280441284,0.0
608,8.554275512695312,16.403722763061523,0.0
609,16.346904754638672,10.188486099243164,3.0
610,15.515166282653809,11.268704414367676,3.0
611,-38.70310592651367,-4.819618225097656,3.0
612,31.20085334777832,-9.358785629272461,2.0
613,-47.56646728515625,6.476742267608643,1.0
614,-5.5187296867370605,-8.374164581298828,0.0
615,-54.49974822998047,8.0855712890625,1.0
616,33.42843246459961,-12.100381851196289,3.0
617,22.385040283203125,6.488794803619385,1.0
618,9.114643096923828,23.208906173706055,1.0
619,3.8855197429656982,22.49794578552246,1.0
620,14.34018611907959,8.395774841308594,1.0
621,-5.333581447601318,17.668630599975586,2.0
622,11.655400276184082,-3.3639798164367676,0.0
623,8.861723899841309,17.391178131103516,2.0
624,-31.718555450439453,-12.425118446350098,1.0
625,7.58833646774292,12.894827842712402,1.0
626,40.53026580810547,-3.592172622680664,2.0
627,19.476173400878906,0.8489934802055359,2.0
628,-53.2897834777832,7.344061374664307,2.0
629,10.80875301361084,10.826979637145996,2.0
630,35.584590911865234,-9.875329971313477,1.0
631,-8.597372055053711,-24.649858474731445,1.0
632,-38.451683044433594,2.6578848361968994,0.0
633,-48.78264617919922,-12.307656288146973,1.0
634,-17.43541145324707,-0.8774343729019165,0.0
635,-18.585712432861328,8.568279266357422,3.0
636,26.49127960205078,-9.160700798034668,0.0
637,-4.104004859924316,-17.62803077697754,3.0
638,-7.49623966217041,-17.441667556762695,1.0
639,18.79008674621582,8.542861938476562,3.0
640,3.0209670066833496,24.775117874145508,3.0
641,35.12713623046875,7.450039386749268,0.0
642,-37.13608169555664,-8.064319610595703,0.0
643,31.18539810180664,-5.106738567352295,3.0
644,10.140951156616211,32.837154388427734,2.0
645,27.87468147277832,7.569091796875,0.0
646,-45.406227111816406,-14.121811866760254,0.0
647,6.06064510345459,8.962296485900879,0.0
648,-6.5246381759643555,-15.750130653381348,1.0
649,-41.071693420410156,-9.293102264404297,2.0
650,-15.21662712097168,-23.09583282470703,0.0
651,-4.065526485443115,-9.660531044006348,2.0
652,2.776005268096924,9.673934936523438,1.0
653,9.906413078308105,-13.665334701538086,0.0
654,22.53702735900879,-6.976425647735596,3.0
655,-57.444618225097656,9.419949531555176,0.0
656,30.674922943115234,14.412605285644531,3.0
657,-4.404452323913574,-26.052656173706055,2.0
658,-52.17794418334961,9.343151092529297,1.0
659,17.257953643798828,-10.375663757324219,0.0
660,13.133499145507812,6.728285312652588,2.0
661,-51.969547271728516,-9.11814022064209,1.0
662,21.706769943237305,-14.1486177444458,1.0
663,-15.295215606689453,-15.066788673400879,0.0
664,-10.804317474365234,15.384106636047363,0.0
665,10.30868911743164,-7.676069259643555,2.0
666,11.993894577026367,14.039239883422852,0.0
667,-17.332239151000977,-9.976507186889648,1.0
668,-0.8150402307510376,-27.9891357421875,0.0
669,18.108367919921875,-14.626965522766113,0.0
670,29.1026611328125,4.137815475463867,2.0
671,-31.19237518310547,1.2499364614486694,1.0
672,-4.705520153045654,19.08771514892578,3.0
673,12.099711418151855,-2.7614946365356445,3.0
674,-42.302711486816406,-8.820419311523438,2.0
675,-0.4659610688686371,-26.42698860168457,3.0
676,11.02575969696045,3.9404397010803223,1.0
677,15.78134536743164,-1.948334813117981,3.0
678,-48.29642868041992,-0.9231242537498474,0.0
679,39.81411361694336,-8.690635681152344,1.0
680,16.91768455505371,33.381317138671875,0.0
681,2.309572458267212,-14.353105545043945,1.0
682,-7.483304500579834,-4.0520172119140625,2.0
683,35.071075439453125,13.169746398925781,2.0
684,-13.581528663635254,13.517965316772461,1.0
685,-12.29621410369873,-4.889585018157959,0.0
686,-13.829134941101074,-16.006221771240234,0.0
687,-55.93829345703125,4.632139205932617,0.0
688,13.288493156433105,31.041244506835938,0.0
689,17.63555908203125,-6.062737941741943,3.0
690,36.342254638671875,5.811865329742432,1.0
691,-31.421640396118164,-2.982454538345337,0.0
692,12.152178764343262,26.214536666870117,3.0
693,-34.15654754638672,-13.122336387634277,2.0
694,-1.184224247932434,-27.2292423248291,2.0
695,-20.757780075073242,-14.318522453308105,1.0
696,-16.831701278686523,-5.65400505065918,3.0
697,34.36896896362305,3.7832376956939697,1.0
698,-12.11269760131836,-4.597243309020996,2.0
699,-9.868083000183105,3.7150087356567383,0.0
700,28.9705810546875,-21.345766067504883,0.0
701,-39.13051986694336,1.580340027809143,2.0
702,23.733238220214844,1.811793327331543,2.0
703,6.125571250915527,18.27215576171875,3.0
704,21.69328498840332,18.563682556152344,1.0
705,10.992483139038086,30.65904426574707,0.0
706,-16.78592300415039,14.596464157104492,2.0
707,-38.16127014160156,-4.3374786376953125,2.0
708,2.9256751537323,-11.457335472106934,3.0
709,0.19041836261749268,-13.185990333557129,2.0
710,-16.296628952026367,1.836283802986145,3.0
711,16.489057540893555,20.252817153930664,3.0
712,-45.62722396850586,10.497233390808105,3.0
713,7.548069477081299,20.97047233581543,0.0
714,14.045063018798828,-5.092600345611572,2.0
715,-17.771549224853516,5.7329487800598145,3.0
716,-17.95517921447754,10.909933090209961,1.0
717,-6.447039604187012,-1.450344443321228,3.0
718,41.76613998413086,4.893711090087891,1.0
719,-27.398723602294922,7.472564697265625,3.0
720,-33.78410339355469,-5.821959018707275,3.0
721,-4.689660549163818,-18.889633178710938,2.0
722,-19.97951889038086,-21.197725296020508,1.0
723,17.645971298217773,0.7091286182403564,0.0
724,-20.173084259033203,-19.64446449279785,0.0
725,-35.66933059692383,-4.113917350769043,1.0
726,34.40728759765625,13.641407012939453,3.0
727,31.91240119934082,1.5818417072296143,2.0
728,-45.63024139404297,2.277484655380249,3.0
729,8.273513793945312,-7.769397735595703,1.0
730,8.408101081848145,30.39581298828125,3.0
731,28.37439727783203,-13.871162414550781,1.0
732,4.461996555328369,27.889572143554688,2.0
733,-7.243250370025635,15.360228538513184,2.0
734,-47.68062210083008,8.761819839477539,0.0
735,-47.852455139160156,-12.419699668884277,0.0
736,-19.726818084716797,-10.876522064208984,2.0
737,7.988909721374512,-7.968709468841553,2.0
738,18.111370086669922,28.476608276367188,1.0
739,3.2020580768585205,-19.247642517089844,0.0
740,-17.6357421875,13.879570007324219,3.0
741,-5.426982879638672,-28.998689651489258,0.0
742,29.67363739013672,-13.281001091003418,1.0
743,22.662927627563477,3.6819007396698,3.0
744,32.22487258911133,13.621716499328613,0.0
745,-0.8196284770965576,5.543931007385254,3.0
746,-42.589378356933594,1.097883701324463,0.0
747,-10.196123123168945,-5.809967517852783,1.0
748,-10.072815895080566,-1.3348793983459473,2.0
749,41.23390197753906,-5.628575801849365,3.0
750,39.85642623901367,8.701927185058594,3.0
751,-38.58827590942383,6.767884731292725,2.0
752,-3.8032188415527344,5.312244892120361,3.0
753,-16.207948684692383,-23.329893112182617,1.0
754,-5.687043190002441,-17.589448928833008,0.0
755,32.95782470703125,9.898041725158691,1.0
756,0.8581210970878601,23.108501434326172,3.0
757,-19.41455078125,10.216991424560547,1.0
758,-41.90108871459961,-9.72605037689209,0.0
759,-14.446890830993652,-9.510251998901367,3.0
760,7.715620994567871,15.817221641540527,0.0
761,-34.913291931152344,-12.271366119384766,1.0
762,11.539752960205078,-10.192442893981934,1.0
763,36.86482238769531,-7.397724151611328,2.0
764,26.97542953491211,-12.480405807495117,0.0
765,20.151016235351562,30.601778030395508,3.0
766,-55.301055908203125,0.018225863575935364,1.0
767,26.38893699645996,-19.97252655029297,3.0
768,-0.09444611519575119,3.6784040927886963,3.0
769,-33.28558349609375,10.596288681030273,2.0
770,-42.13067626953125,2.0357489585876465,0.0
771,-35.08019256591797,-11.832964897155762,1.0
772,-3.133178472518921,-1.061727523803711,2.0
773,2.413469076156616,-7.5613203048706055,3.0
774,24.60004425048828,-8.546845436096191,1.0
775,29.29928207397461,-4.4007954597473145,0.0
776,-56.46377182006836,3.418590545654297,0.0
777,-19.109182357788086,0.7203381657600403,2.0
778,15.035727500915527,-0.7972399592399597,1.0
779,-6.5067596435546875,-3.4679248332977295,2.0
780,-50.39773941040039,1.4949302673339844,2.0
781,18.017648696899414,10.096231460571289,0.0
782,-0.6805106401443481,-18.086828231811523,0.0
783,-11.552048683166504,6.60703182220459,1.0
784,-37.15937805175781,10.377225875854492,3.0
785,-10.73936939239502,-25.750091552734375,2.0
786,2.2135748863220215,12.449884414672852,3.0
787,-32.24040222167969,-11.535147666931152,1.0
788,2.6257030963897705,-7.249335765838623,2.0
789,-42.59761428833008,8.06389045715332,2.0
790,-39.784912109375,5.835402965545654,2.0
791,-16.612171173095703,2.748305559158325,2.0
792,21.32535171508789,-9.519238471984863,2.0
793,-41.00517654418945,-6.238609313964844,2.0
794,-47.495513916015625,11.130515098571777,1.0
795,-17.81682777404785,-14.81503677368164,3.0
796,-48.89363479614258,5.222073078155518,1.0
797,22.38800048828125,21.46365737915039,0.0
798,-37.45521926879883,9.36694049835205,1.0
799,-43.5680046081543,12.61173152923584,0.0
800,30.68060302734375,-0.1532321572303772,0.0
801,15.038528442382812,2.472064733505249,1.0
802,-15.487459182739258,-19.729232788085938,2.0
803,37.38888168334961,-9.697677612304688,3.0
804,-17.83671760559082,-12.162269592285156,1.0
805,-36.899200439453125,-4.01267147064209,0.0
806,19.081390380859375,10.654096603393555,1.0
807,21.785053253173828,9.731475830078125,0.0
808,-15.247917175292969,-11.685946464538574,2.0
809,45.18121337890625,3.053145170211792,2.0
810,-17.654855728149414,-20.41290283203125,2.0
811,2.6947953701019287,2.7650833129882812,0.0
812,17.601167678833008,33.69874954223633,0.0
813,39.63545227050781,-11.386234283447266,0.0
814,-56.10768127441406,9.943601608276367,0.0
815,39.596492767333984,9.314693450927734,0.0
816,15.639510154724121,-1.2686055898666382,1.0
817,-46.14406204223633,8.528067588806152,0.0
818,8.42723560333252,6.278916835784912,1.0
819,3.3435873985290527,31.293210983276367,3.0
820,29.4447021484375,2.8628883361816406,1.0
821,-31.166549682617188,5.820850372314453,3.0
822,6.025947570800781,14.89599323272705,0.0
823,15.30990219116211,8.565850257873535,0.0
824,31.97432518005371,-15.866401672363281,3.0
825,5.571172714233398,26.850296020507812,1.0
826,24.019359588623047,-10.756607055664062,2.0
827,21.945302963256836,22.57990837097168,2.0
828,-12.41076374053955,-14.571074485778809,1.0
829,-37.88092041015625,-16.048465728759766,3.0
830,-8.664468765258789,14.337328910827637,1.0
831,2.7047224044799805,31.15387725830078,3.0
832,-0.8219276666641235,-19.15024185180664,2.0
833,-0.9688171148300171,-19.515872955322266,3.0
834,31.301246643066406,8.676891326904297,1.0
835,12.373311996459961,16.464771270751953,0.0
836,-57.08617401123047,6.5877604484558105,0.0
837,40.314720153808594,-0.7517726421356201,0.0
838,-7.374492168426514,16.734771728515625,3.0
839,-29.774085998535156,0.24728161096572876,2.0
840,42.52437973022461,-5.113178730010986,1.0
841,18.0826358795166,-1.0729527473449707,2.0
842,16.413837432861328,-15.972618103027344,2.0
843,31.72265625,4.6888556480407715,2.0
844,15.524831771850586,32.32559585571289,3.0
845,15.070655822753906,-11.722975730895996,0.0
846,25.17848777770996,9.811806678771973,1.0
847,32.82101058959961,-18.432191848754883,3.0
848,9.61556339263916,8.812292098999023,2.0
849,3.6394553184509277,-19.126972198486328,2.0
850,16.48593521118164,-17.00470733642578,0.0
851,-3.9090158939361572,4.954383850097656,2.0
852,-51.740028381347656,-12.102437973022461,1.0
853,3.7013065814971924,25.83224105834961,2.0
854,-35.73726272583008,-0.7114871740341187,0.0
855,22.947980880737305,19.498842239379883,2.0
856,28.82907485961914,0.33234354853630066,3.0
857,-30.059444427490234,1.2310974597930908,1.0
858,40.019954681396484,9.506021499633789,0.0
859,22.78464698791504,-9.03260612487793,1.0
860,-53.517845153808594,-3.014230489730835,1.0
861,35.41777801513672,-13.360029220581055,1.0
862,42.79782485961914,-2.0304644107818604,1.0
863,9.979602813720703,-6.505741596221924,0.0
864,-6.866397857666016,-20.490694046020508,2.0
865,33.74514389038086,-12.686450004577637,0.0
866,-52.503265380859375,10.721899032592773,0.0
867,14.249358177185059,4.055470943450928,3.0
868,-29.457443237304688,-3.338878870010376,1.0
869,2.6341283321380615,23.585620880126953,3.0
870,27.86236000061035,-21.750696182250977,2.0
871,42.380794525146484,-6.5505900382995605,2.0
872,-12.915741920471191,-15.272931098937988,0.0
873,1.2731373310089111,3.1501548290252686,2.0
874,-41.855873107910156,7.6703972816467285,2.0
875,-15.728580474853516,16.33094024658203,2.0
876,-50.966487884521484,4.838838577270508,3.0
877,15.502619743347168,23.41206932067871,2.0
878,-19.444868087768555,-12.82823657989502,0.0
879,25.20136260986328,-17.24043846130371,1.0
880,-52.60853958129883,12.2319974899292,0.0
881,-50.614070892333984,4.147436141967773,0.0
882,21.896278381347656,20.8266658782959,2.0
883,15.477983474731445,13.220088005065918,0.0
884,-5.008960247039795,-15.55205249786377,2.0
885,-4.929677963256836,-11.690657615661621,1.0
886,36.795589447021484,-11.476606369018555,2.0
887,-20.225650787353516,-13.693888664245605,2.0
888,-49.5659294128418,3.977356433868408,0.0
889,21.773197174072266,-6.3523383140563965,1.0
890,-50.70783615112305,7.895296573638916,1.0
891,-46.72062683105469,1.2919092178344727,3.0
892,-8.629345893859863,3.8814525604248047,0.0
893,-6.097166061401367,-26.002328872680664,2.0
894,-6.2981743812561035,17.97176742553711,1.0
895,-37.133995056152344,-13.81041145324707,3.0
896,36.5727653503418,-3.515981435775757,0.0
897,9.369587898254395,32.227561950683594,3.0
898,38.51304626464844,-14.187280654907227,1.0
899,-3.8609695434570312,-14.927016258239746,3.0
900,-48.03225326538086,6.263086795806885,2.0
901,35.50294876098633,2.7001800537109375,1.0
902,-10.97911262512207,6.307900905609131,3.0
903,-5.6107869148254395,-2.8077282905578613,1.0
904,29.131526947021484,-0.6136399507522583,0.0
905,-44.19527053833008,-1.7703197002410889,3.0
906,39.14662170410156,-9.607813835144043,1.0
907,38.58774948120117,-5.501410007476807,1.0
908,-17.89139747619629,-11.270598411560059,0.0
909,1.8494386672973633,-31.957447052001953,0.0
910,22.39305305480957,-12.802240371704102,1.0
911,26.349159240722656,7.999660491943359,2.0
912,-53.475868225097656,-2.285309076309204,1.0
913,10.956592559814453,-1.6260401010513306,3.0
914,14.331075668334961,-12.323476791381836,1.0
915,11.157266616821289,7.172577381134033,3.0
916,45.2089958190918,1.1844063997268677,2.0
917,-55.899776458740234,1.0354422330856323,0.0
918,-38.69981002807617,-14.476417541503906,1.0
919,6.249560832977295,-25.090524673461914,0.0
920,16.406036376953125,-0.23529821634292603,2.0
921,27.00047492980957,7.529842376708984,2.0
922,-10.470207214355469,4.450658798217773,2.0
923,-48.614688873291016,9.653039932250977,2.0
924,5.73133659362793,-13.602340698242188,1.0
925,42.97496032714844,5.638079643249512,2.0
926,-6.8603692054748535,-0.21881186962127686,3.0
927,10.638936996459961,-14.23519515991211,1.0
928,4.446933269500732,-12.781710624694824,3.0
929,-37.16562271118164,-2.398050308227539,1.0
930,11.574055671691895,10.76036548614502,1.0
931,19.958770751953125,-5.8549723625183105,2.0
932,12.35764217376709,4.247496604919434,0.0
933,-41.244956970214844,7.960821151733398,2.0
934,22.781753540039062,-14.29703426361084,0.0
935,-9.45197582244873,-26.569076538085938,0.0
936,-5.73374080657959,-24.941015243530273,3.0
937,17.72722053527832,15.845220565795898,1.0
938,-15.17365550994873,5.829132080078125,2.0
939,15.69694995880127,20.61895179748535,0.0
940,5.191347599029541,12.097880363464355,2.0
941,43.68174743652344,-3.5375568866729736,3.0
942,8.506580352783203,22.81243896484375,3.0
943,2.8938159942626953,26.7055606842041,3.0
944,-50.99515914916992,-7.758056163787842,0.0
945,40.031131744384766,-7.50756311416626,1.0
946,-22.773597717285156,-13.511627197265625,1.0
947,11.619136810302734,-14.288077354431152,0.0
948,25.796987533569336,-20.249038696289062,2.0
949,-42.23319625854492,6.720311641693115,0.0
950,-33.25739669799805,-2.890794515609741,2.0
951,24.35653305053711,2.967310905456543,0.0
952,-55.102264404296875,8.691739082336426,2.0
953,3.982382297515869,0.9842717051506042,1.0
954,30.493438720703125,-10.311379432678223,3.0
955,-34.35721969604492,-1.3441802263259888,2.0
956,17.30728530883789,10.984253883361816,2.0
957,36.40889358520508,-13.713190078735352,0.0
958,-2.7707786560058594,-26.206029891967773,0.0
959,14.274239540100098,22.462749481201172,3.0
960,12.123614311218262,16.31733512878418,3.0
961,-52.844696044921875,3.2390949726104736,2.0
962,22.049236297607422,-5.506267547607422,1.0
963,18.93463134765625,11.479713439941406,1.0
964,-4.214269161224365,-3.3906023502349854,3.0
965,-0.9954730868339539,1.8823987245559692,1.0
966,-47.06932830810547,-4.17466926574707,0.0
967,-10.413565635681152,-24.897586822509766,1.0
968,4.396815299987793,-18.19593620300293,2.0
969,-21.594951629638672,-15.3478364944458,1.0
970,-30.928503036499023,5.077936172485352,3.0
971,-38.616600036621094,11.365689277648926,1.0
972,-14.676179885864258,-22.79347038269043,2.0
973,-47.42466735839844,-13.770868301391602,1.0
974,-32.3177375793457,3.534327745437622,2.0
975,37.229103088378906,4.639965057373047,2.0
976,-17.84270668029785,2.0399465560913086,3.0
977,15.24588680267334,19.24126625061035,1.0
978,-48.091819763183594,1.3722612857818604,1.0
979,35.5611686706543,0.5679662227630615,2.0
