mean_fit_time,std_fit_time,mean_score_time,std_score_time,param_MLP__max_iter,params,split0_test_score,split1_test_score,split2_test_score,split3_test_score,split4_test_score,mean_test_score,std_test_score,rank_test_score,split0_train_score,split1_train_score,split2_train_score,split3_train_score,split4_train_score,mean_train_score,std_train_score
0.009370851516723632,0.0076512694555608725,0.003124237060546875,0.00624847412109375,1,{'MLP__max_iter': 1},0.4242778361344538,0.5648765756302521,0.5411502100840336,0.5678177521008401,0.5545540796963947,0.5303735469003883,0.05405998565801542,22,0.5283633284282214,0.5414169002112285,0.5725911376744709,0.5619451867871149,0.5672131701151684,0.5543059446432408,0.016723932411699338
0.006248188018798828,0.007652436232999867,0.006248188018798828,0.007652436232999867,2,{'MLP__max_iter': 2},0.5165835084033614,0.662998949579832,0.6030068277310925,0.6297268907563023,0.6309297912713472,0.6085191351306698,0.04992297816228252,21,0.6347131670984778,0.6518194747019712,0.6556156166554361,0.6511252669934455,0.6531099096563086,0.6492766870211278,0.007441165961338326
0.006248569488525391,0.007652903434605437,0.009372949600219727,0.007652981303768002,4,{'MLP__max_iter': 4},0.7321428571428572,0.7022715336134454,0.6797531512605043,0.7432773109243693,0.7499999999999998,0.7213302110785142,0.026500613699810105,20,0.7607251754228251,0.7640463655617585,0.765987653419967,0.7399888912399492,0.7651694794374584,0.7591835130163916,0.009763049560662661
0.021871328353881836,0.007654149460025378,0.003124380111694336,0.006248760223388671,8,{'MLP__max_iter': 8},0.8044117647058824,0.7457589285714287,0.7095850840336135,0.7711003151260502,0.8081119544592028,0.767609790235764,0.037028020082133746,19,0.8151853776257646,0.8388024174977033,0.8104000774449415,0.8195738684642836,0.8333522100386918,0.8234627902142769,0.010838621001678787
0.046867084503173825,1.2470909910795232e-06,0.0,0.0,16,{'MLP__max_iter': 16},0.8615546218487394,0.8015625000000001,0.8029017857142858,0.7793723739495795,0.8081119544592028,0.8107584790752052,0.027324698172627428,18,0.8459161638407824,0.8620908180115593,0.8644447552898737,0.8596064325010578,0.8871526859394837,0.8638421711165515,0.013312352648304942
0.09372706413269043,0.009878348204889302,0.0031250476837158202,0.006250095367431641,32,{'MLP__max_iter': 32},0.8630252100840337,0.8108061974789916,0.8550420168067228,0.7940782563025208,0.838235294117647,0.8322672254922678,0.02618393066654233,17,0.8961719331061925,0.9288043330363802,0.9122703116279356,0.9291023063901819,0.9142774016081253,0.9161252571537633,0.012211249631332594
0.1093480110168457,5.051774077663051e-06,0.0031241893768310545,0.006248378753662109,64,{'MLP__max_iter': 64},0.8688681722689076,0.8463103991596639,0.8550420168067228,0.8161370798319325,0.8007590132827322,0.8376175363075654,0.025143486552455227,1,0.9106321720117513,0.9323849104859335,0.9122703116279356,0.9310198899703764,0.950804062632247,0.9274222693456486,0.014803838216523738
0.10310297012329102,0.015929769696880047,0.0,0.0,128,{'MLP__max_iter': 128},0.8688681722689076,0.8463103991596639,0.8550420168067228,0.8161370798319325,0.8007590132827322,0.8376175363075654,0.025143486552455227,1,0.9106321720117513,0.9323849104859335,0.9122703116279356,0.9310198899703764,0.950804062632247,0.9274222693456486,0.014803838216523738
0.0968520164489746,0.011690283516499396,0.0,0.0,256,{'MLP__max_iter': 256},0.8688681722689076,0.8463103991596639,0.8550420168067228,0.8161370798319325,0.8007590132827322,0.8376175363075654,0.025143486552455227,1,0.9106321720117513,0.9323849104859335,0.9122703116279356,0.9310198899703764,0.950804062632247,0.9274222693456486,0.014803838216523738
0.10795331001281738,0.01697015857391046,0.00039920806884765627,0.0004889280581915709,512,{'MLP__max_iter': 512},0.8688681722689076,0.8463103991596639,0.8550420168067228,0.8161370798319325,0.8007590132827322,0.8376175363075654,0.025143486552455227,1,0.9106321720117513,0.9323849104859335,0.9122703116279356,0.9310198899703764,0.950804062632247,0.9274222693456486,0.014803838216523738
0.10682616233825684,0.015817915768921765,0.0009969711303710938,1.1680077279964343e-07,1024,{'MLP__max_iter': 1024},0.8688681722689076,0.8463103991596639,0.8550420168067228,0.8161370798319325,0.8007590132827322,0.8376175363075654,0.025143486552455227,1,0.9106321720117513,0.9323849104859335,0.9122703116279356,0.9310198899703764,0.950804062632247,0.9274222693456486,0.014803838216523738
0.09936642646789551,0.011901013976160725,0.0005986690521240234,0.0004888115132602699,2048,{'MLP__max_iter': 2048},0.8688681722689076,0.8463103991596639,0.8550420168067228,0.8161370798319325,0.8007590132827322,0.8376175363075654,0.025143486552455227,1,0.9106321720117513,0.9323849104859335,0.9122703116279356,0.9310198899703764,0.950804062632247,0.9274222693456486,0.014803838216523738
0.10003232955932617,0.010760846506324268,0.0,0.0,2100,{'MLP__max_iter': 2100},0.8688681722689076,0.8463103991596639,0.8550420168067228,0.8161370798319325,0.8007590132827322,0.8376175363075654,0.025143486552455227,1,0.9106321720117513,0.9323849104859335,0.9122703116279356,0.9310198899703764,0.950804062632247,0.9274222693456486,0.014803838216523738
0.12184710502624511,0.026876861940274582,0.0,0.0,2200,{'MLP__max_iter': 2200},0.8688681722689076,0.8463103991596639,0.8550420168067228,0.8161370798319325,0.8007590132827322,0.8376175363075654,0.025143486552455227,1,0.9106321720117513,0.9323849104859335,0.9122703116279356,0.9310198899703764,0.950804062632247,0.9274222693456486,0.014803838216523738
0.10622553825378418,0.020724031112498518,0.0,0.0,2300,{'MLP__max_iter': 2300},0.8688681722689076,0.8463103991596639,0.8550420168067228,0.8161370798319325,0.8007590132827322,0.8376175363075654,0.025143486552455227,1,0.9106321720117513,0.9323849104859335,0.9122703116279356,0.9310198899703764,0.950804062632247,0.9274222693456486,0.014803838216523738
0.10935053825378419,0.013972172869969665,0.0,0.0,2400,{'MLP__max_iter': 2400},0.8688681722689076,0.8463103991596639,0.8550420168067228,0.8161370798319325,0.8007590132827322,0.8376175363075654,0.025143486552455227,1,0.9106321720117513,0.9323849104859335,0.9122703116279356,0.9310198899703764,0.950804062632247,0.9274222693456486,0.014803838216523738
0.10934910774230958,0.026139185632670456,0.0,0.0,2500,{'MLP__max_iter': 2500},0.8688681722689076,0.8463103991596639,0.8550420168067228,0.8161370798319325,0.8007590132827322,0.8376175363075654,0.025143486552455227,1,0.9106321720117513,0.9323849104859335,0.9122703116279356,0.9310198899703764,0.950804062632247,0.9274222693456486,0.014803838216523738
0.09685325622558594,0.0229592359074177,0.0,0.0,2600,{'MLP__max_iter': 2600},0.8688681722689076,0.8463103991596639,0.8550420168067228,0.8161370798319325,0.8007590132827322,0.8376175363075654,0.025143486552455227,1,0.9106321720117513,0.9323849104859335,0.9122703116279356,0.9310198899703764,0.950804062632247,0.9274222693456486,0.014803838216523738
0.09685196876525878,0.006249117866493511,0.0,0.0,2700,{'MLP__max_iter': 2700},0.8688681722689076,0.8463103991596639,0.8550420168067228,0.8161370798319325,0.8007590132827322,0.8376175363075654,0.025143486552455227,1,0.9106321720117513,0.9323849104859335,0.9122703116279356,0.9310198899703764,0.950804062632247,0.9274222693456486,0.014803838216523738
0.09908094406127929,0.01456655762527533,0.0,0.0,2800,{'MLP__max_iter': 2800},0.8688681722689076,0.8463103991596639,0.8550420168067228,0.8161370798319325,0.8007590132827322,0.8376175363075654,0.025143486552455227,1,0.9106321720117513,0.9323849104859335,0.9122703116279356,0.9310198899703764,0.950804062632247,0.9274222693456486,0.014803838216523738
0.10650792121887206,0.004579009537182938,0.0007977008819580079,0.0003988506796967996,2900,{'MLP__max_iter': 2900},0.8688681722689076,0.8463103991596639,0.8550420168067228,0.8161370798319325,0.8007590132827322,0.8376175363075654,0.025143486552455227,1,0.9106321720117513,0.9323849104859335,0.9122703116279356,0.9310198899703764,0.950804062632247,0.9274222693456486,0.014803838216523738
0.07962183952331543,0.016052926693683578,0.0,0.0,3000,{'MLP__max_iter': 3000},0.8688681722689076,0.8463103991596639,0.8550420168067228,0.8161370798319325,0.8007590132827322,0.8376175363075654,0.025143486552455227,1,0.9106321720117513,0.9323849104859335,0.9122703116279356,0.9310198899703764,0.950804062632247,0.9274222693456486,0.014803838216523738
