mean_fit_time,std_fit_time,mean_score_time,std_score_time,param_Boost__n_estimators,params,split0_test_score,split1_test_score,split2_test_score,split3_test_score,split4_test_score,mean_test_score,std_test_score,rank_test_score,split0_train_score,split1_train_score,split2_train_score,split3_train_score,split4_train_score,mean_train_score,std_train_score
0.030620718002319337,0.005883064082139733,0.0015958786010742188,0.00048824712980535074,1,{'Boost__n_estimators': 1},0.85,0.859375,0.846875,0.825,0.859375,0.848125,0.012593401049756193,1,1.0,1.0,1.0,1.0,1.0,1.0,0.0
0.030621099472045898,0.006292714750536454,0.0013966560363769531,0.0004879354904906662,2,{'Boost__n_estimators': 2},0.85,0.859375,0.846875,0.825,0.859375,0.848125,0.012593401049756193,1,1.0,1.0,1.0,1.0,1.0,1.0,0.0
0.030823707580566406,0.004274356809364071,0.0025940895080566405,0.0013528527229415407,5,{'Boost__n_estimators': 5},0.85,0.859375,0.846875,0.825,0.859375,0.848125,0.012593401049756193,1,1.0,1.0,1.0,1.0,1.0,1.0,0.0
0.02453451156616211,0.003252537369561796,0.0013956546783447266,0.0004896297683345501,10,{'Boost__n_estimators': 10},0.85,0.859375,0.846875,0.825,0.859375,0.848125,0.012593401049756193,1,1.0,1.0,1.0,1.0,1.0,1.0,0.0
0.025331878662109376,0.0036015493658600474,0.0011971473693847656,0.0003993273457524769,20,{'Boost__n_estimators': 20},0.85,0.859375,0.846875,0.825,0.859375,0.848125,0.012593401049756193,1,1.0,1.0,1.0,1.0,1.0,1.0,0.0
0.022056150436401366,0.0013762144704418194,0.0015960216522216796,0.0007974749059830949,30,{'Boost__n_estimators': 30},0.85,0.859375,0.846875,0.825,0.859375,0.848125,0.012593401049756193,1,1.0,1.0,1.0,1.0,1.0,1.0,0.0
0.024140644073486327,0.0031844560725424404,0.0009924888610839844,5.355456602420497e-06,40,{'Boost__n_estimators': 40},0.85,0.859375,0.846875,0.825,0.859375,0.848125,0.012593401049756193,1,1.0,1.0,1.0,1.0,1.0,1.0,0.0
0.024134397506713867,0.0026314079733895197,0.001396942138671875,0.000488480917332435,50,{'Boost__n_estimators': 50},0.85,0.859375,0.846875,0.825,0.859375,0.848125,0.012593401049756193,1,1.0,1.0,1.0,1.0,1.0,1.0,0.0
0.024135351181030273,0.003302626333311987,0.0017948150634765625,0.000746036245992442,60,{'Boost__n_estimators': 60},0.85,0.859375,0.846875,0.825,0.859375,0.848125,0.012593401049756193,1,1.0,1.0,1.0,1.0,1.0,1.0,0.0
0.022738122940063478,0.0014647988952658576,0.0011968612670898438,0.00039935116269695,70,{'Boost__n_estimators': 70},0.85,0.859375,0.846875,0.825,0.859375,0.848125,0.012593401049756193,1,1.0,1.0,1.0,1.0,1.0,1.0,0.0
0.02712702751159668,0.006351723361655884,0.0015959739685058594,0.0004878383915497117,80,{'Boost__n_estimators': 80},0.85,0.859375,0.846875,0.825,0.859375,0.848125,0.012593401049756193,1,1.0,1.0,1.0,1.0,1.0,1.0,0.0
0.024933481216430665,0.004761915916650405,0.0011971473693847656,0.00039837447065382023,90,{'Boost__n_estimators': 90},0.85,0.859375,0.846875,0.825,0.859375,0.848125,0.012593401049756193,1,1.0,1.0,1.0,1.0,1.0,1.0,0.0
0.022739696502685546,0.007605171770166074,0.0009969711303710938,1.0070186654063642e-06,100,{'Boost__n_estimators': 100},0.85,0.859375,0.846875,0.825,0.859375,0.848125,0.012593401049756193,1,1.0,1.0,1.0,1.0,1.0,1.0,0.0
