iterations,fitness,time,fevals
0,0.0185861737518,4.26660008088e-05,11
10,0.0190081093392,0.000153678000061,21
20,0.0207333806163,0.000224393999815,31
30,0.0215554655399,0.000316838999424,41
40,0.0215943757733,0.000387950000004,51
50,0.022003413242,0.000446023999757,61
60,0.0231675999127,0.000542023999515,71
70,0.0239175502395,0.000631307999356,81
80,0.0239175502395,0.00073521000013,91
90,0.0239556340483,0.000780641999881,101
100,0.0244241347728,0.000824888000352,111
110,0.0247510837629,0.000893234000614,121
120,0.02651758299,0.000964345001194,131
130,0.0280023690523,0.00103545599995,141
140,0.0282581210583,0.00109629500002,151
150,0.0285964791555,0.00120059099936,161
160,0.0288496948088,0.0012491840007,171
170,0.0292754167825,0.0013313569998,181
180,0.0297354214572,0.00139219700031,191
190,0.0302134961764,0.00143881499935,201
200,0.0308948694618,0.00156720999985,211
210,0.031085651332,0.001633580001,221
220,0.031085651332,0.00170271500065,231
230,0.0318135219001,0.00176236900006,241
240,0.0320078128937,0.00182557900007,251
250,0.0320316674539,0.00190340599875,261
260,0.0323422807938,0.00202034399808,271
270,0.0324387656797,0.00210804699782,281
280,0.0324387656797,0.00219337999806,291
290,0.0325898457129,0.00226054099767,301
300,0.0331140788591,0.00232730699827,311
310,0.0340509677361,0.00241184999868,321
320,0.0341987788409,0.00253787499787,331
330,0.0349452292456,0.00262281399773,341
340,0.0349452292456,0.00267417199757,351
350,0.0350220285212,0.00277333299709,361
360,0.0350325980397,0.00283377699816,371
370,0.0350325980397,0.00288434499817,381
380,0.0351236534441,0.00292977699792,391
390,0.0354271797399,0.00299456799803,401
400,0.0355939901331,0.00305066699912,411
410,0.0355939901331,0.0031261239983,421
420,0.0355939901331,0.00321185299799,431
430,0.0362585423744,0.00329797599807,441
440,0.0363426917215,0.00335091499801,451
450,0.0363426917215,0.00342558199918,461
460,0.0363426917215,0.00347931099896,471
470,0.0364908769296,0.00352948399814,481
480,0.0364908769296,0.00363615099741,491
490,0.0369237983175,0.00369698999748,501
500,0.0369237983175,0.00376533599774,511
510,0.0370733282301,0.00383328599855,521
520,0.0370733282301,0.00391940999907,531
530,0.0370733282301,0.00399052099965,541
540,0.0370733282301,0.00406953399943,551
550,0.0374698303541,0.0041193119996,561
560,0.037782564879,0.00420741099879,571
570,0.0388349917699,0.00431881799886,581
580,0.0395075545422,0.0043697809997,591
590,0.0397165098349,0.00443733699831,601
600,0.0400446680963,0.0045400529998,611
610,0.0402428870791,0.00459852200038,621
620,0.0405060995722,0.00465422500201,631
630,0.0405060995722,0.00480790400252,641
640,0.0414682886513,0.00485965700318,651
650,0.0422988593357,0.00493866900251,661
660,0.0428633895794,0.00499792800292,671
670,0.0428633895794,0.00506982900333,681
680,0.0428633895794,0.00512118700317,691
690,0.0433127304466,0.00517412500267,701
700,0.0436011623308,0.00529777900192,711
710,0.0436011623308,0.00535901300282,721
720,0.0436011623308,0.00542933400357,731
730,0.0436833810265,0.00547871700473,741
740,0.0436833810265,0.00552849500491,751
750,0.0436833810265,0.00557827300509,761
760,0.0439153004437,0.00564266900437,771
770,0.0439153004437,0.00570824900387,781
780,0.0439321291674,0.00578844600386,791
790,0.0439321291674,0.00584098900254,801
800,0.0440833999445,0.00589037200189,811
810,0.0440833999445,0.00597649500196,821
820,0.0440833999445,0.00606301300104,831
830,0.0440833999445,0.00613965500088,841
840,0.0440833999445,0.00620128400078,851
850,0.0440833999445,0.00625817299988,861
860,0.0440833999445,0.0063111110012,871
870,0.0440833999445,0.00639170300019,881
880,0.044089222207,0.00644108600136,891
890,0.0442360404062,0.00649441900168,901
900,0.0442360404062,0.00657145600235,911
910,0.0442360404062,0.00665995000236,921
920,0.0442360404062,0.00675832000343,931
930,0.0442360404062,0.00682627000242,941
940,0.0442360404062,0.00689540600251,951
950,0.0442360404062,0.00697757900161,961
960,0.0442360404062,0.00704513500204,971
970,0.0443839336996,0.00710795000123,981
980,0.0444605063905,0.00718103600047,991
990,0.0444605063905,0.00725965399943,1001
1000,0.0446065499839,0.00736553100069,1011
1010,0.0446065499839,0.00742755600186,1021
1020,0.0446065499839,0.00747772900286,1031
1030,0.0446065499839,0.00752829700286,1041
1040,0.0446065499839,0.00757886500287,1051
1050,0.0446065499839,0.00762943300288,1061
1060,0.0446065499839,0.00774163100323,1071
1070,0.0446065499839,0.00780523600224,1081
1080,0.0446065499839,0.00786489000166,1091
1090,0.0446119929292,0.00795259300139,1101
1100,0.0446515084693,0.00804345700271,1111
1110,0.0446515084693,0.00811851900289,1121
1120,0.0446515084693,0.00822084000356,1131
1130,0.0446515084693,0.00827377800306,1141
1140,0.0446515084693,0.0083251360029,1151
1150,0.0446515084693,0.00837609900191,1161
1160,0.0446515084693,0.00842587600164,1171
1170,0.0446515084693,0.00848118500289,1181
1180,0.0446515084693,0.0085570370029,1191
1190,0.0446515084693,0.00862261800285,1201
1200,0.0446515084693,0.00868503800302,1211
1210,0.0446515084693,0.00873995200345,1221
1220,0.0447769835073,0.0087889400038,1231
1230,0.0447769835073,0.0088383220027,1241
1240,0.0449039079535,0.00888731000305,1251
1250,0.0449039079535,0.00893708800322,1261
1260,0.0450695486122,0.00900108800306,1271
1270,0.0450695486122,0.00906627300355,1281
1280,0.045823866865,0.00911881600223,1291
1290,0.045823866865,0.00917017400207,1301
1300,0.045823866865,0.00922074200207,1311
1310,0.045823866865,0.00932701400234,1321
1320,0.045823866865,0.00940207600252,1331
1330,0.045823866865,0.00952494000194,1341
1340,0.045823866865,0.00961975500286,1351
1350,0.045823866865,0.00972089100287,1361
1360,0.0458877562562,0.00979121200362,1371
1370,0.0459445038177,0.00988247100395,1381
1380,0.0459445038177,0.00997452000411,1391
1390,0.0459445038177,0.0100480020046,1401
1400,0.0459445038177,0.0101384720037,1411
1410,0.0459445038177,0.0102467190045,1421
1420,0.0459445038177,0.0103375840044,1431
1430,0.0461016745703,0.010411461004,1441
1440,0.0461016745703,0.0104817820029,1451
1450,0.0461016745703,0.0105615850025,1461
1460,0.0461016745703,0.0106157080027,1471
1470,0.0461016745703,0.0106666710035,1481
1480,0.0461016745703,0.0107172390035,1491
1490,0.0461016745703,0.0107670170037,1501
1500,0.0463571672607,0.0108160040036,1511
1510,0.0463586581573,0.0109056830024,1521
1520,0.0463586581573,0.0109795590033,1531
1530,0.0463644912948,0.0110779290026,1541
1540,0.0463644912948,0.0111514110013,1551
1550,0.0463644912948,0.0112430650006,1561
1560,0.0463644912948,0.0113339290001,1571
1570,0.0470177581948,0.0113951639996,1581
1580,0.0470177581948,0.0114876090011,1591
1590,0.0470177581948,0.0115859800007,1601
1600,0.0470177581948,0.011646029001,1611
1610,0.0470177581948,0.0117139800022,1621
1620,0.0470177581948,0.011801288003,1631
1630,0.0470177581948,0.0118652880028,1641
1640,0.0470177581948,0.0119980290037,1651
1650,0.0474768117656,0.0120754610034,1661
1660,0.0474768117656,0.0121544730046,1671
1670,0.0477656152085,0.0122307200036,1681
1680,0.0477656152085,0.0123176340039,1691
1690,0.0477656152085,0.0123962510042,1701
1700,0.0477656152085,0.0124954120038,1711
1710,0.0477656152085,0.0126020780026,1721
1720,0.0478716593812,0.0126755600031,1731
1730,0.0478716593812,0.0127494360022,1741
1740,0.0478716593812,0.0128221270006,1751
1750,0.0478735522591,0.0128948190013,1761
1760,0.0481315478604,0.0129635600024,1771
1770,0.0481663506383,0.0130275600022,1781
1780,0.0482764149321,0.013085634002,1791
1790,0.0484012160936,0.0131504240017,1801
1800,0.0484012160936,0.013241683002,1811
1810,0.0484012160936,0.0132926460028,1821
1820,0.0484012160936,0.0133850910042,1831
1830,0.0484012160936,0.0134759550037,1841
1840,0.0484012160936,0.0136213380047,1851
1850,0.0484446846893,0.0136833620036,1861
1860,0.0484917128764,0.0137374850037,1871
1870,0.0486928413032,0.0137927940032,1881
1880,0.0486928413032,0.0138978800042,1891
1890,0.0487309030202,0.0139938800039,1901
1900,0.0487309030202,0.0140902750027,1911
1910,0.0490693190416,0.0141625720025,1921
1920,0.0492461522762,0.014243165002,1931
1930,0.0492765264178,0.014298078002,1941
1940,0.0492765264178,0.0143569420015,1951
1950,0.0492765264178,0.0144229180023,1961
1960,0.0492765264178,0.0144805980017,1971
1970,0.0492765264178,0.0145453880014,1981
1980,0.0492765264178,0.0146168940028,1991
1990,0.0492765264178,0.0146694380019,2001
2000,0.0493301291656,0.0147579320019,2011
