k,Pen Digits Data log-likelihood
2,-5.778864887643833
3,-5.496582553250106
4,-5.207844695399482
5,-5.062672199159885
6,-4.99120730298099
7,-4.890283774697951
8,-4.850060415195276
9,-4.771089612061454
10,-4.734479877390359
15,-4.62143411049686
20,-4.56067840896802
25,-4.506543391421132
30,-4.485160533278874
35,-4.463191930456214
40,-4.442400927414432
