,train,test
0.1,0.0023368728286385482,0.11759821052556725
0.2,0.00442035266426104,0.11157169236020525
0.3,0.005531900099792741,0.11809733230195722
0.4,0.008183321573643987,0.11484936667554244
0.5,0.013103902188882532,0.11546716518268071
0.6,0.016574761994685706,0.11478734188616987
0.7,0.024483041158386065,0.11142496620241556
0.8,0.02117218160542258,0.11171826049305356
0.9,0.02949614537662466,0.11114218057035945
