iterations,fitness,time,fevals
0,0.0246350082923,2.846201162,1000
10,0.0237869224133,5.717363134,2100
20,0.024592013013,8.589508021,3200
30,0.0234732971942,11.686889628,4300
40,0.0233654917465,14.542985909,5400
50,0.023441174757,17.391802382,6500
60,0.0231574023543,20.257502227,7600
70,0.0231802640354,23.11357678,8700
80,0.0234020202288,26.022853548,9800
90,0.0242948017977,28.873931356,10900
100,0.0243805864546,31.717597406,12000
110,0.0236672378363,34.580017445,13100
120,0.0240960862973,37.439469778,14200
130,0.0245579681156,40.333623176,15300
140,0.0242074509915,43.247233775,16400
150,0.02340054712,46.098972127,17500
160,0.02427665413,48.970288964,18600
170,0.0236613824929,51.879059657,19700
180,0.0228272475119,54.72265183,20800
190,0.024162702856,57.584126091,21900
200,0.0254792755407,60.449814084,23000
210,0.0239621030665,63.34000896,24100
220,0.0241819979526,66.178968635,25200
230,0.0244912160742,69.062187901,26300
240,0.0234741275892,72.081033545,27400
250,0.0227947665261,74.937985531,28500
260,0.0233664909942,77.799359446,29600
270,0.0236102392729,80.64750787,30700
280,0.0237488634043,83.480242948,31800
290,0.0234788384636,86.353232082,32900
300,0.0236498671017,89.205606088,34000
310,0.0235281165974,92.080487964,35100
320,0.0233363916897,94.921376727,36200
330,0.0240542098103,97.766458678,37300
340,0.0231061418206,100.600208275,38400
350,0.0245044748037,103.465411527,39500
360,0.0245081388153,106.322523908,40600
370,0.0239730751353,109.164760228,41700
380,0.0237948609424,112.050016829,42800
390,0.0236110828832,114.877700643,43900
400,0.0242836991366,117.711643425,45000
410,0.0244842885762,120.583997299,46100
420,0.0246381977141,123.465090735,47200
430,0.0233101872544,126.323989981,48300
440,0.025162197154,129.276693944,49400
450,0.0235188153097,132.21432629,50500
460,0.0232385552805,135.059118266,51600
470,0.0249838750121,137.979861315,52700
480,0.0239372630049,140.8363973,53800
490,0.024841596401,143.7302145,54900
500,0.0233672463664,146.613741519,56000
510,0.0233253030445,149.479205907,57100
520,0.0239567616889,152.35575297,58200
530,0.0240768514569,155.188309479,59300
540,0.0244352235257,158.054903349,60400
550,0.0238249911127,160.917308376,61500
560,0.024332948444,163.811299799,62600
570,0.0246113385156,166.651574636,63700
580,0.0238452816316,169.507371855,64800
590,0.0232497782673,172.383619066,65900
600,0.023877103602,175.237258456,67000
610,0.0243434047511,178.079274331,68100
620,0.0243521234839,180.994879202,69200
630,0.0239820000795,183.858450847,70300
640,0.0237643690303,186.720998887,71400
650,0.0253039897506,189.75492247,72500
660,0.02388237868,192.612151394,73600
670,0.0238604959986,195.467792564,74700
680,0.023347967284,198.333929348,75800
690,0.0247751842781,201.196649634,76900
700,0.0234756158344,204.051707297,78000
710,0.0233360830416,206.912684174,79100
720,0.0233548357446,209.78839015,80200
730,0.0243236933193,212.647080409,81300
740,0.0234331800374,215.50069017,82400
750,0.0235212026799,218.350651138,83500
760,0.0236775069653,221.227087979,84600
770,0.0244540781422,224.094974097,85700
780,0.024117148635,226.919670452,86800
790,0.0236242269002,229.752909629,87900
800,0.024521071532,232.627065381,89000
810,0.0231311484769,235.501549034,90100
820,0.0235264948202,238.351555829,91200
830,0.0247521927683,241.267807417,92300
840,0.0238237957346,244.132100446,93400
850,0.02362201939,246.992353176,94500
860,0.0243251314234,250.041362597,95600
870,0.02300862063,252.892646628,96700
880,0.0232058867192,255.872641871,97800
890,0.0226672898317,258.763643464,98900
900,0.0245147824359,261.591835723,100000
910,0.0238782319061,264.4512205,101100
920,0.0228241962167,267.32835265,102200
930,0.0231123251447,270.193759359,103300
940,0.0235869310997,273.025910535,104400
950,0.0240764166022,275.89069423,105500
960,0.0247258642814,278.724409456,106600
970,0.023613938841,281.574593634,107700
980,0.0234162569541,284.470725898,108800
990,0.0235276275939,287.334551963,109900
1000,0.023817502144,290.192827801,111000
1010,0.0236427357821,293.023657099,112100
1020,0.0241065331038,295.893748058,113200
1030,0.0238522296813,298.728933311,114300
1040,0.0238002372551,301.578725982,115400
1050,0.0241622617168,304.43167757,116500
1060,0.0244482190359,307.302399838,117600
1070,0.0228521105681,310.438254167,118700
1080,0.0241362713939,313.307756088,119800
1090,0.0243389680094,316.160552021,120900
1100,0.0236976040739,319.044500176,122000
1110,0.0241447216482,321.900094333,123100
1120,0.0244288185536,324.748117126,124200
1130,0.0239657447181,327.638571163,125300
1140,0.024719871286,330.505311996,126400
1150,0.0239603243388,333.379981724,127500
1160,0.0238087195669,336.249460732,128600
1170,0.0231261371783,339.125473671,129700
1180,0.0227342576636,341.996419544,130800
1190,0.0246356468625,344.892334128,131900
1200,0.0245426141601,347.760313481,133000
1210,0.0241542837354,350.623691941,134100
1220,0.0250083916076,353.533215227,135200
1230,0.0230483839816,356.404360607,136300
1240,0.0231622605449,359.227985554,137400
1250,0.0241354718279,362.13967141,138500
1260,0.0232151186891,364.980358691,139600
1270,0.0232939881871,367.960370922,140700
1280,0.024380498313,370.863679883,141800
1290,0.0239570993158,373.713534579,142900
1300,0.0240596795334,376.580357585,144000
1310,0.0245477177678,379.46316322,145100
1320,0.0239569190007,382.32743531,146200
1330,0.0249941252892,385.154609494,147300
1340,0.0245327035766,388.040160811,148400
1350,0.0236501006813,390.906194483,149500
1360,0.0251813426566,393.742985268,150600
1370,0.0241117316193,396.652808802,151700
1380,0.0237670275083,399.512351604,152800
1390,0.0251393050069,402.346712362,153900
1400,0.0239507475479,405.256888686,155000
1410,0.0241044813972,408.11685381,156100
1420,0.0252591124329,410.988632869,157200
1430,0.0239186472472,413.86745865,158300
1440,0.0237544643296,416.746674357,159400
1450,0.0239078444131,419.607659136,160500
1460,0.0243949716064,422.479435035,161600
1470,0.0236919831357,425.345980707,162700
1480,0.0245019536295,428.365258549,163800
1490,0.0237097070025,431.21829547,164900
1500,0.0242335950781,434.058009713,166000
1510,0.0229855100439,436.918943134,167100
1520,0.0233240449472,439.78678303,168200
1530,0.0234826935533,442.657049397,169300
1540,0.0236378838469,445.527375813,170400
1550,0.0249524397694,448.436699593,171500
1560,0.0241790334922,451.312977224,172600
1570,0.0243632630498,454.171492075,173700
1580,0.0237960291006,457.051881116,174800
1590,0.0237647089697,459.892050076,175900
1600,0.0237208327982,462.743438799,177000
1610,0.0237072303798,465.706068696,178100
1620,0.0239777484342,468.590778531,179200
1630,0.0256696305284,471.428502847,180300
1640,0.023937473661,474.317499895,181400
1650,0.0236714667563,477.174013362,182500
1660,0.024190814666,480.042903333,183600
1670,0.0233956883535,482.920455038,184700
1680,0.0233642384184,485.75410508,185800
1690,0.0239818872957,488.785428364,186900
1700,0.0238617787716,491.709952947,188000
1710,0.0234554351106,494.562026312,189100
1720,0.0229498323167,497.400123567,190200
1730,0.0242191199489,500.276772161,191300
1740,0.0250830830921,503.113785366,192400
1750,0.0235852846619,505.943769627,193500
1760,0.0234088054884,508.827646671,194600
1770,0.0239517537711,511.679644184,195700
1780,0.0241034540141,514.526321396,196800
1790,0.0248913469395,517.422730993,197900
1800,0.0246895212229,520.30306196,199000
1810,0.0260877150142,523.15927597,200100
1820,0.0234136567389,526.047277067,201200
1830,0.0237839878247,528.896232602,202300
1840,0.023856328917,531.761093729,203400
1850,0.0231655258996,534.650094333,204500
1860,0.0248669889026,537.52262085,205600
1870,0.0241509759134,540.372259448,206700
1880,0.0239182934487,543.267200599,207800
1890,0.0243669922392,546.065184439,208900
1900,0.0232135746097,549.06060883,210000
1910,0.0237907615516,551.927205466,211100
1920,0.0241486579468,554.777294039,212200
1930,0.0240097637997,557.624947845,213300
1940,0.024493638806,560.517414724,214400
1950,0.0236697161833,563.349741307,215500
1960,0.0251350484542,566.220938834,216600
1970,0.0235693655905,569.064440143,217700
1980,0.0236014192187,571.907623031,218800
1990,0.0247361450193,574.750911796,219900
2000,0.0230597035982,577.669975435,221000
