steps,time,reward,delta,converged
1,0.22590306351222367,-53.26125889813558,1.1513883385701669,False
2,0.06911579084600916,2.240508732281305,1.0,False
3,0.06964122398266426,2.728841325659605,1.0,False
4,0.06981307617397547,2.728841325659605,1.0,False
5,0.06948556935421024,2.728841325659605,1.0,False
6,0.06802541832181319,2.728841325659605,1.0,False
7,0.06724912049208953,2.728841325659605,1.0,False
8,0.06925998866170602,2.728841325659605,1.0,False
9,0.07022275599556593,2.728841325659605,1.0,False
10,0.06854255514578611,2.728841325659605,1.0,False
11,0.06887756815321922,2.728841325659605,1.0,False
12,0.07256034085993335,2.728841325659605,1.0,True
