param_SVM__max_iter,train acc,test acc
1,0.25,0.25
2,0.33843622029163,0.3468614718614718
4,0.3846281908990011,0.43363095238095234
8,0.5121490170563997,0.48828463203463207
16,0.657252516803578,0.655762987012987
32,0.7175784887800273,0.7321158008658009
64,0.75419886112707,0.7497294372294373
128,0.8028045820680275,0.7767857142857144
256,0.8703156327310673,0.7905844155844154
512,0.867374456260479,0.8027597402597404
1024,0.867374456260479,0.8027597402597404
2048,0.867374456260479,0.8027597402597404
