,0,1,2,3,4
64,0.27941176470588236,0.43750000000000006,0.43750000000000006,0.43750000000000006,0.43750000000000006
67,0.24999999999999994,0.42738095238095236,0.42738095238095236,0.42738095238095236,0.42738095238095236
70,0.26470588235294124,0.40489130434782616,0.40489130434782616,0.40489130434782616,0.40489130434782616
73,0.29166666666666663,0.43271221532091103,0.43271221532091103,0.43271221532091103,0.43271221532091103
76,0.2919407894736841,0.4673913043478263,0.4673913043478263,0.4673913043478263,0.4673913043478263
80,0.30572755417956654,0.47916666666666663,0.47916666666666663,0.47916666666666663,0.47916666666666663
83,0.3370370370370371,0.48076923076923067,0.48076923076923067,0.48076923076923067,0.48076923076923067
86,0.3728174603174603,0.4707692307692306,0.4707692307692306,0.4707692307692306,0.4707692307692306
89,0.36023138654717596,0.5041186671621454,0.5041186671621454,0.5041186671621454,0.5041186671621454
92,0.4522583289030657,0.48342247527030147,0.48342247527030147,0.48342247527030147,0.48342247527030147
96,0.40499437781109443,0.4670443349753694,0.4670443349753694,0.4670443349753694,0.4670443349753694
99,0.46077639751552796,0.4982095490716181,0.4982095490716181,0.4982095490716181,0.4982095490716181
102,0.4784798534798537,0.5168320926385442,0.5168320926385442,0.5168320926385442,0.5168320926385442
105,0.4303170787545787,0.5269851116625309,0.5269851116625309,0.5269851116625309,0.5269851116625309
108,0.41754079254079257,0.5079217657342658,0.5079217657342658,0.5079217657342658,0.5079217657342658
112,0.3723262032085562,0.5163855820105819,0.5163855820105819,0.5163855820105819,0.5163855820105819
115,0.36065830721003134,0.5172558922558923,0.5172558922558923,0.5172558922558923,0.5172558922558923
118,0.37546583850931686,0.49980158730158725,0.49980158730158725,0.49980158730158725,0.49980158730158725
121,0.3753572646980781,0.5119588744588744,0.5119588744588744,0.5119588744588744,0.5119588744588744
124,0.38525942090499754,0.4862470228849539,0.4862470228849539,0.4862470228849539,0.4862470228849539
128,0.39257246376811594,0.5064841156946421,0.5064841156946421,0.5064841156946421,0.5064841156946421
188,0.49679962894248597,0.6179788333432463,0.6179788333432463,0.6179788333432463,0.6179788333432463
249,0.6103561879297172,0.6533828318858561,0.6533828318858561,0.6533828318858561,0.6533828318858561
309,0.6608216958744068,0.6700919694340747,0.6700919694340747,0.6700919694340747,0.6700919694340747
370,0.6302465019271438,0.684175327578018,0.6733374906860495,0.6733374906860495,0.6733374906860495
431,0.6694878809671901,0.6764076690883857,0.698648297106458,0.698648297106458,0.698648297106458
491,0.6859781639928698,0.6793003565062389,0.6715878087887658,0.6715878087887658,0.6715878087887658
552,0.7003907609230725,0.6853032054720124,0.6959648578954536,0.6959648578954536,0.6959648578954536
613,0.7070025898542199,0.7143180841671416,0.6946797143248055,0.6962737645522421,0.6962737645522421
673,0.6938755137966591,0.7153734563382584,0.7184145480225991,0.6900173546227221,0.6900173546227221
734,0.6993516756086882,0.716354437988379,0.70270146448793,0.7087654687654688,0.7087654687654688
794,0.6924104989217568,0.7246744400267028,0.6932350398842687,0.7112169312169312,0.7112169312169312
855,0.6924005677519323,0.7133239450198919,0.7017347400455344,0.7036581733731988,0.7036581733731988
916,0.7113012807846687,0.72974916754197,0.7050229734772415,0.7347648125976518,0.7347648125976518
976,0.703459502323413,0.7407455501301997,0.7139549123761754,0.7178111230346488,0.7308941938051357
1037,0.709931219181962,0.7390137839700558,0.7129253170373724,0.727097215622843,0.7278574701691399
1098,0.7256356317278987,0.7371225282028253,0.717107407012013,0.7247048839882078,0.7170839189690122
1158,0.7210383468455875,0.7423801369863013,0.7165350386730035,0.7434413148821173,0.7113000789245587
1219,0.7210492969145684,0.739119617583791,0.7277322851066135,0.7367462777249496,0.7131518140597112
1280,0.72578125,0.74296875,0.72421875,0.7375,0.72890625
