iterations,fitness,time,fevals
0,526.0,0.013758431,580
10,542.0,0.028786196,1052
20,537.0,0.042009713,1548
30,544.0,0.056454366,2029
40,524.0,0.070289043,2510
50,528.0,0.084148609,2992
60,527.0,0.096543681,3475
70,535.0,0.109449567,3968
80,533.0,0.121829626,4457
90,542.0,0.134323858,4939
100,534.0,0.147280313,5407
110,537.0,0.160874398,5888
120,537.0,0.174135051,6376
130,541.0,0.186869875,6855
140,543.0,0.200738133,7325
150,546.0,0.215516614,7800
160,551.0,0.229141118,8279
170,552.0,0.246184885,8747
180,551.0,0.260216699,9235
190,550.0,0.273089005,9716
200,547.0,0.28535015,10211
210,548.0,0.297857814,10683
220,548.0,0.309879947,11162
230,550.0,0.323701587,11645
240,552.0,0.337114338,12131
250,546.0,0.349837706,12633
260,552.0,0.362110704,13114
270,556.0,0.376124739,13603
280,558.0,0.419189662,14078
290,554.0,0.43255303,14566
300,560.0,0.445405189,15057
310,558.0,0.45811157,15538
320,560.0,0.470599877,16021
330,556.0,0.48351406,16501
340,560.0,0.49618765,16989
350,562.0,0.508190425,17477
360,566.0,0.52133967,17952
370,566.0,0.533459778,18434
380,566.0,0.546136923,18921
390,568.0,0.559097328,19407
400,566.0,0.573456648,19894
410,566.0,0.585740707,20381
420,570.0,0.598598396,20851
430,568.0,0.610500431,21337
440,568.0,0.622813725,21812
450,562.0,0.635500748,22295
460,568.0,0.647937696,22782
470,566.0,0.660182644,23250
480,564.0,0.673792532,23729
490,570.0,0.685665726,24194
500,566.0,0.698765588,24658
510,564.0,0.711893104,25144
520,566.0,0.725350103,25620
530,566.0,0.737310212,26102
540,568.0,0.750082568,26586
550,568.0,0.762873491,27071
560,570.0,0.778749454,27548
570,572.0,0.792210008,28033
580,568.0,0.806379303,28503
590,567.0,0.818745535,28985
600,570.0,0.831227916,29468
610,568.0,0.843810246,29945
620,567.0,0.855985268,30431
630,565.0,0.868046907,30925
640,561.0,0.88026262,31400
650,559.0,0.89433315,31887
660,560.0,0.906292863,32373
670,561.0,0.918050304,32843
680,565.0,0.930712437,33337
690,558.0,0.944740695,33815
700,559.0,0.957173297,34284
710,561.0,0.970087085,34759
720,563.0,0.98231228,35235
730,563.0,0.994849178,35717
740,561.0,1.007342225,36197
750,563.0,1.019808013,36681
760,566.0,1.032142245,37160
770,569.0,1.04408339,37644
780,567.0,1.056132783,38125
790,561.0,1.068059311,38592
800,561.0,1.080895272,39068
810,560.0,1.09326269,39541
820,562.0,1.105557021,40014
830,564.0,1.145226386,40490
840,562.0,1.15817731,40964
850,568.0,1.171634703,41445
860,564.0,1.184902861,41940
870,562.0,1.198087266,42418
880,561.0,1.210590189,42904
890,558.0,1.224047187,43373
900,562.0,1.236014407,43845
910,560.0,1.248441084,44337
920,556.0,1.260287809,44816
930,558.0,1.274153301,45308
940,558.0,1.287148472,45792
950,556.0,1.30178394,46274
960,558.0,1.314049827,46765
970,556.0,1.327027615,47261
980,558.0,1.339931922,47752
990,558.0,1.353829019,48245
1000,562.0,1.365768189,48739
1010,560.0,1.378179853,49213
1020,564.0,1.39150332,49694
1030,564.0,1.403923675,50173
1040,562.0,1.416303734,50665
1050,556.0,1.429761523,51150
1060,552.0,1.442148299,51627
1070,554.0,1.455118186,52119
1080,558.0,1.467767283,52595
1090,556.0,1.480854108,53085
1100,558.0,1.492580339,53555
1110,558.0,1.505026769,54044
1120,558.0,1.517407224,54514
1130,558.0,1.529562888,54995
1140,556.0,1.541422651,55487
1150,558.0,1.553989969,55977
1160,556.0,1.566953535,56471
1170,558.0,1.578973297,56943
1180,558.0,1.591736961,57432
1190,558.0,1.603487291,57913
1200,560.0,1.616038016,58402
1210,560.0,1.628328396,58885
1220,562.0,1.640117442,59371
1230,562.0,1.654148861,59842
1240,564.0,1.667136525,60322
1250,560.0,1.680308289,60810
1260,564.0,1.693152151,61287
1270,562.0,1.704229691,61770
1280,566.0,1.717212219,62261
1290,566.0,1.729951784,62744
1300,568.0,1.741888188,63222
1310,562.0,1.754713482,63714
1320,564.0,1.76696159,64203
1330,562.0,1.779696415,64688
1340,562.0,1.793906006,65176
1350,566.0,1.806145423,65656
1360,568.0,1.818167951,66144
1370,570.0,1.830957689,66632
1380,570.0,1.844827923,67114
1390,572.0,1.882646422,67605
1400,572.0,1.895635272,68091
1410,570.0,1.908276072,68575
1420,570.0,1.920400921,69055
1430,572.0,1.932862363,69539
1440,570.0,1.945272843,70015
1450,572.0,1.958169644,70504
1460,576.0,1.970687975,70994
1470,576.0,1.983900825,71478
1480,576.0,1.995897674,71968
1490,578.0,2.008583511,72459
1500,582.0,2.02233404,72943
1510,574.0,2.035194494,73428
1520,574.0,2.049171394,73915
1530,572.0,2.062642614,74392
1540,572.0,2.074884007,74862
1550,568.0,2.087989795,75341
1560,574.0,2.102161065,75832
1570,572.0,2.115204434,76320
1580,570.0,2.13084178,76816
1590,564.0,2.143788358,77314
1600,564.0,2.156619578,77803
1610,564.0,2.170089614,78291
1620,559.0,2.183646563,78767
1630,562.0,2.198486673,79255
1640,558.0,2.211069004,79730
1650,563.0,2.224710891,80202
1660,562.0,2.237550407,80680
1670,558.0,2.25138706,81164
1680,558.0,2.263641094,81663
1690,556.0,2.277342241,82141
1700,556.0,2.290473709,82610
1710,562.0,2.303457028,83094
1720,558.0,2.316293779,83567
1730,556.0,2.328978826,84049
1740,558.0,2.341371527,84529
1750,562.0,2.353593561,85009
1760,558.0,2.366303497,85508
1770,560.0,2.380392199,85969
1780,558.0,2.393787568,86455
1790,558.0,2.406186985,86948
1800,560.0,2.419113415,87430
1810,558.0,2.431126067,87913
1820,558.0,2.443288842,88401
1830,560.0,2.456135074,88879
1840,562.0,2.468773899,89377
1850,562.0,2.482819144,89866
1860,562.0,2.521613446,90346
1870,560.0,2.534442295,90813
1880,558.0,2.548408133,91299
1890,562.0,2.561143748,91788
1900,562.0,2.573394622,92272
1910,562.0,2.58560757,92747
1920,564.0,2.598140123,93235
1930,560.0,2.611316628,93721
1940,562.0,2.623130168,94194
1950,560.0,2.636169586,94673
1960,570.0,2.64835646,95155
1970,564.0,2.660397951,95645
1980,564.0,2.673928036,96127
1990,562.0,2.686649033,96614
2000,562.0,2.700921439,97091
2010,564.0,2.713947425,97565
2020,560.0,2.727292621,98045
2030,562.0,2.740166113,98516
2040,560.0,2.753439802,99011
2050,562.0,2.765927318,99503
2060,568.0,2.777585598,99986
2070,568.0,2.789339484,100461
2080,566.0,2.804392533,100940
2090,572.0,2.817288544,101421
2100,566.0,2.832485395,101909
2110,570.0,2.845510195,102387
2120,566.0,2.858257267,102867
2130,570.0,2.871977771,103355
2140,572.0,2.886371857,103835
2150,566.0,2.901161004,104310
2160,568.0,2.913765459,104781
2170,568.0,2.926096926,105259
2180,566.0,2.938042417,105732
2190,570.0,2.950363612,106216
2200,578.0,2.962166881,106704
2210,572.0,2.975459928,107184
2220,574.0,2.987998012,107665
2230,574.0,2.999981429,108144
2240,572.0,3.01339418,108613
2250,570.0,3.02759745,109117
2260,578.0,3.041583832,109603
2270,564.0,3.054998164,110084
2280,566.0,3.068415657,110556
2290,572.0,3.080310185,111047
2300,568.0,3.092663775,111549
2310,570.0,3.10498655,112024
2320,566.0,3.119029821,112520
2330,570.0,3.157105505,113008
2340,570.0,3.170317565,113490
2350,570.0,3.183102563,113986
2360,572.0,3.195283511,114466
2370,572.0,3.20753557,114936
2380,574.0,3.21966516,115396
2390,574.0,3.231976873,115893
2400,576.0,3.246724934,116387
2410,576.0,3.258818178,116854
2420,576.0,3.27185562,117338
2430,576.0,3.284048025,117822
2440,578.0,3.296377516,118319
2450,576.0,3.308449822,118801
2460,580.0,3.321250227,119288
2470,576.0,3.332161446,119777
2480,576.0,3.344763135,120243
2490,576.0,3.35756354,120722
2500,576.0,3.370629032,121204
2510,576.0,3.38360603,121678
2520,574.0,3.39577157,122163
2530,574.0,3.407730888,122645
2540,572.0,3.421359343,123121
2550,572.0,3.43363076,123595
2560,572.0,3.446042819,124082
2570,576.0,3.458370335,124577
2580,574.0,3.471994444,125063
2590,574.0,3.483937959,125555
2600,570.0,3.49645629,126040
2610,572.0,3.50957709,126525
2620,568.0,3.5218651,127011
2630,566.0,3.534735036,127502
2640,568.0,3.547856232,127996
2650,568.0,3.560075501,128479
2660,568.0,3.573592549,128957
2670,568.0,3.585530534,129438
2680,566.0,3.598304075,129918
2690,568.0,3.611175197,130393
2700,566.0,3.623266071,130874
2710,562.0,3.636757834,131358
2720,562.0,3.648911128,131833
2730,562.0,3.661769213,132319
2740,564.0,3.67439263,132801
2750,560.0,3.686710269,133276
2760,562.0,3.699466427,133755
2770,562.0,3.712196511,134252
2780,560.0,3.724123039,134724
2790,560.0,3.735999394,135198
2800,560.0,3.748806121,135671
2810,558.0,3.762557045,136172
2820,558.0,3.804712535,136641
2830,562.0,3.817886274,137125
2840,560.0,3.829961346,137590
2850,560.0,3.841714047,138063
2860,558.0,3.853693908,138534
2870,562.0,3.866134807,139024
2880,558.0,3.878703706,139502
2890,562.0,3.890855814,139995
2900,564.0,3.902977502,140486
2910,568.0,3.915104327,140985
2920,566.0,3.927530214,141455
2930,562.0,3.9404282,141940
2940,562.0,3.953227815,142428
2950,566.0,3.968341703,142926
2960,560.0,3.9817588,143417
2970,564.0,3.995242662,143886
2980,566.0,4.007763364,144371
2990,564.0,4.020700066,144860
3000,564.0,4.033315978,145336
