,0,1,2,3,4
0.001,0.6265625,0.65,0.66328125,0.615625,0.63515625
0.101,0.8421875,0.83125,0.8390625,0.83046875,0.84375
0.201,0.85546875,0.83984375,0.85703125,0.85,0.85625
0.30100000000000005,0.859375,0.846875,0.86171875,0.853125,0.8609375
0.401,0.8625,0.85078125,0.865625,0.85625,0.865625
0.501,0.865625,0.8515625,0.86640625,0.86015625,0.86953125
0.6010000000000001,0.86640625,0.85234375,0.86875,0.86328125,0.87109375
0.7010000000000001,0.86875,0.8546875,0.86953125,0.8640625,0.87265625
0.801,0.86953125,0.8546875,0.8703125,0.86640625,0.875
0.901,0.86953125,0.8578125,0.87109375,0.8671875,0.8765625
1.001,0.86875,0.859375,0.87265625,0.86796875,0.87734375
1.101,0.8703125,0.86015625,0.875,0.8703125,0.878125
1.201,0.871875,0.8609375,0.875,0.87109375,0.87890625
1.301,0.871875,0.86171875,0.87421875,0.87109375,0.87890625
1.401,0.871875,0.86328125,0.875,0.871875,0.88046875
1.501,0.8734375,0.86328125,0.87578125,0.871875,0.88046875
1.601,0.8734375,0.86484375,0.87734375,0.871875,0.88046875
1.701,0.8734375,0.86484375,0.878125,0.87265625,0.88125
1.801,0.8734375,0.86484375,0.8796875,0.8734375,0.88125
1.901,0.87421875,0.86484375,0.8796875,0.8734375,0.88203125
2.001,0.87421875,0.86484375,0.8796875,0.8734375,0.88359375
2.101,0.87421875,0.86484375,0.8796875,0.8734375,0.88359375
2.201,0.87421875,0.86484375,0.8796875,0.87421875,0.88359375
2.301,0.87421875,0.865625,0.8796875,0.87578125,0.88515625
2.4010000000000002,0.875,0.8671875,0.8796875,0.8765625,0.8859375
