iterations,fitness,time,fevals
0,23.0,0.001952792,646
10,27.0,0.00382815100001,1190
20,28.0,0.00557195500001,1733
30,32.0,0.00878262400001,2284
40,32.0,0.010644156,2832
50,32.0,0.012706775,3388
60,32.0,0.014401591,3934
70,33.0,0.01623863,4479
80,34.0,0.017730384,5024
90,33.0,0.019215817,5571
100,33.0,0.020717053,6120
110,33.0,0.022211967,6666
120,34.0,0.024162388,7215
130,33.0,0.02621276,7767
140,34.0,0.027733354,8316
150,34.0,0.02920338,8851
160,33.0,0.030714887,9409
170,33.0,0.03219637,9959
180,34.0,0.034828669,10504
190,34.0,0.036486744,11056
200,33.0,0.037980078,11613
210,33.0,0.039838055,12164
220,33.0,0.041289118,12715
230,33.0,0.042743341,13261
240,32.0,0.044192824,13801
250,33.0,0.045697221,14346
260,33.0,0.048608038,14901
270,33.0,0.050073323,15444
280,34.0,0.051536237,15986
290,35.0,0.053005077,16531
300,35.0,0.0544940659999,17087
310,35.0,0.0560427089999,17637
320,35.0,0.0588733279999,18177
330,35.0,0.0608039959999,18717
340,35.0,0.0634319489999,19261
350,35.0,0.0649379259999,19806
360,36.0,0.0667236069999,20355
370,36.0,0.0682165459999,20906
380,36.0,0.0697580779999,21451
390,36.0,0.0714007459999,22001
400,36.0,0.0728909199999,22544
410,35.0,0.0744253409999,23099
420,35.0,0.0786848999999,23651
430,36.0,0.0801663819999,24203
440,37.0,0.0819457409999,24750
450,36.0,0.0833770509999,25294
460,36.0,0.0848237679999,25845
470,36.0,0.086689251,26399
480,36.0,0.088322832,26948
490,37.0,0.089768364,27497
500,36.0,0.092770046,28047
510,36.0,0.094219529,28596
520,36.0,0.095749999,29138
530,36.0,0.097177753,29680
540,36.0,0.098583384,30229
550,36.0,0.100717904,30778
560,35.0,0.102280769,31328
570,36.0,0.103741313,31884
580,36.0,0.106280377,32426
590,36.0,0.107715243,32970
600,37.0,0.109295886,33527
610,36.0,0.111366801,34077
620,37.0,0.112820629,34627
630,37.0,0.114361371,35178
640,36.0,0.115961767,35727
650,37.0,0.117430213,36280
660,37.0,0.120193277,36832
670,37.0,0.12164592,37374
680,37.0,0.123078415,37915
690,37.0,0.124529082,38468
700,38.0,0.125945774,39009
710,38.0,0.12738617,39555
720,38.0,0.129453925,40104
730,38.0,0.132196446,40654
740,38.0,0.133632102,41192
750,38.0,0.135091066,41738
760,38.0,0.136566228,42292
770,41.0,0.138217983,42842
780,39.0,0.139744898,43398
790,40.0,0.141257985,43947
800,40.0,0.142716554,44492
810,39.0,0.145342531,45040
820,42.0,0.146993495,45578
830,42.0,0.149137102,46134
840,43.0,0.150652955,46677
850,43.0,0.152128512,47223
860,44.0,0.153593007,47771
870,43.0,0.155046836,48323
880,43.0,0.156604961,48870
890,43.0,0.159237655,49411
900,43.0,0.160808026,49957
910,43.0,0.162235385,50504
920,43.0,0.163669855,51058
930,43.0,0.165103535,51609
940,43.0,0.16758729,52157
950,44.0,0.169014649,52711
960,44.0,0.170573564,53257
970,44.0,0.173188479,53801
980,44.0,0.174643493,54346
990,44.0,0.176113124,54899
1000,44.0,0.177561816,55450
1010,44.0,0.179014064,55993
1020,44.0,0.180718757,56538
1030,44.0,0.182154807,57088
1040,44.0,0.183586512,57636
1050,44.0,0.186688144,58185
1060,44.0,0.188089429,58738
1070,44.0,0.189539306,59292
1080,44.0,0.191027505,59840
1090,45.0,0.192469877,60390
1100,45.0,0.194859607,60936
1110,44.0,0.196319757,61480
1120,44.0,0.197788203,62029
1130,44.0,0.20047581,62571
1140,44.0,0.201930428,63124
1150,45.0,0.203633936,63667
1160,45.0,0.205228802,64211
1170,45.0,0.206720556,64764
1180,44.0,0.20827315,65316
1190,44.0,0.209730534,65866
1200,44.0,0.211220708,66414
1210,45.0,0.214177748,66965
1220,45.0,0.216068515,67515
1230,44.0,0.217546442,68058
1240,44.0,0.218989999,68600
1250,44.0,0.220635828,69151
1260,44.0,0.222091631,69700
1270,44.0,0.224439089,70252
1280,44.0,0.226289164,70802
1290,44.0,0.228717215,71348
1300,47.0,0.230299833,71899
1310,46.0,0.231762747,72448
1320,44.0,0.233239094,72996
1330,44.0,0.234973812,73536
1340,44.0,0.236442258,74081
1350,44.0,0.237909123,74632
1360,44.0,0.2407512,75195
1370,45.0,0.242751794,75736
1380,44.0,0.244738166,76281
1390,45.0,0.246373327,76830
1400,44.0,0.247848884,77385
1410,44.0,0.249411354,77927
1420,45.0,0.250865973,78479
1430,44.0,0.252292542,79023
1440,44.0,0.254864791,79569
1450,45.0,0.256345879,80114
1460,45.0,0.257808004,80662
1470,45.0,0.259270919,81208
1480,45.0,0.260734228,81753
1490,45.0,0.262966724,82299
1500,45.0,0.264938874,82852
1510,46.0,0.266394283,83397
1520,45.0,0.269003273,83948
1530,45.0,0.270621052,84495
1540,45.0,0.272082781,85040
1550,45.0,0.273943128,85581
1560,45.0,0.275407623,86129
1570,46.0,0.276862242,86671
1580,46.0,0.278327527,87223
1590,45.0,0.279814146,87773
1600,45.0,0.282576815,88321
1610,45.0,0.284402002,88866
1620,46.0,0.285874003,89410
1630,46.0,0.287321116,89960
1640,45.0,0.288754796,90498
1650,45.0,0.290557859,91045
1660,45.0,0.29269949,91594
1670,46.0,0.294146603,92139
1680,45.0,0.296777716,92694
1690,45.0,0.298244186,93235
1700,46.0,0.299826015,93773
1710,46.0,0.3018914,94324
1720,46.0,0.303366167,94876
1730,46.0,0.304847255,95432
1740,46.0,0.306390368,95982
1750,46.0,0.307862369,96535
1760,46.0,0.310368248,97084
1770,46.0,0.31229378,97638
1780,51.0,0.313772102,98183
1790,47.0,0.31522909,98729
1800,48.0,0.316662375,99275
1810,47.0,0.318116598,99830
1820,47.0,0.319582278,100384
1830,47.0,0.321042032,100926
1840,47.0,0.323630874,101471
1850,47.0,0.325077986,102015
1860,50.0,0.326493494,102562
1870,48.0,0.327938631,103105
1880,50.0,0.329797793,103656
1890,52.0,0.331239374,104203
1900,51.0,0.332677794,104751
1910,52.0,0.33434456,105303
1920,52.0,0.335840265,105861
1930,52.0,0.337279081,106411
1940,53.0,0.338716712,106956
1950,53.0,0.340137355,107497
1960,54.0,0.341588813,108045
1970,53.0,0.343549901,108593
1980,54.0,0.344991088,109140
1990,53.0,0.347530942,109688
2000,53.0,0.348962647,110237
2010,53.0,0.350411735,110783
2020,53.0,0.351854896,111335
2030,53.0,0.353317416,111883
2040,53.0,0.354905565,112429
2050,54.0,0.356348727,112973
2060,54.0,0.357801765,113526
2070,54.0,0.3604712,114083
2080,53.0,0.362278214,114627
2090,53.0,0.364265771,115180
2100,54.0,0.36575397,115730
2110,54.0,0.367221625,116277
2120,54.0,0.368676244,116823
2130,54.0,0.370121381,117365
2140,55.0,0.371567307,117913
2150,54.0,0.37454726,118463
2160,54.0,0.375996742,119008
2170,54.0,0.377492842,119553
2180,54.0,0.378919411,120091
2190,54.0,0.380376005,120643
2200,55.0,0.381840895,121199
2210,55.0,0.383285242,121739
2220,54.0,0.384741045,122292
2230,55.0,0.387937492,122833
2240,55.0,0.389398432,123381
2250,55.0,0.39084673,123930
2260,56.0,0.392303324,124481
2270,55.0,0.393846437,125031
2280,55.0,0.39545829,125587
2290,55.0,0.396917254,126136
2300,55.0,0.398374243,126689
2310,55.0,0.400928319,127230
2320,55.0,0.402376616,127784
2330,55.0,0.403994,128341
2340,55.0,0.405797854,128886
2350,55.0,0.407253658,129433
2360,55.0,0.408715387,129985
2370,55.0,0.410185808,130537
2380,55.0,0.411625019,131090
2390,55.0,0.414638553,131643
2400,55.0,0.41605169,132194
2410,55.0,0.417507099,132742
2420,56.0,0.419121323,133294
2430,56.0,0.420556583,133834
2440,55.0,0.422458411,134380
2450,55.0,0.424187993,134932
2460,56.0,0.425919155,135471
2470,55.0,0.428475207,136013
2480,55.0,0.429912838,136557
2490,56.0,0.431346123,137106
2500,55.0,0.432910963,137648
2510,55.0,0.434369137,138197
2520,56.0,0.436520645,138751
2530,55.0,0.438030572,139297
2540,55.0,0.44091571,139844
2550,55.0,0.442437884,140389
2560,62.0,0.443892898,140941
2570,56.0,0.445326973,141495
2580,56.0,0.446757493,142047
2590,56.0,0.448255173,142592
2600,56.0,0.45021231,143143
2610,56.0,0.451629793,143689
2620,56.0,0.454621203,144243
2630,56.0,0.456037895,144787
2640,56.0,0.457577057,145341
2650,55.0,0.459017453,145893
2660,56.0,0.46055701,146434
2670,56.0,0.462005307,146975
2680,56.0,0.463459136,147522
2690,56.0,0.465228619,148065
2700,56.0,0.468283634,148609
2710,56.0,0.469927487,149164
2720,56.0,0.471813513,149707
2730,56.0,0.473263391,150255
2740,56.0,0.475569368,150795
2750,56.0,0.477177665,151351
2760,56.0,0.478639394,151899
2770,56.0,0.480099938,152444
2780,57.0,0.482626755,152996
2790,56.0,0.484082164,153547
2800,56.0,0.485673079,154092
2810,56.0,0.487240685,154633
2820,55.0,0.488679106,155182
2830,55.0,0.490132539,155731
2840,56.0,0.491710022,156287
2850,56.0,0.493147258,156836
2860,56.0,0.495824594,157383
2870,56.0,0.497258669,157928
2880,56.0,0.498664695,158468
2890,56.0,0.500097585,159012
2900,56.0,0.502489291,159566
2910,56.0,0.504272996,160113
2920,56.0,0.505698775,160658
2930,56.0,0.507146678,161212
2940,56.0,0.509821644,161767
2950,56.0,0.511266781,162314
2960,56.0,0.512711523,162854
2970,56.0,0.514171277,163401
2980,56.0,0.515593106,163942
2990,56.0,0.517038243,164490
3000,56.0,0.519271924,165029
3010,56.0,0.520984518,165575
3020,56.0,0.523472223,166123
3030,56.0,0.524903138,166671
3040,57.0,0.526663535,167219
3050,56.0,0.528694944,167760
3060,56.0,0.53013218,168308
3070,56.0,0.531576131,168862
3080,56.0,0.533099095,169408
3090,56.0,0.53452843,169959
3100,56.0,0.537002309,170511
3110,57.0,0.538983545,171058
3120,57.0,0.540423546,171603
3130,57.0,0.542044486,172157
3140,56.0,0.543465524,172703
3150,57.0,0.544881031,173248
3160,56.0,0.546522119,173796
3170,56.0,0.549123207,174346
3180,56.0,0.550562813,174893
3190,56.0,0.551962913,175445
3200,56.0,0.553775458,175987
3210,57.0,0.555384545,176530
3220,56.0,0.556971509,177079
3230,56.0,0.558404004,177626
3240,56.0,0.559941585,178173
3250,56.0,0.563025044,178722
3260,56.0,0.56455907,179267
3270,56.0,0.56599275,179811
3280,56.0,0.56742485,180364
3290,56.0,0.569008654,180911
3300,57.0,0.570713742,181462
3310,56.0,0.572489941,182014
3320,56.0,0.573910979,182560
3330,56.0,0.576497055,183108
3340,57.0,0.577914537,183652
3350,58.0,0.579375871,184198
3360,56.0,0.580901206,184746
3370,56.0,0.582348714,185290
3380,56.0,0.583792666,185832
3390,56.0,0.585231481,186380
3400,56.0,0.586693606,186927
3410,56.0,0.590782498,187477
3420,56.0,0.592228031,188028
3430,56.0,0.593651045,188573
3440,56.0,0.595082354,189126
3450,56.0,0.596497861,189674
3460,56.0,0.598283146,190228
3470,56.0,0.600134011,190777
3480,56.0,0.601884531,191318
3490,56.0,0.605388336,191865
3500,56.0,0.607297671,192405
3510,57.0,0.609508833,192954
3520,57.0,0.61108197,193511
3530,57.0,0.612711206,194051
3540,58.0,0.614357035,194602
3550,69.0,0.616687506,195155
3560,64.0,0.61840168,195704
3570,64.0,0.62133067,196252
3580,68.0,0.623811265,196801
3590,70.0,0.625276551,197362
3600,70.0,0.626716552,197912
3610,69.0,0.62813759,198458
3620,68.0,0.629640407,199001
3630,68.0,0.631065395,199555
3640,68.0,0.632820655,200104
3650,69.0,0.635671818,200649
3660,69.0,0.637089696,201197
3670,69.0,0.640101649,201736
3680,69.0,0.64153849,202285
3690,69.0,0.643120318,202833
3700,69.0,0.644718739,203390
3710,69.0,0.646147678,203938
3720,68.0,0.648984619,204482
3730,68.0,0.650521806,205027
3740,69.0,0.651954696,205572
3750,69.0,0.653557857,206128
3760,69.0,0.654998648,206682
3770,69.0,0.656462353,207224
3780,69.0,0.657999145,207772
3790,69.0,0.659438751,208316
3800,69.0,0.662500877,208868
3810,69.0,0.663938903,209414
3820,70.0,0.665369027,209964
3830,70.0,0.666797967,210512
3840,72.0,0.668420487,211064
3850,70.0,0.670353921,211612
3860,71.0,0.672106021,212169
3870,69.0,0.673912639,212723
3880,70.0,0.676543752,213273
3890,72.0,0.678033926,213817
3900,69.0,0.679532792,214367
3910,70.0,0.680978324,214915
3920,70.0,0.682472449,215461
3930,70.0,0.684045982,216011
3940,69.0,0.685565786,216558
3950,73.0,0.687012898,217103
3960,72.0,0.690584259,217651
3970,72.0,0.692025841,218194
3980,72.0,0.693725397,218748
3990,72.0,0.695190682,219293
4000,73.0,0.69664767,219839
4010,73.0,0.698220412,220378
4020,72.0,0.699662389,220919
4030,72.0,0.701134786,221460
4040,72.0,0.703838591,222013
4050,71.0,0.705275432,222566
4060,70.0,0.706720174,223111
4070,70.0,0.70818783,223660
4080,71.0,0.709641659,224214
4090,71.0,0.712091044,224755
4100,71.0,0.713618354,225305
4110,71.0,0.715186356,225860
4120,71.0,0.717842753,226414
4130,71.0,0.719363742,226966
4140,71.0,0.720994558,227517
4150,71.0,0.722742313,228057
4160,71.0,0.724166906,228605
4170,70.0,0.725856586,229153
4180,71.0,0.727270118,229699
4190,71.0,0.728676143,230243
4200,71.0,0.731232984,230789
4210,70.0,0.732640985,231335
4220,71.0,0.734057283,231884
4230,71.0,0.73607842,232428
4240,71.0,0.737496692,232969
4250,71.0,0.738929582,233506
4260,71.0,0.740335212,234055
4270,71.0,0.741759411,234611
4280,72.0,0.7447125,235147
4290,72.0,0.746126427,235689
4300,73.0,0.747535218,236229
4310,73.0,0.748960602,236773
4320,73.0,0.750389541,237329
4330,73.0,0.751833098,237882
4340,73.0,0.753566235,238425
4350,73.0,0.756171669,238968
4360,74.0,0.75761167,239513
4370,73.0,0.759056017,240056
4380,73.0,0.760503524,240604
4390,73.0,0.761943525,241157
4400,73.0,0.763714983,241711
4410,73.0,0.765274688,242262
4420,73.0,0.766693356,242809
4430,73.0,0.769845161,243355
4440,73.0,0.771272915,243902
4450,73.0,0.77305425,244452
4460,75.0,0.774491486,244995
4470,74.0,0.775912919,245536
4480,73.0,0.777345414,246089
4490,74.0,0.778783835,246631
4500,74.0,0.780192231,247175
4510,74.0,0.784073716,247718
4520,74.0,0.785920631,248276
4530,77.0,0.78734325,248818
4540,75.0,0.789200437,249370
4550,75.0,0.79064755,249921
4560,75.0,0.792159058,250462
4570,77.0,0.793723899,251008
4580,75.0,0.79516232,251555
4590,80.0,0.797829779,252106
4600,75.0,0.799293089,252651
4610,81.0,0.800988301,253189
4620,74.0,0.802440945,253742
4630,73.0,0.803889242,254293
4640,73.0,0.805316602,254844
4650,74.0,0.806777147,255392
4660,73.0,0.808231765,255939
4670,73.0,0.811861595,256492
4680,73.0,0.813318189,257045
4690,77.0,0.814773993,257596
4700,78.0,0.816229007,258146
4710,73.0,0.817674934,258694
4720,73.0,0.819133503,259242
4730,74.0,0.820591282,259792
4740,74.0,0.822025357,260335
4750,77.0,0.824666742,260880
4760,73.0,0.826141114,261433
4770,74.0,0.828105758,261974
4780,75.0,0.829744475,262522
4790,75.0,0.831213316,263075
4800,77.0,0.83267149,263626
4810,74.0,0.834173121,264182
4820,73.0,0.835610356,264722
4830,74.0,0.838189716,265269
4840,74.0,0.839634063,265819
4850,74.0,0.841373126,266370
4860,74.0,0.842827349,266913
4870,74.0,0.844291054,267469
4880,74.0,0.845725129,268020
4890,74.0,0.847380044,268565
4900,74.0,0.848829132,269109
4910,74.0,0.851386763,269658
4920,74.0,0.853545382,270209
4930,74.0,0.854958914,270756
4940,74.0,0.85646094,271303
4950,74.0,0.857930571,271854
4960,74.0,0.859382819,272399
4970,75.0,0.860829931,272952
4980,75.0,0.863669636,273491
4990,75.0,0.865145588,274040
5000,74.0,0.867146577,274584
