iteration,MSE_trg,MSE_val,MSE_tst,acc_trg,acc_val,acc_tst,f1_trg,f1_val,f1_tst,elapsed
0,0.0319274465152,0.0283303887265,0.0311392445582,0.919107193631,0.931779420125,0.917689859027,0.95454908539,0.961734693878,0.953743930488,0.321522032
10,0.000332398640077,0.000343107220334,0.000805378865592,0.999147000284,0.998862990335,0.9977262392,0.999523960647,0.999365482234,0.998731286476,3.442504252
20,3.80413227018e-06,0.000265867518016,0.000384557181971,1.0,0.999431495168,0.99909049568,1.0,0.999682841738,0.999492643328,6.466962147
30,1.56261327701e-08,0.0002306668487,4.77752103691e-05,1.0,0.999431495168,1.0,1.0,0.999682841738,1.0,9.553227496
40,6.53312892659e-12,2.93587439883e-05,1.88491258863e-05,1.0,1.0,1.0,1.0,1.0,1.0,12.5955497
50,7.10677011119e-05,0.000595860940993,0.00045475245453,0.999857833381,0.998862990335,0.99909049568,0.999920678988,0.999365884591,0.999492643328,15.538190644
60,7.52620774822e-05,0.000575768799504,0.000652081580597,0.999715666761,0.998862990335,0.99863574352,0.999841320216,0.999365884591,0.999238771885,18.514428452
70,2.18845310005e-22,0.000844884223245,0.00046156724817,1.0,0.998294485503,0.99909049568,1.0,0.999049128368,0.999492643328,21.470415381
80,1.87910136203e-25,0.000838493033409,0.00045475227613,1.0,0.998294485503,0.99909049568,1.0,0.999049128368,0.999492643328,24.518347467
90,2.63025682026e-33,0.000852722124213,0.000668899246482,1.0,0.998294485503,0.99863574352,1.0,0.999049128368,0.999238771885,27.489845322
100,1.84966862249e-35,0.000713094323747,0.000853785061488,1.0,0.998294485503,0.99818099136,1.0,0.999049128368,0.998984771574,30.451357191
110,1.53938018958e-35,0.000284277590928,0.00105229219608,1.0,0.999431495168,0.9977262392,1.0,0.999682841738,0.998730642295,33.386570572
120,2.67617850887e-35,0.000284284615068,0.00109345720128,1.0,0.999431495168,0.9977262392,1.0,0.999682841738,0.998730642295,36.456967467
130,5.14450181178e-36,0.000284299118072,0.00109326670831,1.0,0.999431495168,0.9977262392,1.0,0.999682841738,0.998730642295,39.446851903
140,8.02514919052e-36,0.000284276459037,0.00107891661168,1.0,0.999431495168,0.9977262392,1.0,0.999682841738,0.998730642295,42.433194214
150,7.36128407046e-36,0.000284449706232,0.00103365484809,1.0,0.999431495168,0.9977262392,1.0,0.999682841738,0.998730642295,45.397788754
160,1.05753895005e-37,0.000544762899109,0.00109184112899,1.0,0.998862990335,0.9977262392,1.0,0.999365884591,0.998730642295,48.330691418
170,7.02333168205e-36,0.000683616707229,0.00127699330101,1.0,0.998294485503,0.99727148704,1.0,0.999048525214,0.998476383951,51.418294842
180,1.10394812196e-24,0.000773638643537,0.00132546810153,1.0,0.998294485503,0.99727148704,1.0,0.999048525214,0.998476383951,54.423739981
190,1.05492112722e-35,0.00082666951973,0.00129404537697,1.0,0.998294485503,0.99727148704,1.0,0.999048525214,0.998476383951,57.479175087
200,3.51329628435e-36,0.000794737371274,0.00126994138897,1.0,0.998294485503,0.99727148704,1.0,0.999048525214,0.998476383951,60.52826194
210,1.75245247233e-35,0.000776221480327,0.00125803466559,1.0,0.998294485503,0.99727148704,1.0,0.999048525214,0.998476383951,63.793601805
220,1.40191829875e-35,0.000777623188893,0.00124042641949,1.0,0.998294485503,0.99727148704,1.0,0.999048525214,0.998476383951,66.795184025
230,1.05142189917e-35,0.000775520718286,0.00123751498346,1.0,0.998294485503,0.99727148704,1.0,0.999048525214,0.998476383951,69.819874614
240,1.05141805331e-35,0.000771700761761,0.00126779312602,1.0,0.998294485503,0.99727148704,1.0,0.999048525214,0.998476383951,72.789600218
250,3.50481123503e-36,0.000777680640374,0.00127986954808,1.0,0.998294485503,0.99727148704,1.0,0.999048525214,0.998476383951,76.063648437
260,7.00948090698e-36,0.000727510654148,0.001275424029,1.0,0.998294485503,0.99727148704,1.0,0.999048525214,0.998476383951,79.043563481
270,7.00946194979e-36,0.000689293169457,0.00126406521233,1.0,0.998294485503,0.99727148704,1.0,0.999048525214,0.998476383951,82.029748557
280,1.05141370838e-35,0.0006393122952,0.00125600779732,1.0,0.998294485503,0.99727148704,1.0,0.999048525214,0.998476383951,85.026639026
290,1.05141020639e-35,0.000557213518869,0.00126423413029,1.0,0.998862990335,0.99727148704,1.0,0.999365482234,0.998476383951,87.993256282
300,7.00938704576e-36,0.000532240532112,0.00126865073328,1.0,0.998862990335,0.99727148704,1.0,0.999365482234,0.998476383951,90.963752654
310,3.50470052623e-36,0.000515192857157,0.00126550068607,1.0,0.998862990335,0.99727148704,1.0,0.999365482234,0.998476383951,94.049896326
320,3.50470912522e-36,0.000498273793555,0.00125587501725,1.0,0.998862990335,0.99727148704,1.0,0.999365482234,0.998476383951,97.235584177
330,2.45328511635e-35,0.000442397673305,0.00121908523122,1.0,0.998862990335,0.99727148704,1.0,0.999365482234,0.998476383951,100.525036259
340,7.00951266305e-36,0.000368404004361,0.00119716766701,1.0,0.998862990335,0.99727148704,1.0,0.999365482234,0.998476383951,103.748050756
350,3.50492827349e-36,0.000315671922407,0.00117663370353,1.0,0.999431495168,0.9977262392,1.0,0.999682841738,0.998730642295,106.878622713
360,7.00956481786e-36,0.000299047473309,0.00117002229932,1.0,0.999431495168,0.9977262392,1.0,0.999682841738,0.998730642295,110.010678916
370,1.05142522214e-35,0.000542171089015,0.00115624924159,1.0,0.998862990335,0.9977262392,1.0,0.999365482234,0.998730642295,113.181336238
380,7.00947663249e-36,0.000573222021033,0.0011441725738,1.0,0.998862990335,0.9977262392,1.0,0.999365482234,0.998730642295,116.466559969
390,3.50476405524e-36,0.000876877182163,0.00113962825065,1.0,0.998294485503,0.9977262392,1.0,0.999047921295,0.998730642295,119.985363737
400,3.50475356574e-36,0.000930479444142,0.00113797031709,1.0,0.997725980671,0.9977262392,1.0,0.99873015873,0.998730642295,123.671503539
410,7.00945974239e-36,0.00101631961253,0.00113443593863,1.0,0.997725980671,0.9977262392,1.0,0.99873015873,0.998730642295,127.487660628
420,3.50479861118e-36,0.00108607466501,0.00113042692578,1.0,0.997725980671,0.9977262392,1.0,0.99873015873,0.998730642295,131.517759219
430,3.50490860041e-36,0.001119439951,0.00112843849175,1.0,0.997725980671,0.9977262392,1.0,0.99873015873,0.998730642295,135.47617815
440,7.00957529192e-36,0.00108316653037,0.00113429515024,1.0,0.997725980671,0.9977262392,1.0,0.99873015873,0.998730642295,139.43552903
450,3.50486035131e-36,0.000862491684048,0.00113533120189,1.0,0.998294485503,0.9977262392,1.0,0.999047921295,0.998730642295,143.708618431
460,7.00953795909e-36,0.000852615484628,0.00113444761553,1.0,0.998294485503,0.9977262392,1.0,0.999047921295,0.998730642295,147.466503474
470,7.00949521356e-36,0.000852725682637,0.00113525858824,1.0,0.998294485503,0.9977262392,1.0,0.999047921295,0.998730642295,151.405547772
480,1.40188125885e-35,0.000852748821555,0.00113612814678,1.0,0.998294485503,0.9977262392,1.0,0.999047921295,0.998730642295,155.181222856
490,3.5047829762e-36,0.000852747730564,0.00113593254954,1.0,0.998294485503,0.9977262392,1.0,0.999047921295,0.998730642295,159.033725656
500,1.05141447862e-35,0.0008527519269,0.00113596481514,1.0,0.998294485503,0.9977262392,1.0,0.999047921295,0.998730642295,162.596613607
510,3.50479400772e-36,0.000852755273176,0.00113596465801,1.0,0.998294485503,0.9977262392,1.0,0.999047921295,0.998730642295,166.364394162
520,7.00949679862e-36,0.000852756129184,0.001134589451,1.0,0.998294485503,0.9977262392,1.0,0.999047921295,0.998730642295,170.140241886
530,7.00953980842e-36,0.000852756349775,0.00113287973357,1.0,0.998294485503,0.9977262392,1.0,0.999047921295,0.998730642295,173.789135634
540,3.50495588071e-36,0.000852756513927,0.00113086688249,1.0,0.998294485503,0.9977262392,1.0,0.999047921295,0.998730642295,177.526113201
550,7.00970015721e-36,0.000852756724647,0.00112964154584,1.0,0.998294485503,0.9977262392,1.0,0.999047921295,0.998730642295,181.357869313
560,1.05148325584e-35,0.000852756482403,0.00112726591568,1.0,0.998294485503,0.9977262392,1.0,0.999047921295,0.998730642295,185.433548977
570,3.50590383066e-36,0.000852756205187,0.00112618828938,1.0,0.998294485503,0.9977262392,1.0,0.999047921295,0.998730642295,189.200002916
580,1.0517816519e-35,0.000852755848974,0.00112387267231,1.0,0.998294485503,0.9977262392,1.0,0.999047921295,0.998730642295,192.989583789
590,4.4749272378e-38,0.000852753170472,0.00111917823385,1.0,0.998294485503,0.9977262392,1.0,0.999047921295,0.998730642295,196.793895733
600,1.42083991484e-35,0.000852749169239,0.00111415194574,1.0,0.998294485503,0.9977262392,1.0,0.999047921295,0.998730642295,200.408451874
610,1.0835456575e-35,0.000852746332854,0.0011101896998,1.0,0.998294485503,0.9977262392,1.0,0.999047921295,0.998730642295,204.661027678
620,7.42337499224e-36,0.000852745296219,0.00110343370847,1.0,0.998294485503,0.9977262392,1.0,0.999047921295,0.998730642295,209.130161086
630,7.42694359436e-36,0.000852753920645,0.00107812471624,1.0,0.998294485503,0.9977262392,1.0,0.999047921295,0.998730642295,213.077824846
640,3.74332472153e-36,0.000852861264058,0.00102835189551,1.0,0.998294485503,0.9977262392,1.0,0.999047921295,0.998730642295,217.028269053
650,1.073447731e-35,0.000858048529632,0.000941678397987,1.0,0.998294485503,0.99818099136,1.0,0.999047921295,0.998984771574,220.802472923
660,3.74015595479e-36,0.000914035921463,0.000980482722994,1.0,0.998294485503,0.9977262392,1.0,0.999047921295,0.998730642295,224.581107416
670,2.37160915046e-37,0.000947809980258,0.00101564459344,1.0,0.997725980671,0.9977262392,1.0,0.998730964467,0.998730642295,228.210814188
680,2.77661590049e-37,0.000983811393408,0.00100851120212,1.0,0.997725980671,0.9977262392,1.0,0.998730964467,0.998730642295,232.027071621
690,3.75386893088e-36,0.00106233072263,0.00101354694919,1.0,0.997725980671,0.9977262392,1.0,0.998730964467,0.998730642295,235.872639896
700,4.18262031358e-36,0.00112398905726,0.00100578215602,1.0,0.997725980671,0.9977262392,1.0,0.998730964467,0.998730642295,239.634649779
710,4.46409219557e-36,0.00113321064475,0.000991424977892,1.0,0.997725980671,0.9977262392,1.0,0.998730964467,0.998730642295,243.323508397
720,9.97176206681e-37,0.00113484204427,0.000955724927326,1.0,0.997725980671,0.99818099136,1.0,0.998730964467,0.998984771574,247.026159423
730,4.32533060856e-36,0.00113315230734,0.000929260406254,1.0,0.997725980671,0.99818099136,1.0,0.998730964467,0.998984771574,250.800066998
740,1.15059855463e-33,0.00113343691034,0.000931869180161,1.0,0.997725980671,0.99818099136,1.0,0.998730964467,0.998984771574,254.702276107
750,1.72234352851e-35,0.0011239151895,0.000911159108566,1.0,0.997725980671,0.99818099136,1.0,0.998730964467,0.998984771574,258.539808027
760,1.67445886636e-35,0.00110976623585,0.000910761112352,1.0,0.997725980671,0.99818099136,1.0,0.998730964467,0.998984771574,262.530826291
770,8.67627811133e-36,0.00110156495107,0.000910221850434,1.0,0.997725980671,0.99818099136,1.0,0.998730964467,0.998984771574,266.75885136
780,7.49067031165e-36,0.00108807744013,0.000910821618672,1.0,0.997725980671,0.99818099136,1.0,0.998730964467,0.998984771574,270.669338599
790,1.07982207571e-35,0.00108327894666,0.000912570089659,1.0,0.997725980671,0.99818099136,1.0,0.998730964467,0.998984771574,274.451970723
800,1.7819799898e-35,0.00107873522809,0.000915551784887,1.0,0.997725980671,0.99818099136,1.0,0.998730964467,0.998984771574,278.223320664
810,3.769395948e-36,0.00107713018036,0.000930943402749,1.0,0.997725980671,0.99818099136,1.0,0.998730964467,0.998984771574,282.031738489
820,1.37166560767e-37,0.00106906519264,0.0010014360686,1.0,0.997725980671,0.9977262392,1.0,0.998730964467,0.998730642295,286.017951219
830,9.26169523384e-38,0.00106134287486,0.00109823512244,1.0,0.997725980671,0.9977262392,1.0,0.998730964467,0.998730642295,289.824000252
840,7.0851537233e-36,0.00106859533144,0.00106012456179,1.0,0.997725980671,0.9977262392,1.0,0.998730964467,0.998730642295,293.674453069
850,7.08759025005e-36,0.00105473357617,0.000987859504989,1.0,0.997725980671,0.9977262392,1.0,0.998730964467,0.998730642295,297.480876621
860,7.21124983934e-36,0.0010297464522,0.000920996825715,1.0,0.997725980671,0.99818099136,1.0,0.998730964467,0.998984771574,301.237943488
870,3.87309246259e-36,0.00101397099448,0.00090818706545,1.0,0.997725980671,0.99818099136,1.0,0.998730964467,0.998984771574,305.019636944
880,2.13039274241e-35,0.00092023090316,0.000908165776858,1.0,0.997725980671,0.99818099136,1.0,0.998730964467,0.998984771574,308.966925
890,3.72157907196e-36,0.00105871677806,0.000908211036679,1.0,0.997157475839,0.99818099136,1.0,0.99841420869,0.998984771574,312.90344604
900,1.41680128586e-35,0.00123739613466,0.000909195985425,1.0,0.997157475839,0.99818099136,1.0,0.99841420869,0.998984771574,316.724808861
910,2.1021239735e-37,0.00125068413332,0.000909353527816,1.0,0.997157475839,0.99818099136,1.0,0.99841420869,0.998984771574,320.614915638
920,1.23873240766e-37,0.00127698959433,0.000909438932592,1.0,0.997157475839,0.99818099136,1.0,0.99841420869,0.998984771574,324.574893483
930,4.76504949937e-38,0.000878211024718,0.000909504282577,1.0,0.997725980671,0.99818099136,1.0,0.998731769182,0.998984771574,329.105514344
940,2.66532213295e-38,0.000579675394202,0.0009095043008,1.0,0.998862990335,0.99818099136,1.0,0.999365482234,0.998984771574,333.332513832
950,7.02418827891e-36,0.000579430021097,0.00090950430546,1.0,0.998862990335,0.99818099136,1.0,0.999365482234,0.998984771574,337.231823581
960,3.50999549375e-36,0.000569598503574,0.000909504282786,1.0,0.998862990335,0.99818099136,1.0,0.999365482234,0.998984771574,340.96931868
970,1.74869781138e-39,0.000568536147331,0.000909504295188,1.0,0.998862990335,0.99818099136,1.0,0.999365482234,0.998984771574,344.976150489
980,1.05151354767e-35,0.000568510368769,0.000909504299705,1.0,0.998862990335,0.99818099136,1.0,0.999365482234,0.998984771574,348.892408005
990,3.50553750276e-36,0.000568505936938,0.000909504297077,1.0,0.998862990335,0.99818099136,1.0,0.999365482234,0.998984771574,352.650911716
1000,3.15429177975e-35,0.000568505529729,0.000909504291653,1.0,0.998862990335,0.99818099136,1.0,0.999365482234,0.998984771574,356.619911198
1010,2.10287834594e-35,0.000568505404352,0.000909504272575,1.0,0.998862990335,0.99818099136,1.0,0.999365482234,0.998984771574,360.492086109
1020,3.50521743035e-36,0.000568505562487,0.000909504259053,1.0,0.998862990335,0.99818099136,1.0,0.999365482234,0.998984771574,364.493016482
1030,2.10283386541e-35,0.000568505883002,0.000909504205932,1.0,0.998862990335,0.99818099136,1.0,0.999365482234,0.998984771574,368.397133345
1040,2.25413919919e-40,0.000568506793929,0.000909504225468,1.0,0.998862990335,0.99818099136,1.0,0.999365482234,0.998984771574,372.090329746
1050,1.05142044292e-35,0.000821048729494,0.000909504233316,1.0,0.998294485503,0.99818099136,1.0,0.999047921295,0.998984771574,375.883409286
1060,7.00947079043e-36,0.000852507977864,0.000909504306661,1.0,0.998294485503,0.99818099136,1.0,0.999047921295,0.998984771574,379.666332572
1070,3.50479167407e-36,0.000851141766952,0.000909504307795,1.0,0.998294485503,0.99818099136,1.0,0.999047921295,0.998984771574,383.520597743
1080,2.10281856751e-35,0.000849587264254,0.000909504315251,1.0,0.998294485503,0.99818099136,1.0,0.999047921295,0.998984771574,387.39602125
1090,3.5048203954e-36,0.000846977051929,0.000909504315696,1.0,0.998294485503,0.99818099136,1.0,0.999047921295,0.998984771574,391.274601301
1100,2.23851752168e-40,0.000845799898709,0.000909504315611,1.0,0.998294485503,0.99818099136,1.0,0.999047921295,0.998984771574,395.070267708
1110,7.0096069189e-36,0.000846866216936,0.000909504314583,1.0,0.998294485503,0.99818099136,1.0,0.999047921295,0.998984771574,399.118554957
1120,7.00964210252e-36,0.000847862632064,0.0009095043042,1.0,0.998294485503,0.99818099136,1.0,0.999047921295,0.998984771574,402.983049073
1130,2.57835079571e-40,0.000851929316424,0.000909504298386,1.0,0.998294485503,0.99818099136,1.0,0.999047921295,0.998984771574,406.878758225
1140,7.00960304019e-36,0.000850706927489,0.000909504290746,1.0,0.998294485503,0.99818099136,1.0,0.999047921295,0.998984771574,410.709277793
1150,7.00958743566e-36,0.000851137968707,0.00090950428403,1.0,0.998294485503,0.99818099136,1.0,0.999047921295,0.998984771574,414.607505466
1160,3.50484980182e-36,0.00085306757352,0.00090950421659,1.0,0.998294485503,0.99818099136,1.0,0.999047921295,0.998984771574,418.481044922
1170,3.50481730422e-36,0.000852965816666,0.000909504109591,1.0,0.998294485503,0.99818099136,1.0,0.999047921295,0.998984771574,427.077545147
1180,7.00948798371e-36,0.000852809450538,0.000909504010073,1.0,0.998294485503,0.99818099136,1.0,0.999047921295,0.998984771574,433.879828841
1190,1.40188771803e-35,0.000852824742374,0.000909504013918,1.0,0.998294485503,0.99818099136,1.0,0.999047921295,0.998984771574,438.652329206
1200,1.40188599384e-35,0.0008528079161,0.000909504015937,1.0,0.998294485503,0.99818099136,1.0,0.999047921295,0.998984771574,443.050168926
1210,3.50483160172e-36,0.00085280024781,0.000909503933448,1.0,0.998294485503,0.99818099136,1.0,0.999047921295,0.998984771574,447.455036009
1220,1.49207626282e-40,0.000852761791304,0.000909502831835,1.0,0.998294485503,0.99818099136,1.0,0.999047921295,0.998984771574,453.611951097
1230,1.25866109387e-40,0.000852757124143,0.000909498713409,1.0,0.998294485503,0.99818099136,1.0,0.999047921295,0.998984771574,460.935465032
1240,7.00945061296e-36,0.000852757222234,0.000909501020136,1.0,0.998294485503,0.99818099136,1.0,0.999047921295,0.998984771574,466.860817271
1250,3.50476634492e-36,0.000852757213556,0.000909502881569,1.0,0.998294485503,0.99818099136,1.0,0.999047921295,0.998984771574,471.552433817
1260,7.00945335299e-36,0.000852757105117,0.000909502596698,1.0,0.998294485503,0.99818099136,1.0,0.999047921295,0.998984771574,476.381496001
1270,1.05141613565e-35,0.00056850410381,0.000909503620786,1.0,0.998862990335,0.99818099136,1.0,0.999365482234,0.998984771574,481.136365536
1280,1.31807048125e-40,0.000568500831706,0.000909503606952,1.0,0.998862990335,0.99818099136,1.0,0.999365482234,0.998984771574,485.828151169
1290,1.40188206584e-35,0.000568501123747,0.000909503376394,1.0,0.998862990335,0.99818099136,1.0,0.999365482234,0.998984771574,490.44099827
1300,3.50476498293e-36,0.000568472116446,0.000909499695842,1.0,0.998862990335,0.99818099136,1.0,0.999365482234,0.998984771574,495.211547027
1310,3.50476572179e-36,0.000568443892323,0.000909497369827,1.0,0.998862990335,0.99818099136,1.0,0.999365482234,0.998984771574,499.903361893
1320,3.50476666284e-36,0.00056752065264,0.000909500525363,1.0,0.998862990335,0.99818099136,1.0,0.999365482234,0.998984771574,504.564152932
1330,7.00939374454e-36,0.00056162400635,0.000909499181695,1.0,0.998862990335,0.99818099136,1.0,0.999365482234,0.998984771574,509.410873996
1340,7.0093667739e-36,0.000503682133059,0.000909499553667,1.0,0.998862990335,0.99818099136,1.0,0.999365482234,0.998984771574,514.708965687
1350,3.50468807458e-36,0.000353016687358,0.000909493853123,1.0,0.999431495168,0.99818099136,1.0,0.999682841738,0.998984771574,519.332751269
1360,1.0514042853e-35,0.000561925580558,0.00113687594437,1.0,0.998862990335,0.9977262392,1.0,0.999365482234,0.998730642295,524.019688306
1370,1.05140435381e-35,0.000567123287957,0.00113687938261,1.0,0.998862990335,0.9977262392,1.0,0.999365482234,0.998730642295,528.785794591
1380,1.75234009419e-35,0.000567907668928,0.00113687970368,1.0,0.998862990335,0.9977262392,1.0,0.999365482234,0.998730642295,533.461473149
1390,7.00937137446e-36,0.00056818260859,0.00113688006979,1.0,0.998862990335,0.9977262392,1.0,0.999365482234,0.998730642295,538.105736375
1400,3.50469517273e-36,0.00056831186237,0.00113688013641,1.0,0.998862990335,0.9977262392,1.0,0.999365482234,0.998730642295,543.029759229
1410,3.50470133302e-36,0.000753250023111,0.00113688033409,1.0,0.998294485503,0.9977262392,1.0,0.999047921295,0.998730642295,547.869774114
1420,5.66808276181e-41,0.000816210154853,0.00113688037956,1.0,0.998294485503,0.9977262392,1.0,0.999047921295,0.998730642295,552.975965605
1430,1.40187459129e-35,0.000760871014805,0.00113688039731,1.0,0.998294485503,0.9977262392,1.0,0.999047921295,0.998730642295,557.595745255
1440,2.01349964083e-41,0.000743657535341,0.00113688039948,1.0,0.998294485503,0.9977262392,1.0,0.999047921295,0.998730642295,562.281928908
1450,3.50469421604e-36,0.000779894544912,0.00113688039967,1.0,0.998294485503,0.9977262392,1.0,0.999047921295,0.998730642295,567.006061824
1460,1.05140467348e-35,0.0007976128857,0.00113688039904,1.0,0.998294485503,0.9977262392,1.0,0.999047921295,0.998730642295,571.605967878
1470,3.50469359107e-36,0.000794652379762,0.00113688039833,1.0,0.998294485503,0.9977262392,1.0,0.999047921295,0.998730642295,576.344933793
1480,2.10280796418e-35,0.000783347974986,0.00113688039818,1.0,0.998294485503,0.9977262392,1.0,0.999047921295,0.998730642295,581.060122902
1490,3.50468975493e-36,0.00079917063444,0.00113688039828,1.0,0.998294485503,0.9977262392,1.0,0.999047921295,0.998730642295,585.657922486
1500,3.50468790758e-36,0.000774506056611,0.0011368803984,1.0,0.998294485503,0.9977262392,1.0,0.999047921295,0.998730642295,590.273382923
1510,7.0093651141e-36,0.000758854719418,0.00113688039843,1.0,0.998294485503,0.9977262392,1.0,0.999047921295,0.998730642295,595.035252959
1520,3.50468719021e-36,0.000798769425486,0.00113688039843,1.0,0.998294485503,0.9977262392,1.0,0.999047921295,0.998730642295,599.80757199
1530,9.3743904133e-42,0.000817942036749,0.00113688040024,1.0,0.998294485503,0.9977262392,1.0,0.999047921295,0.998730642295,604.441887948
1540,1.05140424442e-35,0.000831838874957,0.00113688040595,1.0,0.998294485503,0.9977262392,1.0,0.999047921295,0.998730642295,609.036414837
1550,8.95337435656e-42,0.000837366327403,0.0011368804069,1.0,0.998294485503,0.9977262392,1.0,0.999047921295,0.998730642295,613.616568185
1560,7.00936398441e-36,0.000836627415971,0.00113688041335,1.0,0.998294485503,0.9977262392,1.0,0.999047921295,0.998730642295,618.302131197
1570,3.50468535265e-36,0.000840428734285,0.00113688046908,1.0,0.998294485503,0.9977262392,1.0,0.999047921295,0.998730642295,622.958674532
1580,1.40187173114e-35,0.000845238197809,0.00113688125017,1.0,0.998294485503,0.9977262392,1.0,0.999047921295,0.998730642295,627.700334381
1590,7.00936099764e-36,0.000847110097399,0.00113688534731,1.0,0.998294485503,0.9977262392,1.0,0.999047921295,0.998730642295,632.899498195
1600,1.29673081889e-34,0.000844213652203,0.00113688366875,1.0,0.998294485503,0.9977262392,1.0,0.999047921295,0.998730642295,637.713194443
1610,4.68457221212e-42,0.000820802659322,0.00113688471574,1.0,0.998294485503,0.9977262392,1.0,0.999047921295,0.998730642295,642.307946121
1620,3.42354409674e-42,0.000776027210774,0.00113690289161,1.0,0.998294485503,0.9977262392,1.0,0.999047921295,0.998730642295,646.987583991
1630,7.00935712e-36,0.000698458656335,0.00113694540722,1.0,0.998294485503,0.9977262392,1.0,0.999047921295,0.998730642295,651.635891069
1640,1.08028075362e-42,0.000575673047467,0.00113687965018,1.0,0.998862990335,0.9977262392,1.0,0.999365482234,0.998730642295,656.212074437
1650,7.00935623845e-36,0.000569634656222,0.0011367168973,1.0,0.998862990335,0.9977262392,1.0,0.999365482234,0.998730642295,660.776049203
1660,5.74392354579e-43,0.000566512014934,0.00112516465703,1.0,0.998862990335,0.9977262392,1.0,0.999365482234,0.998730642295,665.912764372
1670,7.00935596239e-36,0.000577323697566,0.00126454431963,1.0,0.998862990335,0.99727148704,1.0,0.999365482234,0.998476383951,670.788593607
1680,3.50467811828e-36,0.00057398791211,0.00114719521246,1.0,0.998862990335,0.9977262392,1.0,0.999365482234,0.998730642295,675.65494649
1690,1.75233890406e-35,0.000564824187934,0.00113689872967,1.0,0.998862990335,0.9977262392,1.0,0.999365482234,0.998730642295,680.465981995
1700,4.20449916203e-28,0.000350064176367,0.00115665561879,1.0,0.999431495168,0.9977262392,1.0,0.999682841738,0.998730642295,685.499571355
1710,2.72530295587e-43,0.000289804070399,0.00116801418094,1.0,0.999431495168,0.9977262392,1.0,0.999682841738,0.998730642295,690.053251595
1720,8.79674115084e-33,0.000331690958468,0.0011058671671,1.0,0.999431495168,0.9977262392,1.0,0.999682841738,0.998730642295,694.547401122
1730,3.5046779871e-36,0.000437744911021,0.00110265920321,1.0,0.998862990335,0.9977262392,1.0,0.999365884591,0.998730642295,698.870800884
1740,7.00935573552e-36,0.00045000998909,0.00110263082077,1.0,0.998862990335,0.9977262392,1.0,0.999365884591,0.998730642295,703.33142742
1750,2.35571843685e-43,0.000464082711262,0.0010847437063,1.0,0.998862990335,0.9977262392,1.0,0.999365884591,0.998730642295,707.554496435
1760,3.50467794606e-36,0.000500431674851,0.00123408033369,1.0,0.998862990335,0.99727148704,1.0,0.999365884591,0.998476383951,711.774955671
1770,7.00935566764e-36,0.00047975748044,0.00123316106623,1.0,0.998862990335,0.99727148704,1.0,0.999365884591,0.998476383951,715.930498708
1780,3.50467791659e-36,0.000507341119622,0.00123537509397,1.0,0.998862990335,0.99727148704,1.0,0.999365884591,0.998476383951,720.286614742
1790,3.50467791041e-36,0.000519704748574,0.00129695574307,1.0,0.998862990335,0.99727148704,1.0,0.999365884591,0.998476383951,724.489148829
1800,1.05140334014e-35,0.000545256546516,0.00131195863639,1.0,0.998862990335,0.99727148704,1.0,0.999365884591,0.998476383951,728.763353095
1810,1.40187111243e-35,0.000561595101099,0.00135607106385,1.0,0.998862990335,0.99727148704,1.0,0.999365884591,0.998476383951,732.943618325
1820,3.85580244821e-35,0.000553904683991,0.00134561951903,1.0,0.998862990335,0.99727148704,1.0,0.999365884591,0.998476383951,737.199825542
1830,7.0093556642e-36,0.000551278487567,0.00113662379293,1.0,0.998862990335,0.9977262392,1.0,0.999365884591,0.998730642295,741.486764633
1840,6.53588573125e-44,0.000559310247481,0.00113663286924,1.0,0.998862990335,0.9977262392,1.0,0.999365884591,0.998730642295,745.537402896
1850,5.44491872232e-44,0.000559903468908,0.00113666030489,1.0,0.998862990335,0.9977262392,1.0,0.999365884591,0.998730642295,749.699976061
1860,2.14163357246e-29,0.000558850470638,0.00113667118513,1.0,0.998862990335,0.9977262392,1.0,0.999365884591,0.998730642295,753.884510332
1870,3.50467779848e-36,0.000557966768037,0.00113669460827,1.0,0.998862990335,0.9977262392,1.0,0.999365884591,0.998730642295,758.166742656
1880,1.05140332924e-35,0.000559233358363,0.00113671513194,1.0,0.998862990335,0.9977262392,1.0,0.999365884591,0.998730642295,762.325053497
1890,7.00935553797e-36,0.000563199214571,0.00113671837572,1.0,0.998862990335,0.9977262392,1.0,0.999365884591,0.998730642295,766.578825153
1900,3.50467778243e-36,0.000567467793753,0.00113670078243,1.0,0.998862990335,0.9977262392,1.0,0.999365884591,0.998730642295,770.78146235
1910,1.05140332776e-35,0.000568265636004,0.00113630533026,1.0,0.998862990335,0.9977262392,1.0,0.999365884591,0.998730642295,775.069024849
1920,2.77384437313e-44,0.00056850372109,0.0011361271557,1.0,0.998862990335,0.9977262392,1.0,0.999365884591,0.998730642295,779.207353057
1930,3.50467777569e-36,0.000568504486424,0.00113613942869,1.0,0.998862990335,0.9977262392,1.0,0.999365884591,0.998730642295,783.452613102
1940,3.50467777553e-36,0.000568504603637,0.00113564267853,1.0,0.998862990335,0.9977262392,1.0,0.999365884591,0.998730642295,787.652656717
1950,7.00935552476e-36,0.000568504711132,0.00113584905052,1.0,0.998862990335,0.9977262392,1.0,0.999365884591,0.998730642295,791.960080171
1960,1.05140332736e-35,0.000568504743105,0.00113659267454,1.0,0.998862990335,0.9977262392,1.0,0.999365884591,0.998730642295,796.334836021
1970,7.0093555244e-36,0.000568504705052,0.00113698530624,1.0,0.998862990335,0.9977262392,1.0,0.999365884591,0.998730642295,800.535515291
1980,5.60748440146e-35,0.000568475605057,0.00115442891378,1.0,0.998862990335,0.9977262392,1.0,0.999365884591,0.998730642295,804.800335254
1990,2.1028066522e-35,0.000560767152251,0.00134806002151,1.0,0.998862990335,0.99727148704,1.0,0.999365884591,0.998476383951,808.96465736
2000,3.5046777756e-36,0.000308887591452,0.0013545760202,1.0,0.999431495168,0.99727148704,1.0,0.999682841738,0.998476383951,813.13008722
2010,2.57897441815e-44,0.000508601550683,0.00141519166356,1.0,0.998862990335,0.996816734879,1.0,0.999365482234,0.998221996444,817.394145107
2020,3.50467777394e-36,0.000423053283949,0.00133734590455,1.0,0.998862990335,0.99727148704,1.0,0.999365884591,0.998476383951,821.608575697
2030,7.00935552149e-36,0.000465016427158,0.00151948121975,1.0,0.998862990335,0.996816734879,1.0,0.999365884591,0.998221996444,825.881725544
2040,1.05140332714e-35,0.000284252418255,0.00148409967927,1.0,0.999431495168,0.996816734879,1.0,0.999682841738,0.998221996444,829.973890355
2050,3.50467777374e-36,0.000284259039698,0.00140639170379,1.0,0.999431495168,0.99727148704,1.0,0.999682841738,0.998476383951,834.330693402
2060,3.50467777359e-36,0.000284252419016,0.00124809603022,1.0,0.999431495168,0.99727148704,1.0,0.999682841738,0.998476383951,838.624409783
2070,2.40696934979e-44,0.000284272949918,0.00109617248742,1.0,0.999431495168,0.9977262392,1.0,0.999682841738,0.998730642295,842.837453704
2080,4.22653721628e-45,0.000371559614608,0.00115478671516,1.0,0.998862990335,0.9977262392,1.0,0.999365482234,0.998730642295,846.981415894
2090,2.10280664954e-35,0.000882266707636,0.00122050687539,1.0,0.998294485503,0.99727148704,1.0,0.999047921295,0.998476383951,851.13441473
2100,1.05140332477e-35,0.00113700967759,0.0012271835659,1.0,0.997725980671,0.99727148704,1.0,0.99873015873,0.998476383951,855.243920398
2110,3.50467774924e-36,0.00113700967945,0.00122430318287,1.0,0.997725980671,0.99727148704,1.0,0.99873015873,0.998476383951,859.251171367
2120,3.15420997432e-35,0.00113700968575,0.00120851446428,1.0,0.997725980671,0.99727148704,1.0,0.99873015873,0.998476383951,863.370546079
2130,3.79349825809e-31,0.00113700968911,0.00120603576203,1.0,0.997725980671,0.99727148704,1.0,0.99873015873,0.998476383951,867.745640894
2140,7.69104334808e-44,0.00113700967517,0.0012238468182,1.0,0.997725980671,0.99727148704,1.0,0.99873015873,0.998476383951,871.827605206
2150,3.50467774927e-36,0.00113700966883,0.00105612494605,1.0,0.997725980671,0.9977262392,1.0,0.99873015873,0.998730642295,875.905736626
2160,9.07711537122e-34,0.000823631559883,0.00123954964355,1.0,0.998294485503,0.99727148704,1.0,0.999047921295,0.998476383951,880.166979301
2170,9.42758314546e-32,0.000572474223977,0.00124764301491,1.0,0.998862990335,0.99727148704,1.0,0.999365482234,0.998476383951,884.361634663
2180,3.50467774925e-36,0.000566593034308,0.00124814833151,1.0,0.998862990335,0.99727148704,1.0,0.999365482234,0.998476383951,888.61941541
2190,4.9108505692e-49,0.000565141866717,0.00127198488909,1.0,0.998862990335,0.99727148704,1.0,0.999365482234,0.998476383951,892.857441869
2200,9.50269409422e-50,0.000568504731038,0.0012687833453,1.0,0.998862990335,0.99727148704,1.0,0.999365482234,0.998476383951,897.159025517
2210,7.00935549848e-36,0.000568505233994,0.00131460392999,1.0,0.998862990335,0.99727148704,1.0,0.999365482234,0.998476383951,901.374809587
2220,2.10280664954e-35,0.000568504925134,0.00153295713383,1.0,0.998862990335,0.996816734879,1.0,0.999365482234,0.998221996444,905.520687429
2230,3.50467774924e-36,0.000568505031469,0.00156046960328,1.0,0.998862990335,0.996816734879,1.0,0.999365482234,0.998221996444,909.762580362
2240,1.05140332477e-35,0.000568869355084,0.00157248365339,1.0,0.998862990335,0.996816734879,1.0,0.999365482234,0.998221996444,913.969230598
2250,1.3030660106e-50,0.000852698998658,0.00157268860028,1.0,0.998294485503,0.996816734879,1.0,0.999047921295,0.998221996444,918.052376145
2260,7.00935549848e-36,0.000852751455802,0.00156808240307,1.0,0.998294485503,0.996816734879,1.0,0.999047921295,0.998221996444,922.195642627
2270,5.51111222669e-51,0.000852756742137,0.001550694634,1.0,0.998294485503,0.996816734879,1.0,0.999047921295,0.998221996444,926.579461201
2280,1.75233887462e-35,0.000852754567561,0.00152615747703,1.0,0.998294485503,0.996816734879,1.0,0.999047921295,0.998221996444,931.069500898
2290,7.00935549848e-36,0.000852752636614,0.00151534758945,1.0,0.998294485503,0.996816734879,1.0,0.999047921295,0.998221996444,934.906789461
2300,1.05140332477e-35,0.000852739673126,0.0015290485516,1.0,0.998294485503,0.996816734879,1.0,0.999047921295,0.998221996444,938.844051633
2310,3.50467774924e-36,0.000852662043132,0.00153833508272,1.0,0.998294485503,0.996816734879,1.0,0.999047921295,0.998221996444,942.872860744
2320,3.50467774924e-36,0.000851440574706,0.00154398905881,1.0,0.998294485503,0.996816734879,1.0,0.999047921295,0.998221996444,946.62809176
2330,3.50467774924e-36,0.000850770903045,0.001545784971,1.0,0.998294485503,0.996816734879,1.0,0.999047921295,0.998221996444,950.506215121
2340,3.50467774924e-36,0.000847673162644,0.00154620977413,1.0,0.998294485503,0.996816734879,1.0,0.999047921295,0.998221996444,954.467127683
2350,3.50467774924e-36,0.000835576610652,0.00154649176209,1.0,0.998294485503,0.996816734879,1.0,0.999047921295,0.998221996444,958.305972789
2360,7.00935549848e-36,0.000578329371282,0.00154401747098,1.0,0.998862990335,0.996816734879,1.0,0.999365482234,0.998221996444,962.102430506
2370,3.50467774924e-35,0.000584883026566,0.00154144237565,1.0,0.998862990335,0.996816734879,1.0,0.999365482234,0.998221996444,966.122937781
2380,3.50467774924e-36,0.000621246040563,0.00154137852089,1.0,0.998862990335,0.996816734879,1.0,0.999365482234,0.998221996444,970.154907385
2390,1.05140332477e-35,0.000795687167054,0.00153593988757,1.0,0.998294485503,0.996816734879,1.0,0.999047921295,0.998221996444,973.924909378
2400,1.02855307429e-29,0.000776474558314,0.00148957213105,1.0,0.998294485503,0.996816734879,1.0,0.999047921295,0.998221996444,977.80638721
2410,7.32359793099e-36,0.000675575330502,0.00161076287099,1.0,0.998294485503,0.996361982719,1.0,0.999047921295,0.997967479675,981.699268115
2420,7.00935549997e-36,0.000608191099866,0.00172846262208,1.0,0.998862990335,0.996361982719,1.0,0.999365482234,0.997967479675,985.499457192
2430,3.83910731513e-52,0.000581589949552,0.0017517361384,1.0,0.998862990335,0.996361982719,1.0,0.999365482234,0.997967479675,989.437006577
2440,3.50467774924e-36,0.000852757248433,0.00148419125907,1.0,0.998294485503,0.996816734879,1.0,0.999047921295,0.998221996444,993.437562428
2450,7.00935549848e-36,0.000852757248437,0.00114235140899,1.0,0.998294485503,0.9977262392,1.0,0.999047921295,0.998730642295,997.376761195
2460,1.4018710997e-35,0.000852757248437,0.00115810606921,1.0,0.998294485503,0.9977262392,1.0,0.999047921295,0.998730642295,1000.74005708
2470,6.00438333395e-53,0.000730661841133,0.00135326309565,1.0,0.998294485503,0.99727148704,1.0,0.999047921295,0.998476383951,1003.87570163
2480,4.08390766017e-53,0.000576790931036,0.0013635788722,1.0,0.998862990335,0.99727148704,1.0,0.999365482234,0.998476383951,1006.85940374
2490,2.02930573635e-53,0.000847430692365,0.00136419630976,1.0,0.998294485503,0.99727148704,1.0,0.999047921295,0.998476383951,1009.84012313
2500,4.43278702169e-23,0.000851884421348,0.00136425022639,1.0,0.998294485503,0.99727148704,1.0,0.999047921295,0.998476383951,1012.82406505
2510,1.29176122858e-53,0.000850244186623,0.00136425266655,1.0,0.998294485503,0.99727148704,1.0,0.999047921295,0.998476383951,1015.82805596
2520,2.27804053701e-34,0.000836463542314,0.00136425504834,1.0,0.998294485503,0.99727148704,1.0,0.999047921295,0.998476383951,1018.76783863
2530,8.23948198709e-54,0.000802233200669,0.00136425719999,1.0,0.998294485503,0.99727148704,1.0,0.999047921295,0.998476383951,1021.71955178
2540,3.50467774924e-36,0.000633303795086,0.00136456785193,1.0,0.998862990335,0.99727148704,1.0,0.999365482234,0.998476383951,1024.73889164
2550,3.78034473859e-54,0.000568801990757,0.00151876041832,1.0,0.998862990335,0.996816734879,1.0,0.999365482234,0.998221996444,1027.92373248
2560,1.90910674741e-54,0.000569273415341,0.0015914926505,1.0,0.998862990335,0.996816734879,1.0,0.999365482234,0.998221996444,1031.01717137
2570,7.66617123097e-55,0.000572023148843,0.00159154781189,1.0,0.998862990335,0.996816734879,1.0,0.999365482234,0.998221996444,1034.17863836
2580,1.11616924359e-55,0.000814346435597,0.00159157767509,1.0,0.998294485503,0.996816734879,1.0,0.999047921295,0.998221996444,1037.23978923
2590,1.4018710997e-35,0.000695356721136,0.00159157964734,1.0,0.998294485503,0.996816734879,1.0,0.999047921295,0.998221996444,1040.28571322
2600,3.50467774924e-36,0.000841064287048,0.00159163241221,1.0,0.998294485503,0.996816734879,1.0,0.999047921295,0.998221996444,1043.25944949
2610,3.30962910421e-60,0.000577590445894,0.00159163256022,1.0,0.998862990335,0.996816734879,1.0,0.999365482234,0.998221996444,1046.32686525
2620,4.0534892567e-30,0.000583532184154,0.00159163256025,1.0,0.998862990335,0.996816734879,1.0,0.999365482234,0.998221996444,1049.41019924
2630,7.00935549848e-36,0.00064700782849,0.00136425648021,1.0,0.998862990335,0.99727148704,1.0,0.999365482234,0.998476383951,1052.4270751
2640,2.45327442447e-35,0.000718521985436,0.00136425648018,1.0,0.998294485503,0.99727148704,1.0,0.999047921295,0.998476383951,1055.54538236
2650,3.50467774924e-36,0.000859345738958,0.00136425647721,1.0,0.998294485503,0.99727148704,1.0,0.999047921295,0.998476383951,1058.68757585
2660,2.0059695619e-64,0.000856889427387,0.00136425646028,1.0,0.998294485503,0.99727148704,1.0,0.999047921295,0.998476383951,1061.67548775
2670,3.50467774924e-36,0.000675037169474,0.00136425648022,1.0,0.998294485503,0.99727148704,1.0,0.999047921295,0.998476383951,1064.87805897
2680,4.01398602109e-65,0.000575630451956,0.00136425648022,1.0,0.998862990335,0.99727148704,1.0,0.999365079365,0.998476383951,1067.88661404
2690,2.10280664954e-35,0.000568509107326,0.00136425648245,1.0,0.998862990335,0.99727148704,1.0,0.999365079365,0.998476383951,1070.97136828
2700,1.08353367621e-65,0.000568506217518,0.00136425649014,1.0,0.998862990335,0.99727148704,1.0,0.999365079365,0.998476383951,1074.05737565
2710,3.50467774924e-36,0.000568505191061,0.00136425648992,1.0,0.998862990335,0.99727148704,1.0,0.999365079365,0.998476383951,1077.22077884
2720,7.00935549848e-36,0.000568504970852,0.00136425648117,1.0,0.998862990335,0.99727148704,1.0,0.999365079365,0.998476383951,1080.31426079
2730,3.50467774924e-36,0.000568504887805,0.00136425647924,1.0,0.998862990335,0.99727148704,1.0,0.999365079365,0.998476383951,1083.32515028
2740,2.16609899237e-67,0.000568504847703,0.00136425647894,1.0,0.998862990335,0.99727148704,1.0,0.999365079365,0.998476383951,1086.54787915
2750,1.4018710997e-35,0.000568504836051,0.00136425647846,1.0,0.998862990335,0.99727148704,1.0,0.999365079365,0.998476383951,1089.683643
2760,7.00935549848e-36,0.000568504857024,0.0013642563995,1.0,0.998862990335,0.99727148704,1.0,0.999365079365,0.998476383951,1092.69016903
2770,7.00935549848e-36,0.000568505383593,0.00136425650518,1.0,0.998862990335,0.99727148704,1.0,0.999365079365,0.998476383951,1095.85844848
2780,1.13551559075e-33,0.000568506199415,0.00134457743389,1.0,0.998862990335,0.99727148704,1.0,0.999365079365,0.998476383951,1099.082325
2790,1.05140332477e-35,0.000568516171115,0.000909567204704,1.0,0.998862990335,0.99818099136,1.0,0.999365079365,0.998984255967,1102.14975379
2800,7.00935549848e-36,0.00057024057183,0.00112086737734,1.0,0.998862990335,0.9977262392,1.0,0.999365079365,0.99872999746,1105.09558209
2810,1.4018710997e-35,0.000788484899176,0.0010959390197,1.0,0.998294485503,0.9977262392,1.0,0.999047316608,0.99872999746,1107.98979435
2820,8.69015609483e-12,0.000833866741512,0.00114934091087,1.0,0.998294485503,0.9977262392,1.0,0.999047316608,0.99872935197,1111.08517577
2830,0.000283875918215,0.000850933851948,0.00164065098227,0.999431333523,0.998294485503,0.996816734879,0.999682590065,0.999047316608,0.998220188152,1114.15163547
2840,0.000305160688896,0.00111596993212,0.000976799498065,0.999289166904,0.997725980671,0.9977262392,0.999603332011,0.99872935197,0.99872935197,1117.24884602
2850,0.000115983019252,0.00113690493455,0.00112766651128,0.999715666761,0.997725980671,0.9977262392,0.999841345391,0.99872935197,0.99872935197,1120.26858884
2860,1.80447733684e-23,0.000993955425142,0.000918609178712,1.0,0.997725980671,0.99818099136,1.0,0.99872935197,0.998983739837,1123.39879023
2870,4.21653433124e-20,0.000852783089183,0.00113671477222,1.0,0.998294485503,0.9977262392,1.0,0.999047316608,0.99872935197,1126.43892814
2880,9.61798645842e-09,0.000911771577041,0.00113662081425,1.0,0.998294485503,0.9977262392,1.0,0.999047316608,0.99872935197,1129.4555804
2890,9.12911492203e-22,0.000852757248436,0.00090950431091,1.0,0.998294485503,0.99818099136,1.0,0.999047316608,0.998983739837,1132.54431765
2900,2.79243111823e-62,0.000852757248435,0.000909504202975,1.0,0.998294485503,0.99818099136,1.0,0.999047316608,0.998983739837,1135.70466267
2910,3.50467774924e-36,0.000852757248427,0.000909505287588,1.0,0.998294485503,0.99818099136,1.0,0.999047316608,0.998983739837,1138.72074999
2920,1.04530766798e-65,0.000852757248426,0.00113688003338,1.0,0.998294485503,0.9977262392,1.0,0.999047316608,0.99872935197,1141.76124661
2930,3.50467774924e-36,0.000852757248428,0.00113687970013,1.0,0.998294485503,0.9977262392,1.0,0.999047316608,0.99872935197,1144.69817614
2940,3.50467774924e-36,0.000852757248432,0.00109049758045,1.0,0.998294485503,0.9977262392,1.0,0.999047316608,0.99872935197,1147.73456847
2950,3.50467774924e-36,0.000852757248437,0.00113684762322,1.0,0.998294485503,0.9977262392,1.0,0.999047316608,0.99872935197,1150.75323199
2960,1.75233887462e-35,0.000852757248436,0.00113697264232,1.0,0.998294485503,0.9977262392,1.0,0.999047316608,0.99872935197,1153.74817361
2970,3.35344337155e-24,0.000852757248436,0.000985706444581,1.0,0.998294485503,0.9977262392,1.0,0.999047316608,0.99872999746,1156.704588
2980,8.7616943731e-35,0.000852757259872,0.000682127970678,1.0,0.998294485503,0.99863574352,1.0,0.999047316608,0.999237998476,1159.8308119
2990,6.38654909166e-86,0.000854561909318,0.000682128239972,1.0,0.998294485503,0.99863574352,1.0,0.999047316608,0.999237998476,1162.87885855
3000,3.50467774924e-36,0.000979646862059,0.00068212824007,1.0,0.997725980671,0.99863574352,1.0,0.99872935197,0.999237998476,1165.96215462
3010,1.00264663695e-88,0.001146643561,0.000682128240076,1.0,0.997725980671,0.99863574352,1.0,0.99872935197,0.999237998476,1169.00745204
3020,1.75233887462e-35,0.000907050497872,0.00068212823996,1.0,0.998294485503,0.99863574352,1.0,0.999047316608,0.999237998476,1172.02940603
3030,7.00935549848e-36,0.000900103384446,0.00068212824001,1.0,0.998294485503,0.99863574352,1.0,0.999047316608,0.999237998476,1175.03780781
3040,3.50467774924e-36,0.00090770718293,0.000682128240043,1.0,0.998294485503,0.99863574352,1.0,0.999047316608,0.999237998476,1178.11261953
3050,5.49890652466e-93,0.00100929432439,0.000682128240101,1.0,0.997725980671,0.99863574352,1.0,0.99872935197,0.999237998476,1181.14104345
3060,1.81530104473e-94,0.00140536847909,0.000682128240109,1.0,0.997157475839,0.99863574352,1.0,0.998411185256,0.999237998476,1184.20102098
3070,3.50467774924e-36,0.00142104161897,0.000909504320146,1.0,0.997157475839,0.99818099136,1.0,0.998411185256,0.998983739837,1187.23339355
3080,3.50467774924e-36,0.00142063844872,0.000909504320146,1.0,0.997157475839,0.99818099136,1.0,0.998411185256,0.998983739837,1190.35682041
3090,4.09697166972e-97,0.00113900336343,0.000909504320146,1.0,0.997725980671,0.99818099136,1.0,0.99872935197,0.998983739837,1193.47317487
3100,7.00935549848e-36,0.00125032698708,0.000909504320146,1.0,0.997157475839,0.99818099136,1.0,0.998411185256,0.998983739837,1196.513679
3110,3.50467774924e-36,0.00137647412364,0.000909526512902,1.0,0.997157475839,0.99818099136,1.0,0.998411185256,0.998983739837,1199.47058247
3120,7.73170471842e-101,0.00136011784505,0.000909506074905,1.0,0.997157475839,0.99818099136,1.0,0.998411185256,0.998983739837,1202.42795014
3130,3.23994555751e-103,0.00119238486036,0.00113965069397,1.0,0.997725980671,0.9977262392,1.0,0.99872935197,0.99872999746,1205.44668596
3140,3.50467774924e-36,0.00113705735258,0.00133491985401,1.0,0.997725980671,0.99727148704,1.0,0.99872935197,0.998475609756,1208.48479049
3150,3.50467774924e-36,0.00114702289178,0.00136429080877,1.0,0.997725980671,0.99727148704,1.0,0.99872935197,0.998475609756,1211.63152048
3160,1.4018710997e-35,0.00141102651088,0.00136414359205,1.0,0.997157475839,0.99727148704,1.0,0.998411185256,0.998474834774,1214.58710602
3170,5.60748439878e-35,0.0011369439226,0.00136402003922,1.0,0.997725980671,0.99727148704,1.0,0.99872935197,0.998474834774,1217.62478665
3180,1.117712805e-111,0.00113177007651,0.00136110494966,1.0,0.997725980671,0.99727148704,1.0,0.99872935197,0.998474834774,1220.79628742
3190,3.50467774924e-36,0.00112053646992,0.00134341107697,1.0,0.997725980671,0.99727148704,1.0,0.99872935197,0.998474834774,1223.8851349
3200,1.71024480161e-115,0.00115888992701,0.00114831813567,1.0,0.997725980671,0.9977262392,1.0,0.99872935197,0.99872935197,1226.89946261
3210,1.52603411923e-116,0.00114203751873,0.00113427867697,1.0,0.997725980671,0.9977262392,1.0,0.99872935197,0.99872935197,1230.04652683
3220,2.8663325169e-118,0.00105076046164,0.000944495475431,1.0,0.997725980671,0.99818099136,1.0,0.99872935197,0.998983739837,1233.34047788
3230,1.02905522073e-119,0.00118651294765,0.000894905543955,1.0,0.997725980671,0.99818099136,1.0,0.99873015873,0.998983739837,1236.42113098
3240,3.8370143157e-122,0.00129398775738,0.000658812967323,1.0,0.997157475839,0.99863574352,1.0,0.998412194347,0.999237998476,1239.41944011
3250,1.01299205664e-31,0.00113717611726,0.000627983673664,1.0,0.997725980671,0.99863574352,1.0,0.99872935197,0.999237998476,1242.47951166
3260,3.50467774924e-36,0.00113380538037,0.000681470526724,1.0,0.997725980671,0.99863574352,1.0,0.99872935197,0.999237998476,1245.4225449
3270,7.41802697861e-125,0.00113878583009,0.000681479789549,1.0,0.997725980671,0.99863574352,1.0,0.99872935197,0.999237998476,1248.38157736
3280,3.50467774924e-36,0.00113979542429,0.000679135450959,1.0,0.997725980671,0.99863574352,1.0,0.99872935197,0.999237998476,1251.4046399
3290,7.00935549848e-36,0.00142120219629,0.000679081412807,1.0,0.997157475839,0.99863574352,1.0,0.998411185256,0.999237998476,1254.30116565
3300,1.79932626993e-16,0.00142126208091,0.000668142061017,1.0,0.997157475839,0.99863574352,1.0,0.998411185256,0.999237998476,1257.51172502
3310,2.36110139966e-32,0.00159686978491,0.000653191887395,1.0,0.996588971006,0.99863574352,1.0,0.998092816275,0.999237998476,1261.34658237
3320,7.00935549848e-36,0.00169669247479,0.000728990645447,1.0,0.996588971006,0.99863574352,1.0,0.998092816275,0.999237998476,1265.32836527
3330,1.01884805186e-59,0.00176756125777,0.00107715143831,1.0,0.996020466174,0.9977262392,1.0,0.997774244833,0.99872935197,1269.97044736
3340,5.89406046789e-65,0.00196261282901,0.00119966797565,1.0,0.996020466174,0.99727148704,1.0,0.997774244833,0.998474834774,1274.54332919
3350,1.75233887462e-35,0.00175264023187,0.00135015401365,1.0,0.996588971006,0.99727148704,1.0,0.998092816275,0.998474834774,1278.84645911
3360,3.50467774924e-36,0.0017500757578,0.00125563795265,1.0,0.996588971006,0.99727148704,1.0,0.998092816275,0.998474834774,1283.06376259
3370,7.00935549848e-36,0.00115892403958,0.000666026375765,1.0,0.997725980671,0.99863574352,1.0,0.99872935197,0.999237998476,1287.1646243
3380,3.50467774924e-36,0.00113708367422,0.000520576730616,1.0,0.997725980671,0.99863574352,1.0,0.99872935197,0.999237998476,1291.39212157
3390,7.95561849078e-34,0.0011370129927,0.000457623493383,1.0,0.997725980671,0.99909049568,1.0,0.99872935197,0.999492127984,1295.5204468
3400,3.50467774924e-36,0.00124640779216,0.000706432178397,1.0,0.997157475839,0.99863574352,1.0,0.998411185256,0.999237998476,1299.66795823
3410,3.50467774924e-36,0.00127538470857,0.000867097391953,1.0,0.997157475839,0.99818099136,1.0,0.998411185256,0.998983739837,1303.85768124
3420,2.13471851714e-133,0.00126595914795,0.00113681845353,1.0,0.997157475839,0.9977262392,1.0,0.998411185256,0.99872935197,1308.0544332
3430,1.86508807312e-134,0.00113752066954,0.00113681460865,1.0,0.997725980671,0.9977262392,1.0,0.99872935197,0.99872935197,1312.20273554
3440,8.67016051381e-138,0.00113700967367,0.00111446194977,1.0,0.997725980671,0.9977262392,1.0,0.99872935197,0.99872935197,1316.378198
3450,1.78946883659e-140,0.00113700966373,0.0012751444921,1.0,0.997725980671,0.99727148704,1.0,0.99872935197,0.998474834774,1320.44111479
3460,3.50467774924e-36,0.00113700966205,0.00150459425366,1.0,0.997725980671,0.996816734879,1.0,0.99872935197,0.998220188152,1324.5797069
3470,1.32658344598e-142,0.0011370096556,0.00136783460953,1.0,0.997725980671,0.99727148704,1.0,0.99872935197,0.998474834774,1328.76366635
3480,1.00820366169e-143,0.00113704927377,0.00124484284214,1.0,0.997725980671,0.99727148704,1.0,0.99872935197,0.998474834774,1332.83691836
3490,3.1983962373e-145,0.00115607468255,0.00140632991225,1.0,0.997725980671,0.996816734879,1.0,0.99872935197,0.998220188152,1337.02219258
3500,5.60748439878e-35,0.00138262162586,0.0013709485302,1.0,0.997157475839,0.99727148704,1.0,0.998411185256,0.998474834774,1341.25549765
3510,3.50467774924e-36,0.00141917292114,0.0013473665138,1.0,0.997157475839,0.99727148704,1.0,0.998411185256,0.998474834774,1345.42869443
3520,7.00935549848e-36,0.00142106626141,0.0011312553107,1.0,0.997157475839,0.9977262392,1.0,0.998411185256,0.99872935197,1349.55273917
3530,3.50467774924e-36,0.00142125663671,0.00103970996074,1.0,0.997157475839,0.9977262392,1.0,0.998411185256,0.99872935197,1353.71430532
3540,5.25140979588e-152,0.00142126122131,0.00088544623516,1.0,0.997157475839,0.99818099136,1.0,0.998411185256,0.998983739837,1357.78072868
3550,1.32629385901e-156,0.00142126081852,0.00113196918269,1.0,0.997157475839,0.9977262392,1.0,0.998411185256,0.99872935197,1361.93957049
3560,5.90514264335e-161,0.00142126203705,0.00113882789389,1.0,0.997157475839,0.9977262392,1.0,0.998411185256,0.99872935197,1366.08781791
3570,3.50467774924e-36,0.00142126208051,0.000863701521881,1.0,0.997157475839,0.99818099136,1.0,0.998411185256,0.998983739837,1370.35957437
3580,1.75233887462e-35,0.00142126208072,0.00105204647302,1.0,0.997157475839,0.9977262392,1.0,0.998411185256,0.99872935197,1374.52929974
3590,3.11029910361e-172,0.00142126208071,0.00069300071397,1.0,0.997157475839,0.99863574352,1.0,0.998411185256,0.999237998476,1378.66276869
3600,6.21183102986e-31,0.0014212620807,0.000729424111708,1.0,0.997157475839,0.99863574352,1.0,0.998411185256,0.999237998476,1382.73124756
3610,7.00935549848e-36,0.00142126208069,0.00113687208552,1.0,0.997157475839,0.9977262392,1.0,0.998411185256,0.99872935197,1386.84374661
3620,3.50467774924e-36,0.00142126208068,0.00113688035963,1.0,0.997157475839,0.9977262392,1.0,0.998411185256,0.99872935197,1391.01562388
3630,7.00935549848e-36,0.00142126208067,0.00113688039361,1.0,0.997157475839,0.9977262392,1.0,0.998411185256,0.99872935197,1395.14256877
3640,7.00935549848e-36,0.00142126208063,0.00113688768514,1.0,0.997157475839,0.9977262392,1.0,0.998411185256,0.99872935197,1399.35360894
3650,3.50467774924e-36,0.00142126208067,0.00126465710903,1.0,0.997157475839,0.99727148704,1.0,0.998411185256,0.998474834774,1403.74329695
3660,1.75233887462e-35,0.00142214829037,0.0013614492743,1.0,0.997157475839,0.99727148704,1.0,0.998411185256,0.998474834774,1408.43446155
3670,3.50467774924e-36,0.00143349337807,0.00137693426718,1.0,0.997157475839,0.996816734879,1.0,0.998411185256,0.998220188152,1412.73676776
3680,3.50467774924e-36,0.00142145608523,0.00136540932358,1.0,0.997157475839,0.996816734879,1.0,0.998411185256,0.998220188152,1417.00912669
3690,7.00935549848e-36,0.00142127032334,0.00151599879052,1.0,0.997157475839,0.996816734879,1.0,0.998411185256,0.998220188152,1421.27214083
3700,7.00935549848e-36,0.00142126295759,0.00154850840599,1.0,0.997157475839,0.996816734879,1.0,0.998411185256,0.998220188152,1425.60464558
3710,1.65404664091e-175,0.00142126202918,0.00158406478836,1.0,0.997157475839,0.996816734879,1.0,0.998411185256,0.998220188152,1430.40482281
3720,1.53329476153e-176,0.00142126207185,0.00157114828927,1.0,0.997157475839,0.996816734879,1.0,0.998411185256,0.998220188152,1434.68246412
3730,3.50467774924e-36,0.00142126194783,0.00131144165463,1.0,0.997157475839,0.99727148704,1.0,0.998411185256,0.998474834774,1438.76677747
3740,1.4018710997e-33,0.00113700960235,0.00153585407914,1.0,0.997725980671,0.996816734879,1.0,0.99872935197,0.998220188152,1443.1073885
3750,3.50467774924e-36,0.00113700965277,0.00155028481159,1.0,0.997725980671,0.996816734879,1.0,0.99872935197,0.998220188152,1447.44613089
3760,9.75673717344e-183,0.00113714611389,0.00157925060835,1.0,0.997725980671,0.996816734879,1.0,0.99872935197,0.998220188152,1451.70724636
3770,7.00935549848e-36,0.0014061153692,0.00159048551782,1.0,0.997157475839,0.996816734879,1.0,0.998411185256,0.998220188152,1455.77894142
3780,1.10716737515e-185,0.00137850189694,0.00159145369567,1.0,0.997157475839,0.996816734879,1.0,0.998411185256,0.998220188152,1459.72258464
3790,8.63598742301e-188,0.00114453163218,0.00159155882074,1.0,0.997725980671,0.996816734879,1.0,0.99872935197,0.998220188152,1463.64773224
3800,5.68879642724e-30,0.00113701055376,0.00159162105342,1.0,0.997725980671,0.996816734879,1.0,0.99872935197,0.998220188152,1467.75721617
3810,2.31264486646e-27,0.00113702449357,0.00159140472056,1.0,0.997725980671,0.996816734879,1.0,0.99872935197,0.998220188152,1471.8297784
3820,5.45457797128e-191,0.00113706285793,0.00157480903255,1.0,0.997725980671,0.996816734879,1.0,0.99872935197,0.998220188152,1475.96562997
3830,3.50467774924e-36,0.00132526025864,0.00136426925184,1.0,0.997157475839,0.99727148704,1.0,0.998411185256,0.998474834774,1480.25643158
3840,7.00935549848e-36,0.0013873082093,0.00136428365566,1.0,0.997157475839,0.99727148704,1.0,0.998411185256,0.998474834774,1484.44638847
3850,3.50467774924e-36,0.0014136575146,0.00136429560472,1.0,0.997157475839,0.99727148704,1.0,0.998411185256,0.998474834774,1488.64761016
3860,3.50467774924e-36,0.00142124814067,0.0013642576011,1.0,0.997157475839,0.99727148704,1.0,0.998411185256,0.998474834774,1492.7976887
3870,3.50467774924e-36,0.00142125972075,0.00136425371975,1.0,0.997157475839,0.99727148704,1.0,0.998411185256,0.998474834774,1496.88509854
3880,2.00367549552e-199,0.00142126143039,0.00174019006135,1.0,0.997157475839,0.996361982719,1.0,0.998411185256,0.997965412004,1500.89480245
3890,1.05140332477e-35,0.00142113341633,0.00159017386389,1.0,0.997157475839,0.996816734879,1.0,0.998411185256,0.998220188152,1504.87830703
3900,7.00935549848e-36,0.00141690823629,0.00136546846361,1.0,0.997157475839,0.99727148704,1.0,0.998411185256,0.998474834774,1508.9241125
3910,5.95795217371e-35,0.00139550913377,0.00136425678115,1.0,0.997157475839,0.99727148704,1.0,0.998411185256,0.998474834774,1512.8372905
3920,8.24931839271e-27,0.00137931858598,0.00136425754028,1.0,0.997157475839,0.99727148704,1.0,0.998411185256,0.998474834774,1516.78858014
3930,2.10280664954e-35,0.00125566659304,0.00136816532036,1.0,0.997157475839,0.99727148704,1.0,0.998411185256,0.998474834774,1520.72044142
3940,7.10833096359e-05,0.00132289581542,0.00157274823857,0.999857833381,0.997157475839,0.996816734879,0.999920666402,0.998411185256,0.998220188152,1524.99595492
3950,7.04792050116e-143,0.00138030345533,0.00136425603477,1.0,0.997157475839,0.99727148704,1.0,0.998411185256,0.998474834774,1529.06478184
3960,5.60748439878e-35,0.00141329635476,0.00136425728319,1.0,0.997157475839,0.99727148704,1.0,0.998411185256,0.998474834774,1533.14037025
3970,2.52793011854e-208,0.00133867707619,0.00136425815166,1.0,0.997157475839,0.99727148704,1.0,0.998411185256,0.998474834774,1537.29189432
3980,1.05140332477e-35,0.00129804347825,0.00136426110372,1.0,0.997157475839,0.99727148704,1.0,0.998411185256,0.998474834774,1541.42364593
3990,1.66396230778e-209,0.00114086536118,0.00136426691519,1.0,0.997725980671,0.99727148704,1.0,0.99872935197,0.998474834774,1545.59844903
4000,3.50467774924e-36,0.00113700972825,0.00136457492684,1.0,0.997725980671,0.99727148704,1.0,0.99872935197,0.998474834774,1549.8356107
4010,7.00935549848e-36,0.0011370096646,0.00140997272892,1.0,0.997725980671,0.99727148704,1.0,0.99872935197,0.998474834774,1554.00985873
4020,3.50467774924e-36,0.00113700966461,0.00145594752701,1.0,0.997725980671,0.996816734879,1.0,0.99872935197,0.998220188152,1558.02375188
4030,1.75233887462e-35,0.00113700966468,0.00138256041101,1.0,0.997725980671,0.99727148704,1.0,0.99872935197,0.998474834774,1562.04085056
4040,8.35566747329e-218,0.00113700966458,0.00136426045658,1.0,0.997725980671,0.99727148704,1.0,0.99872935197,0.998474834774,1566.21485366
4050,1.00652347126e-217,0.00113700966458,0.00136425657968,1.0,0.997725980671,0.99727148704,1.0,0.99872935197,0.998474834774,1570.26340955
4060,1.48408768685e-220,0.00113700966458,0.00136428286684,1.0,0.997725980671,0.99727148704,1.0,0.99872935197,0.998474834774,1574.48363728
4070,9.36848133922e-223,0.00113700966458,0.0014305115666,1.0,0.997725980671,0.996816734879,1.0,0.99872935197,0.998220188152,1578.58479805
4080,3.50467774924e-35,0.00113700966459,0.00149520894251,1.0,0.997725980671,0.996816734879,1.0,0.99872935197,0.998220188152,1582.76763395
4090,7.00935549848e-36,0.00113700967043,0.00149848524032,1.0,0.997725980671,0.996816734879,1.0,0.99872935197,0.998220188152,1586.92277837
4100,6.34739440478e-224,0.0011370121516,0.00155149439724,1.0,0.997725980671,0.996816734879,1.0,0.99872935197,0.998220188152,1591.11935532
4110,6.79363014329e-225,0.00113701174091,0.00178807823385,1.0,0.997725980671,0.996361982719,1.0,0.99872935197,0.997965412004,1595.21355193
4120,2.64852568076e-222,0.00131481475043,0.00159669145308,1.0,0.997157475839,0.996816734879,1.0,0.998411185256,0.998220188152,1599.36411087
4130,9.46262992295e-35,0.00117199352711,0.00161179078657,1.0,0.997725980671,0.996816734879,1.0,0.99872935197,0.998220188152,1603.51975543
4140,1.34465262194e-205,0.00114654625522,0.00159117836632,1.0,0.997725980671,0.996816734879,1.0,0.99872935197,0.998220188152,1607.65778853
4150,3.50467774924e-36,0.00113870544811,0.00158542848129,1.0,0.997725980671,0.996816734879,1.0,0.99872935197,0.998220188152,1611.92730776
4160,2.00156484139e-26,0.00134617020259,0.00113684308491,1.0,0.997157475839,0.9977262392,1.0,0.998411185256,0.99872935197,1616.35166009
4170,1.75233887462e-35,0.00113700966478,0.000917634485353,1.0,0.997725980671,0.99818099136,1.0,0.99872935197,0.998983739837,1620.45641119
4180,1.75251441898e-10,0.00113700966458,0.0011368804002,1.0,0.997725980671,0.9977262392,1.0,0.99872935197,0.99872935197,1624.4782032
4190,1.04700485144e-235,0.00113700966458,0.00113688077392,1.0,0.997725980671,0.9977262392,1.0,0.99872935197,0.99872935197,1628.54085412
4200,2.10280664954e-35,0.00113700966458,0.00114192584556,1.0,0.997725980671,0.9977262392,1.0,0.99872935197,0.99872935197,1632.69446965
4210,1.41134855936e-242,0.00113700966458,0.00113768724462,1.0,0.997725980671,0.9977262392,1.0,0.99872935197,0.99872935197,1636.78802745
4220,1.03632615903e-243,0.00113700966458,0.0011374635331,1.0,0.997725980671,0.9977262392,1.0,0.99872935197,0.99872935197,1641.0697296
4230,4.20685469133e-245,0.00113700966458,0.00113774048821,1.0,0.997725980671,0.9977262392,1.0,0.99872935197,0.99872935197,1645.19202303
4240,8.93433736351e-248,0.00113700966458,0.00113819552603,1.0,0.997725980671,0.9977262392,1.0,0.99872935197,0.99872935197,1649.24484797
4250,7.51711809793e-250,0.00113700966463,0.00117959835824,1.0,0.997725980671,0.9977262392,1.0,0.99872935197,0.99872935197,1653.41200662
4260,5.95795217371e-35,0.00113700966458,0.00136399800498,1.0,0.997725980671,0.99727148704,1.0,0.99872935197,0.998474834774,1657.3863501
4270,3.50467774924e-36,0.00113700966458,0.00136244170224,1.0,0.997725980671,0.99727148704,1.0,0.99872935197,0.998474834774,1661.4476744
4280,5.74878172359e-255,0.00113700966459,0.00136349563062,1.0,0.997725980671,0.99727148704,1.0,0.99872935197,0.998474834774,1665.53558597
4290,4.41681197682e-11,0.00113700966502,0.00136425209431,1.0,0.997725980671,0.99727148704,1.0,0.99872935197,0.998474834774,1669.62231868
4300,5.72355242489e-261,0.00113700986955,0.00136425841433,1.0,0.997725980671,0.99727148704,1.0,0.99872935197,0.998474834774,1673.64210418
4310,1.16240887185e-262,0.00113701047002,0.00136426285457,1.0,0.997725980671,0.99727148704,1.0,0.99872935197,0.998474834774,1678.03422617
4320,7.10832828598e-05,0.000875221798892,0.00136425649428,0.999857833381,0.998294485503,0.99727148704,0.999920666402,0.999047316608,0.998474834774,1682.09326069
4330,3.50467774924e-36,0.000852758427796,0.00136425649485,1.0,0.998294485503,0.99727148704,1.0,0.999047316608,0.998474834774,1686.02989392
4340,5.02935189421e-264,0.000852760344459,0.00136425648374,1.0,0.998294485503,0.99727148704,1.0,0.999047316608,0.998474834774,1690.04233798
4350,1.33732283407e-264,0.000852773894886,0.00136425648023,1.0,0.998294485503,0.99727148704,1.0,0.999047316608,0.998474834774,1694.13676255
4360,3.50467774924e-36,0.000853150330339,0.00136425648022,1.0,0.998294485503,0.99727148704,1.0,0.999047316608,0.998474834774,1698.16923665
4370,2.87487925709e-265,0.000859309973827,0.00136425648022,1.0,0.998294485503,0.99727148704,1.0,0.999047316608,0.998474834774,1702.72070612
4380,1.48072634905e-32,0.000893992383845,0.00136425648022,1.0,0.998294485503,0.99727148704,1.0,0.999047316608,0.998474834774,1706.70253129
4390,5.95795217371e-34,0.000955816116807,0.00136425648022,1.0,0.997725980671,0.99727148704,1.0,0.99872935197,0.998474834774,1710.88269894
4400,9.04206859304e-34,0.00103632162111,0.00136425648022,1.0,0.997725980671,0.99727148704,1.0,0.99872935197,0.998474834774,1714.89659525
4410,3.50467774924e-34,0.00109356058442,0.00136425648022,1.0,0.997725980671,0.99727148704,1.0,0.99872935197,0.998474834774,1719.00283335
4420,4.12925314796e-266,0.00110442474256,0.00136425648021,1.0,0.997725980671,0.99727148704,1.0,0.99872935197,0.998474834774,1723.20142551
4430,3.50467774924e-36,0.00112543338927,0.00136425648018,1.0,0.997725980671,0.99727148704,1.0,0.99872935197,0.998474834774,1727.42878292
4440,3.50467774924e-36,0.00113209685325,0.00136425648021,1.0,0.997725980671,0.99727148704,1.0,0.99872935197,0.998474834774,1731.59667441
4450,7.00935549848e-36,0.00102509113898,0.00136425648022,1.0,0.997725980671,0.99727148704,1.0,0.99872935197,0.998474834774,1735.63466081
4460,3.50467774924e-36,0.000952244807319,0.00136425648022,1.0,0.997725980671,0.99727148704,1.0,0.99872935197,0.998474834774,1739.69329395
4470,1.10803259414e-268,0.000873663946345,0.00136425648022,1.0,0.998294485503,0.99727148704,1.0,0.999047316608,0.998474834774,1743.87662644
4480,3.50467774924e-36,0.000856066718173,0.00136425648022,1.0,0.998294485503,0.99727148704,1.0,0.999047316608,0.998474834774,1747.94998709
4490,7.00935549848e-36,0.000852757250484,0.00136425648022,1.0,0.998294485503,0.99727148704,1.0,0.999047316608,0.998474834774,1752.13093577
4500,3.50467774924e-36,0.000852757248439,0.00136425648022,1.0,0.998294485503,0.99727148704,1.0,0.999047316608,0.998474834774,1756.21608428
4510,3.50467774924e-36,0.000852757248437,0.00136425648022,1.0,0.998294485503,0.99727148704,1.0,0.999047316608,0.998474834774,1760.30304771
4520,1.4018710997e-35,0.000852757248437,0.00136425648022,1.0,0.998294485503,0.99727148704,1.0,0.999047316608,0.998474834774,1764.44227942
4530,1.47288147202e-270,0.000852757248437,0.00136425648022,1.0,0.998294485503,0.99727148704,1.0,0.999047316608,0.998474834774,1768.54486044
4540,7.00935549848e-36,0.000852757248437,0.00136425648111,1.0,0.998294485503,0.99727148704,1.0,0.999047316608,0.998474834774,1772.68932159
4550,7.00935549848e-36,0.000852757248437,0.00136425649525,1.0,0.998294485503,0.99727148704,1.0,0.999047316608,0.998474834774,1776.73550158
4560,1.9323177158e-271,0.000852757248437,0.00136425682721,1.0,0.998294485503,0.99727148704,1.0,0.999047316608,0.998474834774,1781.06811379
4570,1.05140332477e-35,0.000852757248437,0.00136425785059,1.0,0.998294485503,0.99727148704,1.0,0.999047316608,0.998474834774,1785.21296526
4580,3.50467774924e-36,0.000852757248437,0.00136425672676,1.0,0.998294485503,0.99727148704,1.0,0.999047316608,0.998474834774,1789.20373424
4590,8.60292750406e-272,0.000852757248437,0.00136425663134,1.0,0.998294485503,0.99727148704,1.0,0.999047316608,0.998474834774,1793.2526208
4600,7.36933190998e-272,0.000852757248437,0.00136425720585,1.0,0.998294485503,0.99727148704,1.0,0.999047316608,0.998474834774,1797.32458807
4610,3.50467774924e-36,0.000852757248437,0.00136425757462,1.0,0.998294485503,0.99727148704,1.0,0.999047316608,0.998474834774,1801.34390344
4620,3.50467774924e-36,0.000852757248437,0.00136425720932,1.0,0.998294485503,0.99727148704,1.0,0.999047316608,0.998474834774,1805.45182688
4630,3.50467774924e-36,0.000852757248437,0.00136425795747,1.0,0.998294485503,0.99727148704,1.0,0.999047316608,0.998474834774,1809.55432731
4640,1.05140332477e-35,0.000852757248437,0.00136693439139,1.0,0.998294485503,0.99727148704,1.0,0.999047316608,0.998474834774,1813.6860722
4650,5.61098907653e-33,0.000852757248437,0.00145022881527,1.0,0.998294485503,0.996816734879,1.0,0.999047316608,0.998220188152,1817.89362002
4660,3.50467774924e-36,0.000852757248437,0.00157681223696,1.0,0.998294485503,0.996816734879,1.0,0.999047316608,0.998220188152,1822.10041208
4670,3.50467774924e-36,0.000852757248437,0.00158854798044,1.0,0.998294485503,0.996816734879,1.0,0.999047316608,0.998220188152,1826.0935704
4680,1.4018710997e-35,0.000852757248437,0.00159093907549,1.0,0.998294485503,0.996816734879,1.0,0.999047316608,0.998220188152,1830.31574065
4690,3.50467774924e-36,0.000852757248437,0.0015905302798,1.0,0.998294485503,0.996816734879,1.0,0.999047316608,0.998220188152,1834.29351762
4700,3.50467774924e-36,0.000852757248437,0.00158907465437,1.0,0.998294485503,0.996816734879,1.0,0.999047316608,0.998220188152,1838.37895018
4710,1.05140332477e-35,0.000852757248437,0.00158630634993,1.0,0.998294485503,0.996816734879,1.0,0.999047316608,0.998220188152,1842.63523048
4720,2.73025891983e-274,0.000852757248437,0.00157824206981,1.0,0.998294485503,0.996816734879,1.0,0.999047316608,0.998220188152,1846.95722896
4730,7.00935549848e-36,0.000852757248437,0.00155667943895,1.0,0.998294485503,0.996816734879,1.0,0.999047316608,0.998220188152,1851.21284634
4740,1.16992592287e-274,0.000852757248437,0.00150451877975,1.0,0.998294485503,0.996816734879,1.0,0.999047316608,0.998220188152,1855.55381688
4750,7.00935549848e-36,0.000852757248437,0.00145214616265,1.0,0.998294485503,0.996816734879,1.0,0.999047316608,0.998220188152,1859.76831384
4760,1.2037589878e-27,0.000852757248437,0.00138750045795,1.0,0.998294485503,0.99727148704,1.0,0.999047316608,0.998474834774,1863.93997897
4770,3.50467774924e-36,0.000852757248437,0.0013661486363,1.0,0.998294485503,0.99727148704,1.0,0.999047316608,0.998474834774,1868.11062483
4780,7.5443423041e-275,0.000852757248437,0.00136462537321,1.0,0.998294485503,0.99727148704,1.0,0.999047316608,0.998474834774,1872.15090654
4790,7.10833096389e-05,0.000852757248437,0.00136896594033,0.999857833381,0.998294485503,0.99727148704,0.999920666402,0.999047316608,0.998474834774,1876.4415521
4800,1.05140332477e-35,0.000852757248437,0.00138325089919,1.0,0.998294485503,0.99727148704,1.0,0.999047316608,0.998474834774,1880.50462139
4810,1.05140332477e-35,0.000852757248437,0.00138607217243,1.0,0.998294485503,0.99727148704,1.0,0.999047316608,0.998474834774,1884.5135407
4820,3.61782275483e-275,0.000852757248437,0.00138288848331,1.0,0.998294485503,0.99727148704,1.0,0.999047316608,0.998474834774,1888.64914772
4830,3.50467774924e-36,0.000852757248437,0.00139122696994,1.0,0.998294485503,0.99727148704,1.0,0.999047316608,0.998474834774,1892.74364735
4840,1.05140332477e-35,0.000852757248437,0.00137760357775,1.0,0.998294485503,0.99727148704,1.0,0.999047316608,0.998474834774,1896.9005893
4850,3.50467774924e-36,0.000852757248437,0.00137709054118,1.0,0.998294485503,0.99727148704,1.0,0.999047316608,0.998474834774,1901.05205095
4860,3.50467774924e-36,0.000852757248437,0.00137755013525,1.0,0.998294485503,0.99727148704,1.0,0.999047316608,0.998474834774,1905.15575078
4870,3.50467774924e-36,0.000852757248437,0.00137287654039,1.0,0.998294485503,0.99727148704,1.0,0.999047316608,0.998474834774,1909.17278467
4880,1.58559259317e-275,0.000852757248437,0.00136935282596,1.0,0.998294485503,0.99727148704,1.0,0.999047316608,0.998474834774,1913.25639995
4890,1.36280555043e-275,0.000852757248437,0.00137547045921,1.0,0.998294485503,0.99727148704,1.0,0.999047316608,0.998474834774,1917.20539823
4900,1.16061381204e-275,0.000852757248437,0.0013663741201,1.0,0.998294485503,0.99727148704,1.0,0.999047316608,0.998474834774,1921.11326266
4910,9.45514696703e-276,0.000852757248437,0.00136447614134,1.0,0.998294485503,0.99727148704,1.0,0.999047316608,0.998474834774,1925.26064331
4920,3.50467774924e-36,0.000852757248437,0.00136437454606,1.0,0.998294485503,0.99727148704,1.0,0.999047316608,0.998474834774,1929.34675736
4930,2.90888253187e-34,0.000852757248437,0.00136430276568,1.0,0.998294485503,0.99727148704,1.0,0.999047316608,0.998474834774,1933.46714066
4940,3.50467774924e-36,0.000852757248437,0.00136425884018,1.0,0.998294485503,0.99727148704,1.0,0.999047316608,0.998474834774,1937.6188512
4950,2.80598549343e-276,0.000852757248437,0.00136425425317,1.0,0.998294485503,0.99727148704,1.0,0.999047316608,0.998474834774,1941.73183223
4960,3.50467774924e-36,0.000852757248437,0.00136425446494,1.0,0.998294485503,0.99727148704,1.0,0.999047316608,0.998474834774,1945.85352991
4970,1.44189322928e-276,0.000852757248437,0.00136425423021,1.0,0.998294485503,0.99727148704,1.0,0.999047316608,0.998474834774,1949.95428416
4980,3.50467774924e-34,0.000852757248437,0.00136425498476,1.0,0.998294485503,0.99727148704,1.0,0.999047316608,0.998474834774,1953.91977431
4990,9.00702181555e-34,0.000852757248437,0.00136425402725,1.0,0.998294485503,0.99727148704,1.0,0.999047316608,0.998474834774,1957.89339799
5000,7.05011444032e-277,0.000852757248437,0.00136425419755,1.0,0.998294485503,0.99727148704,1.0,0.999047316608,0.998474834774,1961.92853994
