iterations,fitness,time,fevals
0,541.0,0.043478553,730
10,533.0,0.060202715,1368
20,539.0,0.076118579,1992
30,542.0,0.091012813,2619
40,548.0,0.107330456,3247
50,536.0,0.125018964,3872
60,543.0,0.141015026,4514
70,533.0,0.15581958,5144
80,544.0,0.172382161,5772
90,539.0,0.18673358,6404
100,535.0,0.202043419,7035
110,539.0,0.218964321,7668
120,537.0,0.23417421,8298
130,535.0,0.248197333,8933
140,539.0,0.262708752,9564
150,535.0,0.277142344,10182
160,533.0,0.291274898,10804
170,533.0,0.306071946,11434
180,531.0,0.321034526,12062
190,531.0,0.335339722,12690
200,537.0,0.351146154,13324
210,531.0,0.365910017,13969
220,539.0,0.380903807,14607
230,533.0,0.399275772,15235
240,529.0,0.416188773,15873
250,531.0,0.432174564,16500
260,529.0,0.446608946,17128
270,539.0,0.461800267,17753
280,539.0,0.477304872,18383
290,535.0,0.492159995,18999
300,539.0,0.507712402,19631
310,543.0,0.52365513,20244
320,535.0,0.539029365,20878
330,537.0,0.553872636,21500
340,533.0,0.568550376,22144
350,537.0,0.587140811,22782
360,539.0,0.601127588,23409
370,539.0,0.614949228,24022
380,533.0,0.630301734,24651
390,537.0,0.64511103,25276
400,533.0,0.66036082,25913
410,531.0,0.67503777,26538
420,531.0,0.69064351,27166
430,533.0,0.705521151,27787
440,531.0,0.721253706,28413
450,529.0,0.737312978,29045
460,529.0,0.752675756,29673
470,527.0,0.77116861,30302
480,533.0,0.786177017,30936
490,537.0,0.80195777,31562
500,529.0,0.816372794,32186
510,527.0,0.857754357,32828
520,533.0,0.872944888,33463
530,535.0,0.887769986,34095
540,531.0,0.902561899,34719
550,529.0,0.917095046,35354
560,527.0,0.932056045,35973
570,533.0,0.947894478,36613
580,533.0,0.963568959,37236
590,537.0,0.977571143,37867
600,541.0,0.992180932,38504
610,533.0,1.006849981,39144
620,527.0,1.022225401,39783
630,529.0,1.038418599,40412
640,533.0,1.052792141,41053
650,529.0,1.068027709,41686
660,529.0,1.082160659,42314
670,527.0,1.096947041,42952
680,533.0,1.110731546,43573
690,537.0,1.126545485,44206
700,541.0,1.142133053,44827
710,543.0,1.156457213,45463
720,543.0,1.172185423,46098
730,543.0,1.187777732,46724
740,545.0,1.201028903,47356
750,551.0,1.216099335,47986
760,545.0,1.231206112,48609
770,549.0,1.245640099,49238
780,547.0,1.260533148,49870
790,551.0,1.276964568,50491
800,549.0,1.291186801,51121
810,551.0,1.306231949,51735
820,549.0,1.322942678,52379
830,549.0,1.337722344,53012
840,549.0,1.354913074,53627
850,549.0,1.37153926,54266
860,547.0,1.387039124,54885
870,551.0,1.402779581,55517
880,545.0,1.416906604,56144
890,549.0,1.43149427,56777
900,549.0,1.445729935,57402
910,545.0,1.461949207,58013
920,545.0,1.476694503,58646
930,545.0,1.490785575,59269
940,543.0,1.50679981,59903
950,543.0,1.520972661,60533
960,545.0,1.535752722,61158
970,549.0,1.550527252,61780
980,545.0,1.590120765,62409
990,543.0,1.60489727,63024
1000,541.0,1.621881382,63656
1010,543.0,1.636241492,64281
1020,545.0,1.651347479,64909
1030,545.0,1.665045465,65528
1040,549.0,1.68093802,66164
1050,547.0,1.696597489,66796
1060,549.0,1.710817747,67417
1070,547.0,1.726325512,68056
1080,551.0,1.742337771,68676
1090,545.0,1.75706924,69309
1100,549.0,1.771501252,69934
1110,551.0,1.785269559,70562
1120,553.0,1.799389471,71187
1130,549.0,1.813167655,71815
1140,551.0,1.827805494,72448
1150,549.0,1.844478297,73075
1160,551.0,1.861010853,73721
1170,553.0,1.877131754,74349
1180,553.0,1.891579963,74980
1190,557.0,1.906013555,75617
1200,557.0,1.919986504,76240
1210,559.0,1.935282516,76868
1220,561.0,1.950162527,77497
1230,563.0,1.964897156,78130
1240,565.0,1.980289168,78755
1250,561.0,1.994639796,79381
1260,565.0,2.00876761,80015
1270,561.0,2.024186091,80652
1280,563.0,2.038782843,81293
1290,563.0,2.055409425,81926
1300,569.0,2.069502078,82553
1310,567.0,2.083955027,83174
1320,571.0,2.099249064,83811
1330,571.0,2.115277917,84453
1340,575.0,2.129672398,85077
1350,577.0,2.145293151,85717
1360,579.0,2.160387682,86346
1370,577.0,2.175617323,86982
1380,573.0,2.193821386,87608
1390,571.0,2.214452711,88249
1400,575.0,2.232106453,88888
1410,577.0,2.246771946,89518
1420,577.0,2.263207712,90155
1430,579.0,2.278711921,90791
1440,577.0,2.294168723,91410
1450,579.0,2.335845793,92046
1460,581.0,2.350610051,92672
1470,579.0,2.365338755,93291
1480,577.0,2.380328198,93938
1490,575.0,2.3940329,94578
1500,575.0,2.409400418,95207
1510,575.0,2.425153517,95842
1520,575.0,2.440841036,96469
1530,577.0,2.455385245,97110
1540,579.0,2.472760864,97726
1550,581.0,2.487757419,98357
1560,579.0,2.501776195,98992
1570,584.0,2.51687033,99621
1580,579.0,2.531246242,100260
1590,585.0,2.545067488,100889
1600,588.0,2.559783944,101529
1610,586.0,2.574198177,102162
1620,584.0,2.588823769,102785
1630,581.0,2.606282745,103421
1640,581.0,2.621541622,104049
1650,585.0,2.635657584,104678
1660,579.0,2.65231814,105304
1670,581.0,2.667205263,105933
1680,581.0,2.68135599,106562
1690,581.0,2.697040743,107193
1700,579.0,2.712908015,107840
1710,580.0,2.727869409,108474
1720,576.0,2.742852532,109107
1730,577.0,2.758175803,109735
1740,573.0,2.773026975,110370
1750,575.0,2.78993563,110997
1760,581.0,2.804567938,111638
1770,577.0,2.819089233,112279
1780,575.0,2.833398775,112927
1790,575.0,2.847840267,113546
1800,575.0,2.863408082,114187
1810,577.0,2.878482464,114814
1820,579.0,2.893211167,115425
1830,579.0,2.907896808,116061
1840,575.0,2.922695832,116688
1850,575.0,2.938021473,117312
1860,569.0,2.956394624,117935
1870,567.0,2.972681847,118558
1880,571.0,2.9874145,119185
1890,573.0,3.001454214,119814
1900,577.0,3.015961682,120451
1910,579.0,3.03113878,121076
1920,581.0,3.045667186,121706
1930,581.0,3.060341371,122345
1940,581.0,3.100173106,122980
1950,583.0,3.115249463,123619
1960,589.0,3.129114165,124247
1970,587.0,3.143922276,124879
1980,583.0,3.15878372,125511
1990,585.0,3.172581657,126125
2000,583.0,3.186267001,126734
2010,587.0,3.201029679,127366
2020,587.0,3.21787947,127999
2030,581.0,3.232423679,128630
2040,583.0,3.246080974,129254
2050,591.0,3.261802468,129894
2060,583.0,3.277192505,130533
2070,585.0,3.293168814,131147
2080,585.0,3.308114011,131781
2090,585.0,3.322810318,132421
2100,587.0,3.340870184,133055
2110,587.0,3.354941109,133670
2120,585.0,3.368731539,134310
2130,585.0,3.382638908,134940
2140,589.0,3.399385983,135559
2150,587.0,3.41378955,136183
2160,587.0,3.429908871,136810
2170,585.0,3.444271746,137441
2180,587.0,3.459460301,138082
2190,591.0,3.473637893,138718
2200,585.0,3.487763731,139364
2210,585.0,3.50243041,140000
2220,591.0,3.518624003,140644
2230,587.0,3.533298582,141273
2240,589.0,3.548655434,141912
2250,587.0,3.563445372,142531
2260,587.0,3.57785763,143157
2270,587.0,3.593368951,143789
2280,587.0,3.60778516,144408
2290,583.0,3.622522554,145045
2300,581.0,3.637402566,145676
2310,581.0,3.651870528,146311
2320,581.0,3.666546688,146946
2330,577.0,3.682714206,147566
2340,579.0,3.69901328,148197
2350,581.0,3.713576057,148831
2360,581.0,3.728352563,149457
2370,579.0,3.742781809,150088
2380,579.0,3.757390413,150721
2390,579.0,3.775400896,151341
2400,579.0,3.789408216,151975
2410,579.0,3.803927141,152601
2420,581.0,3.842951369,153228
2430,583.0,3.857501503,153861
2440,585.0,3.872380329,154491
2450,589.0,3.888475551,155119
2460,591.0,3.902480106,155741
2470,587.0,3.916943722,156377
2480,587.0,3.931667289,157009
2490,589.0,3.946087054,157633
2500,583.0,3.961386227,158254
2510,583.0,3.976520659,158883
2520,587.0,3.990673362,159505
2530,585.0,4.006027448,160125
2540,587.0,4.019822224,160757
2550,581.0,4.03409305,161402
2560,583.0,4.048077851,162022
2570,581.0,4.065153617,162649
2580,585.0,4.079569826,163279
2590,581.0,4.093954825,163902
2600,579.0,4.108371034,164540
2610,577.0,4.122906552,165171
2620,579.0,4.136638118,165794
2630,579.0,4.150730376,166415
2640,575.0,4.165370585,167049
2650,573.0,4.179436769,167681
2660,571.0,4.195341572,168315
2670,571.0,4.210468498,168959
2680,573.0,4.225733695,169580
2690,575.0,4.241162053,170206
2700,575.0,4.256447003,170829
2710,575.0,4.2712642,171458
2720,573.0,4.287082879,172086
2730,571.0,4.301611285,172718
2740,571.0,4.316260185,173353
2750,567.0,4.331195506,173981
2760,571.0,4.346610826,174610
2770,571.0,4.360747726,175248
2780,567.0,4.374584379,175881
2790,567.0,4.389891058,176527
2800,567.0,4.403825686,177161
2810,569.0,4.420325848,177804
2820,567.0,4.434920625,178434
2830,563.0,4.449365279,179059
2840,569.0,4.463265932,179699
2850,569.0,4.478022289,180328
2860,565.0,4.492457066,180967
2870,569.0,4.506404731,181602
2880,567.0,4.520233483,182230
2890,567.0,4.53607073,182854
2900,569.0,4.551205557,183488
2910,569.0,4.565976927,184120
2920,567.0,4.581014174,184751
2930,567.0,4.596683125,185395
2940,569.0,4.614107336,186026
2950,575.0,4.628373816,186653
2960,567.0,4.642349135,187294
2970,569.0,4.656909541,187934
2980,569.0,4.671613355,188555
2990,571.0,4.710524991,189178
3000,569.0,4.726234633,189812
