iterations,fitness,time,fevals
0,22.0,0.00138666800001,461
10,19.0,0.00288079200001,821
20,19.0,0.00422716300001,1190
30,19.0,0.00555022500001,1558
40,20.0,0.00681560900001,1925
50,20.0,0.00805215400001,2293
60,20.0,0.011167614,2658
70,20.0,0.01264238,3018
80,21.0,0.013854826,3378
90,20.0,0.015066086,3746
100,20.0,0.016267864,4110
110,20.0,0.017756062,4476
120,20.0,0.018986285,4848
130,20.0,0.020203076,5217
140,21.0,0.022853942,5580
150,22.0,0.024047819,5944
160,22.0,0.025253943,6315
170,21.0,0.026609796,6679
180,22.0,0.027838043,7048
190,23.0,0.029041797,7414
200,22.0,0.030254243,7782
210,23.0,0.031881898,8158
220,23.0,0.034271628,8523
230,23.0,0.035648024,8896
240,24.0,0.03693237,9260
250,23.0,0.038123482,9623
260,23.0,0.040276965,9981
270,23.0,0.041457806,10349
280,24.0,0.042637461,10716
290,23.0,0.04380961,11082
300,24.0,0.04642097,11458
310,23.0,0.047619588,11828
320,24.0,0.048820971,12194
330,23.0,0.04999312,12559
340,24.0,0.051718751,12919
350,25.0,0.052921715,13284
360,24.0,0.054112037,13649
370,23.0,0.055398359,14017
380,24.0,0.057715003,14380
390,24.0,0.058945226,14746
400,25.0,0.060268684,15118
410,24.0,0.061462957,15486
420,24.0,0.062640637,15847
430,24.0,0.063814366,16211
440,24.0,0.064974663,16574
450,24.0,0.066187108,16946
460,26.0,0.069839062,17312
470,25.0,0.071106421,17674
480,25.0,0.072292397,18041
490,26.0,0.073477583,18408
500,27.0,0.07466593,18782
510,26.0,0.075836499,19144
520,27.0,0.077146524,19502
530,27.0,0.078328945,19872
540,27.0,0.081240157,20241
550,26.0,0.082425738,20608
560,26.0,0.083591566,20966
570,27.0,0.084777147,21337
580,27.0,0.08619621,21703
590,28.0,0.0875801129999,22066
600,27.0,0.0887609529999,22426
610,27.0,0.089946929,22797
620,27.0,0.0923271769999,23165
630,28.0,0.0937418939999,23528
640,27.0,0.0950558709999,23893
650,27.0,0.0962216989999,24249
660,27.0,0.0974238729999,24620
670,27.0,0.0986082689999,24986
680,27.0,0.0997847639999,25352
690,27.0,0.100964814,25717
700,28.0,0.10431415,26081
710,27.0,0.105578349,26449
720,27.0,0.106813708,26820
730,28.0,0.108284524,27186
740,28.0,0.109542006,27549
750,28.0,0.110746945,27922
760,28.0,0.11195939,28293
770,28.0,0.113173811,28655
780,28.0,0.115533912,29013
790,28.0,0.116766111,29383
800,28.0,0.118325421,29751
810,28.0,0.119536286,30120
820,28.0,0.120728583,30484
830,29.0,0.122197819,30849
840,29.0,0.12341382,31218
850,29.0,0.124615204,31589
860,29.0,0.127159404,31950
870,29.0,0.128350912,32319
880,29.0,0.129584691,32690
890,29.0,0.131019556,33062
900,30.0,0.132237927,33431
910,30.0,0.133512002,33792
920,29.0,0.134696398,34153
930,29.0,0.135886325,34518
940,29.0,0.138236549,34878
950,30.0,0.139433587,35244
960,29.0,0.141257588,35608
970,30.0,0.142506379,35982
980,30.0,0.143735812,36349
990,29.0,0.145031616,36717
1000,29.0,0.146217987,37083
1010,29.0,0.14738421,37448
1020,29.0,0.14964831,37815
1030,29.0,0.150803077,38175
1040,29.0,0.151987078,38549
1050,29.0,0.153167523,38916
1060,29.0,0.15524792,39274
1070,30.0,0.156443773,39650
1080,29.0,0.157656218,40025
1090,29.0,0.158864713,40388
1100,28.0,0.161125258,40756
1110,28.0,0.162298987,41122
1120,28.0,0.163579779,41491
1130,29.0,0.164831731,41855
1140,28.0,0.166145708,42223
1150,28.0,0.16739529,42594
1160,28.0,0.168642501,42961
1170,29.0,0.169881811,43322
1180,29.0,0.174052086,43691
1190,30.0,0.175595988,44060
1200,30.0,0.176856236,44430
1210,30.0,0.178054064,44800
1220,30.0,0.179278361,45166
1230,30.0,0.180624337,45539
1240,30.0,0.182180882,45901
1250,31.0,0.183870167,46267
1260,30.0,0.186099107,46627
1270,30.0,0.187303651,46996
1280,31.0,0.188578911,47364
1290,31.0,0.190515505,47736
1300,32.0,0.191750864,48099
1310,31.0,0.192977137,48462
1320,31.0,0.194391854,48826
1330,31.0,0.195623658,49203
1340,32.0,0.197856549,49577
1350,32.0,0.199236895,49944
1360,32.0,0.20045171,50311
1370,32.0,0.201661785,50684
1380,33.0,0.202892008,51046
1390,33.0,0.20437191,51409
1400,33.0,0.205561442,51774
1410,33.0,0.206998283,52140
1420,35.0,0.209328754,52506
1430,40.0,0.210540015,52866
1440,37.0,0.211960658,53231
1450,35.0,0.21315493,53598
1460,35.0,0.214380808,53970
1470,35.0,0.215584958,54338
1480,37.0,0.217184169,54704
1490,37.0,0.218401751,55070
1500,40.0,0.220975186,55433
1510,35.0,0.222203828,55799
1520,37.0,0.223399286,56165
1530,36.0,0.224781213,56532
1540,36.0,0.226455881,56895
1550,36.0,0.227654104,57261
1560,39.0,0.228857068,57629
1570,40.0,0.230074254,58003
1580,40.0,0.231296576,58366
1590,41.0,0.233307047,58738
1600,40.0,0.234515937,59104
1610,40.0,0.235790012,59470
1620,39.0,0.23704947,59838
1630,41.0,0.238241372,60205
1640,40.0,0.239439595,60578
1650,40.0,0.241689078,60943
1660,40.0,0.242909819,61312
1670,40.0,0.244147943,61682
1680,40.0,0.246228339,62045
1690,41.0,0.247549032,62413
1700,41.0,0.248778465,62773
1710,41.0,0.250143405,63141
1720,41.0,0.251319504,63506
1730,40.0,0.253794963,63866
1740,40.0,0.255183605,64237
1750,41.0,0.256371951,64595
1760,41.0,0.257770075,64960
1770,41.0,0.25926815,65326
1780,41.0,0.260437929,65688
1790,41.0,0.26203872,66057
1800,41.0,0.263272894,66427
1810,40.0,0.265584402,66794
1820,41.0,0.266764453,67159
1830,41.0,0.267942133,67522
1840,41.0,0.269122579,67891
1850,41.0,0.270290777,68249
1860,41.0,0.27149137,68619
1870,40.0,0.272731864,68993
1880,41.0,0.273928507,69366
1890,41.0,0.277787868,69737
1900,40.0,0.279009795,70107
1910,40.0,0.280223821,70480
1920,41.0,0.281443772,70847
1930,41.0,0.283083279,71208
1940,40.0,0.284294934,71572
1950,41.0,0.28548328,71938
1960,40.0,0.286696911,72301
1970,41.0,0.289472617,72676
1980,41.0,0.290697705,73039
1990,41.0,0.292036965,73411
2000,40.0,0.293214645,73773
2010,40.0,0.294403387,74135
2020,41.0,0.295597265,74504
2030,41.0,0.296789167,74867
2040,41.0,0.298135933,75231
2050,42.0,0.300479046,75598
2060,42.0,0.302333072,75970
2070,42.0,0.303569617,76341
2080,42.0,0.304808926,76710
2090,42.0,0.30601031,77081
2100,42.0,0.307239348,77448
2110,42.0,0.308450214,77817
2120,42.0,0.309717573,78189
2130,42.0,0.312029871,78549
2140,42.0,0.313241131,78918
2150,42.0,0.314463848,79285
2160,42.0,0.315670763,79654
2170,42.0,0.316850419,80018
2180,42.0,0.318169531,80389
2190,42.0,0.319582667,80755
2200,41.0,0.32090731,81121
2210,41.0,0.323225139,81486
2220,41.0,0.324428103,81849
2230,42.0,0.325986227,82223
2240,41.0,0.327336549,82583
2250,41.0,0.328532402,82954
2260,41.0,0.329936847,83323
2270,41.0,0.331645096,83681
2280,41.0,0.332816455,84040
2290,41.0,0.335773495,84415
2300,41.0,0.337085892,84779
2310,42.0,0.338267918,85151
2320,42.0,0.339472067,85523
2330,42.0,0.340665549,85894
2340,41.0,0.341855476,86251
2350,41.0,0.343163526,86618
2360,41.0,0.344480663,86987
2370,41.0,0.34678743,87359
2380,43.0,0.347965505,87721
2390,42.0,0.349177556,88084
2400,42.0,0.350379334,88451
2410,42.0,0.351565705,88821
2420,42.0,0.352799089,89183
2430,42.0,0.354290448,89558
2440,42.0,0.355508424,89930
2450,43.0,0.358421612,90301
2460,43.0,0.359624576,90662
2470,42.0,0.36082675,91030
2480,42.0,0.362110702,91390
2490,43.0,0.363314455,91757
2500,44.0,0.364520184,92120
2510,44.0,0.365719987,92483
2520,44.0,0.367065568,92852
2530,43.0,0.369418953,93222
2540,42.0,0.370600189,93587
2550,43.0,0.371945375,93953
2560,43.0,0.373168487,94320
2570,43.0,0.374394365,94699
2580,43.0,0.375622217,95068
2590,43.0,0.377283848,95429
2600,44.0,0.37870133,95792
2610,43.0,0.381012838,96163
2620,43.0,0.382220542,96539
2630,43.0,0.383397037,96897
2640,43.0,0.384584594,97270
2650,43.0,0.385898965,97633
2660,44.0,0.387726917,98001
2670,44.0,0.388895511,98368
2680,44.0,0.390092154,98737
2690,45.0,0.392412749,99099
2700,44.0,0.393608602,99454
2710,44.0,0.395446035,99816
2720,43.0,0.396679419,100184
2730,43.0,0.397857099,100548
2740,44.0,0.399307767,100919
2750,44.0,0.400772657,101290
2760,43.0,0.401967325,101660
2770,44.0,0.40426145,102025
2780,44.0,0.405450587,102387
2790,44.0,0.406656712,102751
2800,44.0,0.408268565,103120
2810,44.0,0.410321702,103488
2820,44.0,0.411552716,103856
2830,44.0,0.41278452,104225
2840,44.0,0.414371484,104586
2850,44.0,0.416719733,104947
2860,45.0,0.417940869,105311
2870,44.0,0.419494253,105673
2880,44.0,0.420836674,106036
2890,44.0,0.422071638,106400
2900,44.0,0.423270257,106765
2910,44.0,0.424541171,107128
2920,44.0,0.425731888,107499
2930,44.0,0.42809989,107868
2940,44.0,0.429361323,108233
2950,44.0,0.430578114,108605
2960,44.0,0.431981374,108976
2970,44.0,0.433567153,109342
2980,44.0,0.434776833,109714
2990,43.0,0.436661674,110083
3000,43.0,0.43791165,110446
3010,43.0,0.440068293,110810
3020,44.0,0.44132222,111170
3030,43.0,0.44265674,111539
3040,43.0,0.443827309,111907
3050,43.0,0.444994322,112276
3060,45.0,0.446248644,112644
3070,43.0,0.44743225,113012
3080,43.0,0.448624152,113377
3090,43.0,0.451374574,113744
3100,43.0,0.452555019,114107
3110,43.0,0.453736255,114479
3120,43.0,0.454910379,114843
3130,46.0,0.456591763,115214
3140,44.0,0.457772603,115586
3150,44.0,0.45898979,115965
3160,44.0,0.460419915,116339
3170,44.0,0.462736164,116714
3180,44.0,0.463905547,117076
3190,44.0,0.465091129,117443
3200,44.0,0.466264858,117811
3210,44.0,0.467437402,118173
3220,51.0,0.468630885,118540
3230,51.0,0.471207085,118906
3240,52.0,0.472400963,119274
3250,55.0,0.47470299,119641
3260,55.0,0.476148522,120007
3270,55.0,0.477319486,120374
3280,56.0,0.478579734,120740
3290,56.0,0.479771241,121117
3300,56.0,0.480951686,121475
3310,56.0,0.482136082,121840
3320,56.0,0.483331144,122206
3330,57.0,0.48626764,122570
3340,56.0,0.487470209,122933
3350,57.0,0.488786555,123299
3360,56.0,0.49002468,123664
3370,57.0,0.491204335,124028
3380,56.0,0.492405718,124403
3390,56.0,0.493768287,124770
3400,57.0,0.49499219,125141
3410,56.0,0.497342809,125508
3420,57.0,0.498539056,125874
3430,57.0,0.499749526,126244
3440,57.0,0.500939058,126604
3450,56.0,0.502122663,126967
3460,56.0,0.503561874,127337
3470,57.0,0.50566953,127709
3480,57.0,0.507078321,128077
3490,57.0,0.510833386,128441
3500,57.0,0.51209482,128803
3510,58.0,0.513318327,129162
3520,57.0,0.514553686,129521
3530,57.0,0.515841193,129888
3540,57.0,0.517092355,130254
3550,57.0,0.51849127,130617
3560,57.0,0.519683172,130988
3570,57.0,0.522552508,131358
3580,57.0,0.523736904,131723
3590,56.0,0.52492525,132089
3600,57.0,0.526124658,132462
3610,56.0,0.527306684,132832
3620,56.0,0.528504117,133197
3630,56.0,0.529786488,133567
3640,55.0,0.531127329,133936
3650,55.0,0.533546689,134298
3660,56.0,0.53486106,134668
3670,56.0,0.536068765,135039
3680,56.0,0.537272125,135407
3690,55.0,0.538473113,135777
3700,56.0,0.539674102,136138
3710,56.0,0.541225115,136512
3720,56.0,0.542443091,136882
3730,56.0,0.545740674,137254
3740,57.0,0.546956675,137630
3750,57.0,0.54816438,138000
3760,57.0,0.549379591,138371
3770,58.0,0.550573864,138731
3780,58.0,0.551774458,139101
3790,58.0,0.553113718,139465
3800,58.0,0.554563201,139834
3810,57.0,0.556763301,140196
3820,57.0,0.557967451,140557
3830,57.0,0.559179897,140931
3840,57.0,0.560386416,141288
3850,57.0,0.561578318,141661
3860,57.0,0.563535456,142025
3870,57.0,0.565120445,142387
3880,56.0,0.566472743,142755
3890,57.0,0.568638473,143116
3900,57.0,0.570069388,143481
3910,57.0,0.57151176,143848
3920,58.0,0.572753045,144217
3930,58.0,0.573961145,144586
3940,59.0,0.575150282,144960
3950,60.0,0.576355616,145331
3960,59.0,0.577672752,145703
3970,59.0,0.580815866,146073
3980,59.0,0.582006583,146440
3990,59.0,0.583337547,146809
4000,59.0,0.58453577,147171
4010,59.0,0.585719376,147535
4020,59.0,0.586927871,147895
4030,59.0,0.588117798,148250
4040,60.0,0.589556219,148620
4050,60.0,0.590790788,148987
4060,60.0,0.592248962,149353
4070,60.0,0.593479185,149722
4080,60.0,0.594644618,150091
4090,60.0,0.595840076,150462
4100,61.0,0.596991682,150834
4110,60.0,0.598150399,151199
4120,60.0,0.600821809,151563
4130,60.0,0.601973415,151928
4140,60.0,0.60311712,152291
4150,59.0,0.604268726,152656
4160,62.0,0.605483542,153030
4170,62.0,0.606678209,153394
4180,62.0,0.60789105,153756
4190,64.0,0.609201866,154118
4200,64.0,0.611669423,154485
4210,64.0,0.613267054,154855
4220,63.0,0.61464266,155217
4230,63.0,0.615854315,155589
4240,63.0,0.617052143,155954
4250,63.0,0.618261033,156331
4260,62.0,0.619748442,156691
4270,63.0,0.621090863,157060
4280,63.0,0.623536297,157433
4290,63.0,0.624937583,157798
4300,63.0,0.626195856,158153
4310,64.0,0.627403561,158524
4320,63.0,0.628743612,158894
4330,63.0,0.630222329,159260
4340,63.0,0.631396059,159626
4350,63.0,0.632606924,159993
4360,63.0,0.634947272,160361
4370,64.0,0.636139569,160725
4380,64.0,0.637358335,161094
4390,65.0,0.638768707,161465
4400,65.0,0.640497894,161838
4410,66.0,0.641929203,162211
4420,65.0,0.643330488,162574
4430,65.0,0.644722687,162930
4440,65.0,0.647240022,163302
4450,65.0,0.648462738,163671
4460,65.0,0.64965227,164038
4470,65.0,0.650825209,164401
4480,65.0,0.652017111,164766
4490,65.0,0.653210198,165138
4500,65.0,0.654387483,165505
4510,65.0,0.656008817,165875
4520,65.0,0.658404078,166247
4530,65.0,0.659607833,166612
4540,65.0,0.661362698,166982
4550,65.0,0.663017218,167334
4560,65.0,0.664503441,167708
4570,65.0,0.665682306,168075
4580,65.0,0.666974159,168449
4590,65.0,0.668131296,168812
4600,65.0,0.670863545,169174
4610,65.0,0.672363991,169544
4620,65.0,0.673546412,169918
4630,65.0,0.67471382,170282
4640,65.0,0.675866216,170640
4650,65.0,0.677056933,171005
4660,66.0,0.678317181,171363
4670,65.0,0.679948787,171736
4680,65.0,0.68229111,172100
4690,65.0,0.683488543,172468
4700,65.0,0.684656346,172836
4710,65.0,0.685870371,173211
4720,65.0,0.687046075,173581
4730,65.0,0.68822336,173948
4740,67.0,0.689391953,174314
4750,65.0,0.690600448,174680
4760,65.0,0.69284361,175043
4770,65.0,0.694412402,175407
4780,65.0,0.695917193,175779
4790,66.0,0.697132009,176146
4800,66.0,0.698298627,176514
4810,65.0,0.699601146,176884
4820,65.0,0.701486382,177249
4830,65.0,0.702672358,177623
4840,65.0,0.705686681,177988
4850,66.0,0.706863176,178351
4860,66.0,0.708042041,178719
4870,67.0,0.709231573,179087
4880,67.0,0.710442438,179459
4890,67.0,0.711627229,179824
4900,66.0,0.713090144,180201
4910,66.0,0.714295873,180570
4920,66.0,0.716614887,180943
4930,67.0,0.717793358,181303
4940,67.0,0.7189821,181669
4950,66.0,0.720153064,182034
4960,66.0,0.721676423,182397
4970,66.0,0.723158696,182766
4980,67.0,0.72448492,183142
4990,67.0,0.725792575,183509
5000,66.0,0.72817875,183873
