mean_fit_time,std_fit_time,mean_score_time,std_score_time,param_SVM__max_iter,params,split0_test_score,split1_test_score,split2_test_score,split3_test_score,split4_test_score,mean_test_score,std_test_score,rank_test_score,split0_train_score,split1_train_score,split2_train_score,split3_train_score,split4_train_score,mean_train_score,std_train_score
0.04061522483825684,0.007652514133360436,0.012496662139892579,0.006248331085411829,1,{'SVM__max_iter': 1},0.656112781711773,0.5940602062922367,0.6095062566689301,0.5419892003750768,0.5894111248146557,0.5982229233577393,0.03671732588265644,12,0.6404910060751202,0.5905500999851413,0.6142969038982516,0.5562223086728515,0.5701070262230414,0.5943334689708812,0.030274583115171998
0.046661663055419925,0.013092875679299633,0.017086219787597657,0.001524948055234907,2,{'SVM__max_iter': 2},0.6349953115400783,0.6150936075274034,0.620538687877906,0.5744527435574094,0.7149908309429115,0.6319481796346921,0.04605725674900024,11,0.6295344861414162,0.6132872518992881,0.6228256940293623,0.563744561971593,0.7074991108093253,0.6273782209701969,0.04624398325524586
0.0579679012298584,0.007182242761348597,0.03364067077636719,0.006146882113878796,4,{'SVM__max_iter': 4},0.7349985449607139,0.6658518446664727,0.7863614317586575,0.7488020176544766,0.7293581890996772,0.7330773640626291,0.03906216577553634,10,0.7389701055837409,0.6727696241761136,0.7983383396357022,0.74310169512384,0.7260161024347658,0.7358391733908325,0.040107239996735315
0.0950547218322754,0.012681079336108427,0.04686446189880371,7.599533772711385e-07,8,{'SVM__max_iter': 8},0.8547418113622403,0.8494390015197079,0.8884631551718563,0.8778640023280628,0.82869903320723,0.8598661927765677,0.021194376385615925,9,0.863966908994317,0.8428651770785833,0.8984776207556175,0.878122804096883,0.8269279270540304,0.8620720875958863,0.025261021850998176
0.15148496627807617,0.007953497687491127,0.07185807228088378,0.00765270878051615,16,{'SVM__max_iter': 16},0.966307756976105,0.9691758010799624,0.9595272739030619,0.9741843696446472,0.9713857863448028,0.9681135947100064,0.005014642821678739,8,0.9662984224952145,0.9773652730122422,0.9651350013763539,0.9718003125128813,0.9684919326155138,0.969818188402441,0.004403799479359378
0.23237223625183107,0.0024215699641225276,0.10265107154846191,0.007979305043903425,32,{'SVM__max_iter': 32},0.9882982507194362,0.9819704465353898,0.9865683706793417,0.9872506224334723,0.9860347985347985,0.986024489580183,0.0021644029705669057,7,0.9874503573234518,0.9913718621179991,0.9902105289907122,0.9908496871998509,0.984359136030006,0.9888483143324039,0.002620550369126441
0.2969851493835449,0.013072599854605757,0.1288670063018799,0.024945248687110635,64,{'SVM__max_iter': 64},0.9943091796811848,0.9896659876483331,0.9943091796811846,0.9916674750218254,0.9954212454212454,0.9930727453657106,0.0021047307407783935,6,0.9950081579758006,0.9968317215648066,0.9942102499109777,0.993902604372142,0.993762731593753,0.994743093083496,0.0011299628401906297
0.42017407417297364,0.03410066925572121,0.15057854652404784,0.008064139815037712,128,{'SVM__max_iter': 128},0.9943091796811848,0.9880266433860381,0.9953568079671483,0.9933068192841205,0.9971153846153845,0.9936201867157187,0.00306860758578453,5,0.9957035017463837,0.9971278309773521,0.9955895882096045,0.9956921525038442,0.995538687877906,0.9959303522630181,0.0006019429680816906
0.47343859672546384,0.04397354808358016,0.16553497314453125,0.0152830811410428,256,{'SVM__max_iter': 256},0.9943091796811848,0.9885730914734697,0.9959485239434797,0.9938532673715522,0.9971153846153845,0.9939573773657928,0.0029345322501351796,1,0.9957035017463837,0.9971278309773521,0.9955895882096045,0.9959657503150618,0.995538687877906,0.9959850718252617,0.0005901219244312759
0.44946985244750975,0.012272304968596022,0.16218137741088867,0.018635870807738687,512,{'SVM__max_iter': 512},0.9943091796811848,0.9885730914734697,0.9959485239434797,0.9938532673715522,0.9971153846153845,0.9939573773657928,0.0029345322501351796,1,0.9957035017463837,0.9971278309773521,0.9955895882096045,0.9959657503150618,0.995538687877906,0.9959850718252617,0.0005901219244312759
0.46194005012512207,0.0269508840361553,0.1509183406829834,0.0037881088521657435,1024,{'SVM__max_iter': 1024},0.9943091796811848,0.9885730914734697,0.9959485239434797,0.9938532673715522,0.9971153846153845,0.9939573773657928,0.0029345322501351796,1,0.9957035017463837,0.9971278309773521,0.9955895882096045,0.9959657503150618,0.995538687877906,0.9959850718252617,0.0005901219244312759
0.43256101608276365,0.019804528437033633,0.14064536094665528,0.019116405631693208,2048,{'SVM__max_iter': 2048},0.9943091796811848,0.9885730914734697,0.9959485239434797,0.9938532673715522,0.9971153846153845,0.9939573773657928,0.0029345322501351796,1,0.9957035017463837,0.9971278309773521,0.9955895882096045,0.9959657503150618,0.995538687877906,0.9959850718252617,0.0005901219244312759
