iterations,fitness,time,fevals
0,24.0,0.00179674200001,575
10,25.0,0.00366143500001,1060
20,28.0,0.00519743700001,1541
30,26.0,0.00667180900001,2018
40,26.0,0.00810667500001,2486
50,26.0,0.01080653,2971
60,26.0,0.012396259,3463
70,26.0,0.013807025,3939
80,26.0,0.015225297,4422
90,26.0,0.016664903,4896
100,27.0,0.018099768,5376
110,27.0,0.019691868,5860
120,26.0,0.021483079,6340
130,28.0,0.02441918,6814
140,27.0,0.026080021,7292
150,29.0,0.027723479,7777
160,27.0,0.029168616,8262
170,28.0,0.030612568,8748
180,28.0,0.032050989,9236
190,28.0,0.033547484,9721
200,28.0,0.035454844,10208
210,31.0,0.038156673,10684
220,31.0,0.039608132,11173
230,31.0,0.041615837,11652
240,31.0,0.043098109,12143
250,36.0,0.044587098,12644
260,36.0,0.046055543,13123
270,37.0,0.047501865,13614
280,37.0,0.048897619,14106
290,38.0,0.05221772,14585
300,39.0,0.053601622,15050
310,40.0,0.055065326,15533
320,40.0,0.05649308,16005
330,40.0,0.057938612,16492
340,40.0,0.059491996,16966
350,41.0,0.061132688,17441
360,43.0,0.062561232,17921
370,43.0,0.065144148,18401
380,40.0,0.066576643,18890
390,41.0,0.067986619,19363
400,41.0,0.06990109,19849
410,41.0,0.071636202,20339
420,40.0,0.073077388,20821
430,40.0,0.07474771,21292
440,39.0,0.076487959,21776
450,39.0,0.079061393,22264
460,40.0,0.080516801,22752
470,39.0,0.081970234,23231
480,40.0,0.083419322,23723
490,40.0,0.084831669,24201
500,41.0,0.086298139,24673
510,39.0,0.088170733,25146
520,39.0,0.089543968,25634
530,41.0,0.092178637,26124
540,41.0,0.093618243,26606
550,41.0,0.095078787,27090
560,41.0,0.097018542,27576
570,41.0,0.098460914,28060
580,40.0,0.099889458,28541
590,41.0,0.101346447,29023
600,40.0,0.102803831,29517
610,40.0,0.105444426,30000
620,42.0,0.107708131,30479
630,42.0,0.109152873,30960
640,42.0,0.110612233,31434
650,42.0,0.112066062,31921
660,39.0,0.113511199,32401
670,40.0,0.114938954,32876
680,41.0,0.1164714,33362
690,42.0,0.119630316,33852
700,41.0,0.121089675,34322
710,41.0,0.122560886,34811
720,40.0,0.124008394,35287
730,40.0,0.125472494,35777
740,41.0,0.127018372,36274
750,41.0,0.128723459,36747
760,41.0,0.130447509,37236
770,42.0,0.133521487,37726
780,41.0,0.135236451,38209
790,41.0,0.136962872,38700
800,42.0,0.138661244,39171
810,42.0,0.140365937,39640
820,43.0,0.142283568,40118
830,44.0,0.143985496,40593
840,45.0,0.145881004,41076
850,45.0,0.148899278,41541
860,45.0,0.150626884,42026
870,45.0,0.152344218,42503
880,45.0,0.154049701,42981
890,45.0,0.155708962,43463
900,45.0,0.157242988,43942
910,45.0,0.158683384,44423
920,44.0,0.160232027,44912
930,45.0,0.162984819,45399
940,46.0,0.164409018,45880
950,45.0,0.165861266,46373
960,47.0,0.167441909,46860
970,47.0,0.168895343,47340
980,47.0,0.170319937,47815
990,47.0,0.171735049,48299
1000,47.0,0.173153716,48778
1010,47.0,0.175857125,49266
1020,46.0,0.177618311,49744
1030,47.0,0.179011695,50227
1040,47.0,0.180422461,50715
1050,48.0,0.181832437,51199
1060,48.0,0.183243599,51680
1070,54.0,0.185327156,52157
1080,52.0,0.187379108,52643
1090,52.0,0.190219604,53130
1100,50.0,0.191733087,53612
1110,54.0,0.19312015,54087
1120,51.0,0.196094967,54558
1130,54.0,0.197645585,55035
1140,50.0,0.199436401,55522
1150,54.0,0.201056551,56007
1160,55.0,0.202489441,56482
1170,54.0,0.205126875,56968
1180,55.0,0.206598086,57459
1190,55.0,0.208104457,57930
1200,56.0,0.209516014,58408
1210,57.0,0.21092599,58885
1220,56.0,0.212556411,59367
1230,56.0,0.214094387,59841
1240,55.0,0.215500808,60315
1250,55.0,0.218194341,60804
1260,56.0,0.219613404,61293
1270,56.0,0.220987824,61759
1280,56.0,0.222381208,62250
1290,56.0,0.224075234,62733
1300,57.0,0.225452815,63204
1310,56.0,0.226780224,63676
1320,56.0,0.228183879,64158
1330,56.0,0.230779832,64642
1340,56.0,0.232187043,65125
1350,56.0,0.234172625,65611
1360,56.0,0.235561663,66083
1370,56.0,0.236954257,66568
1380,56.0,0.238329468,67044
1390,56.0,0.239709419,67526
1400,55.0,0.24143505,68010
1410,55.0,0.244599102,68496
1420,56.0,0.24598972,68984
1430,56.0,0.247401671,69472
1440,58.0,0.248825869,69961
1450,58.0,0.250686217,70438
1460,56.0,0.252471502,70915
1470,56.0,0.253866071,71392
1480,56.0,0.255257874,71876
1490,56.0,0.257995654,72353
1500,55.0,0.259378371,72838
1510,55.0,0.260763063,73315
1520,56.0,0.262134718,73797
1530,56.0,0.263529287,74285
1540,55.0,0.265022621,74755
1550,58.0,0.266437338,75243
1560,56.0,0.267925141,75723
1570,55.0,0.270589835,76198
1580,56.0,0.272023515,76670
1590,56.0,0.273514479,77156
1600,56.0,0.274971863,77649
1610,56.0,0.276360901,78133
1620,57.0,0.27785463,78612
1630,56.0,0.27963952,79103
1640,55.0,0.281105595,79593
1650,55.0,0.283628856,80074
1660,55.0,0.285043968,80563
1670,55.0,0.286448809,81042
1680,55.0,0.287895527,81539
1690,55.0,0.289584812,82023
1700,56.0,0.290986888,82508
1710,57.0,0.292374741,82973
1720,56.0,0.293789458,83452
1730,55.0,0.296287831,83931
1740,55.0,0.298376919,84402
1750,55.0,0.30074334,84884
1760,55.0,0.302432231,85361
1770,55.0,0.303828775,85834
1780,60.0,0.305211097,86305
1790,62.0,0.306590258,86783
1800,60.0,0.307997864,87269
1810,61.0,0.31061515,87770
1820,60.0,0.312550954,88251
1830,61.0,0.313915498,88720
1840,60.0,0.31529308,89203
1850,60.0,0.31666276,89679
1860,61.0,0.318023354,90157
1870,61.0,0.319611899,90645
1880,61.0,0.321233628,91129
1890,60.0,0.323744642,91609
1900,60.0,0.325131705,92093
1910,60.0,0.326518768,92581
1920,60.0,0.327889238,93058
1930,60.0,0.329618819,93549
1940,60.0,0.331133487,94026
1950,60.0,0.332543068,94500
1960,60.0,0.333930525,94985
1970,61.0,0.335311267,95471
1980,60.0,0.336726379,95959
1990,60.0,0.33848717,96444
2000,61.0,0.339875418,96923
2010,62.0,0.341267617,97400
2020,60.0,0.342691816,97890
2030,61.0,0.344458533,98384
2040,61.0,0.347352758,98872
2050,61.0,0.348742192,99357
2060,61.0,0.350131625,99832
2070,62.0,0.351487478,100302
2080,61.0,0.353297652,100781
2090,62.0,0.354855776,101267
2100,61.0,0.356224666,101753
2110,62.0,0.357594741,102234
2120,61.0,0.359984076,102718
2130,61.0,0.361351385,103201
2140,61.0,0.363200671,103680
2150,61.0,0.364555734,104148
2160,62.0,0.366040772,104624
2170,61.0,0.367414403,105108
2180,60.0,0.368749712,105574
2190,60.0,0.370123343,106064
2200,61.0,0.372532826,106552
2210,62.0,0.374058951,107035
2220,61.0,0.375476038,107528
2230,62.0,0.377005718,108010
2240,62.0,0.378393571,108493
2250,62.0,0.379775893,108971
2260,62.0,0.381170857,109438
2270,63.0,0.382610463,109930
2280,63.0,0.385576983,110413
2290,63.0,0.387001576,110902
2300,62.0,0.388808194,111387
2310,63.0,0.390235948,111875
2320,63.0,0.391626566,112362
2330,63.0,0.393002962,112841
2340,63.0,0.394393975,113328
2350,63.0,0.395786173,113815
2360,64.0,0.398451262,114301
2370,63.0,0.399912991,114784
2380,63.0,0.401301239,115262
2390,63.0,0.402875561,115759
2400,63.0,0.404300945,116238
2410,62.0,0.405804551,116722
2420,64.0,0.407228355,117221
2430,64.0,0.408673097,117706
2440,64.0,0.411681494,118188
2450,63.0,0.41334273,118666
2460,63.0,0.414743225,119147
2470,63.0,0.416152017,119631
2480,64.0,0.417563179,120120
2490,64.0,0.418958538,120596
2500,63.0,0.420379577,121094
2510,63.0,0.421789158,121570
2520,63.0,0.424933852,122053
2530,63.0,0.426313803,122537
2540,65.0,0.427701656,123013
2550,63.0,0.429090299,123493
2560,64.0,0.4304663,123967
2570,64.0,0.432949264,124444
2580,64.0,0.43534571,124920
2590,66.0,0.436721316,125388
2600,66.0,0.440066306,125868
2610,65.0,0.441475888,126365
2620,65.0,0.442862161,126846
2630,64.0,0.444263051,127321
2640,64.0,0.445687645,127806
2650,65.0,0.447272239,128298
2660,66.0,0.448876191,128778
2670,66.0,0.450248636,129252
2680,67.0,0.453315502,129732
2690,66.0,0.454714812,130217
2700,66.0,0.456225134,130697
2710,66.0,0.457604295,131176
2720,66.0,0.459076692,131661
2730,66.0,0.460808249,132137
2740,66.0,0.462174374,132609
2750,66.0,0.463612005,133099
2760,66.0,0.466050327,133584
2770,66.0,0.467448451,134079
2780,66.0,0.468837885,134576
2790,66.0,0.471392356,135060
2800,66.0,0.473257839,135550
2810,67.0,0.475336261,136034
2820,67.0,0.476798385,136514
2830,67.0,0.47819651,136995
2840,67.0,0.481144068,137477
2850,67.0,0.482635032,137945
2860,67.0,0.484095577,138422
2870,67.0,0.485842542,138901
2880,67.0,0.48761163,139376
2890,68.0,0.489131829,139863
2900,67.0,0.490531139,140339
2910,68.0,0.49190872,140821
2920,67.0,0.494533513,141305
2930,67.0,0.495922551,141782
2940,67.0,0.49728117,142249
2950,66.0,0.498677319,142740
2960,67.0,0.500303394,143207
2970,67.0,0.501694407,143691
2980,67.0,0.503557915,144175
2990,67.0,0.504897175,144664
3000,67.0,0.507312584,145140
3010,67.0,0.508704388,145621
3020,66.0,0.510076043,146100
3030,66.0,0.511436242,146582
3040,66.0,0.512817379,147064
3050,66.0,0.514219454,147557
3060,66.0,0.515710418,148039
3070,66.0,0.517611851,148540
3080,67.0,0.520544397,149023
3090,67.0,0.521914868,149507
3100,68.0,0.52329877,149986
3110,68.0,0.52469729,150467
3120,67.0,0.526070131,150937
3130,66.0,0.527445342,151405
3140,65.0,0.528807121,151867
3150,65.0,0.530395665,152350
3160,65.0,0.53386352,152821
3170,67.0,0.535284953,153303
3180,66.0,0.53666609,153784
3190,66.0,0.538056313,154275
3200,66.0,0.5394015,154764
3210,67.0,0.541030341,155251
3220,67.0,0.54242728,155734
3230,67.0,0.543802491,156206
3240,66.0,0.546364863,156687
3250,67.0,0.547736914,157171
3260,67.0,0.54911015,157657
3270,67.0,0.550674201,158133
3280,67.0,0.552753807,158621
3290,67.0,0.554121117,159107
3300,67.0,0.555591538,159596
3310,67.0,0.557004674,160078
3320,68.0,0.559462355,160548
3330,67.0,0.561258307,161031
3340,66.0,0.562651296,161521
3350,66.0,0.564503347,162017
3360,67.0,0.565912928,162508
3370,67.0,0.567388879,162989
3380,68.0,0.568745127,163460
3390,69.0,0.570882413,163943
3400,68.0,0.573498514,164436
3410,68.0,0.574876095,164927
3420,68.0,0.576671257,165414
3430,69.0,0.578084789,165901
3440,68.0,0.579777235,166386
3450,69.0,0.581137829,166857
3460,69.0,0.582518176,167348
3470,69.0,0.583881931,167826
3480,69.0,0.586330131,168304
3490,69.0,0.587695465,168781
3500,69.0,0.589300602,169263
3510,68.0,0.590703468,169745
3520,68.0,0.59211621,170234
3530,68.0,0.593495372,170712
3540,68.0,0.594876114,171199
3550,69.0,0.596276609,171677
3560,68.0,0.599155031,172133
3570,68.0,0.600483625,172608
3580,68.0,0.601846984,173090
3590,68.0,0.603621208,173561
3600,68.0,0.605433752,174036
3610,68.0,0.607054692,174516
3620,67.0,0.608425953,174997
3630,67.0,0.609988029,175478
3640,68.0,0.612632179,175949
3650,68.0,0.61417055,176430
3660,69.0,0.61572986,176929
3670,68.0,0.617126009,177417
3680,68.0,0.618506751,177906
3690,68.0,0.620288876,178391
3700,68.0,0.621697667,178886
3710,69.0,0.623210754,179370
3720,68.0,0.625752978,179848
3730,69.0,0.627151498,180336
3740,70.0,0.628906363,180815
3750,70.0,0.630758019,181279
3760,70.0,0.632227255,181764
3770,71.0,0.633595355,182243
3780,70.0,0.635050764,182720
3790,71.0,0.636398715,183189
3800,71.0,0.638876544,183662
3810,70.0,0.640377779,184139
3820,71.0,0.641739558,184628
3830,70.0,0.6430883,185101
3840,70.0,0.644720301,185578
3850,76.0,0.647055908,186057
3860,78.0,0.648589143,186538
3870,78.0,0.649957243,187026
3880,78.0,0.652541738,187509
3890,79.0,0.653999517,187983
3900,79.0,0.655457691,188463
3910,79.0,0.657506483,188934
3920,79.0,0.658908954,189406
3930,79.0,0.660382931,189884
3940,78.0,0.661734044,190367
3950,78.0,0.663187477,190855
3960,78.0,0.666310443,191344
3970,78.0,0.667656814,191823
3980,78.0,0.669582742,192323
3990,78.0,0.670976521,192804
4000,78.0,0.672330399,193278
4010,78.0,0.67367203,193757
4020,78.0,0.675034599,194245
4030,77.0,0.676407044,194727
4040,77.0,0.678909367,195214
4050,77.0,0.680304726,195696
4060,76.0,0.681996777,196184
4070,78.0,0.683525668,196671
4080,77.0,0.685106311,197156
4090,77.0,0.686719744,197642
4100,78.0,0.688093375,198137
4110,78.0,0.689548783,198622
4120,77.0,0.692069279,199097
4130,78.0,0.693421972,199582
4140,78.0,0.694950862,200072
4150,78.0,0.696317382,200552
4160,78.0,0.697692198,201037
4170,78.0,0.699188298,201521
4180,77.0,0.701009534,202007
4190,76.0,0.702686572,202477
4200,76.0,0.705100006,202965
4210,76.0,0.706566081,203460
4220,76.0,0.707938527,203945
4230,77.0,0.709392356,204431
4240,76.0,0.711472753,204914
4250,77.0,0.712941989,205407
4260,76.0,0.714334583,205891
4270,76.0,0.71574693,206362
4280,76.0,0.718591376,206835
4290,76.0,0.719989106,207313
4300,75.0,0.721514046,207802
4310,75.0,0.722902689,208282
4320,77.0,0.724300418,208759
4330,77.0,0.725675629,209244
4340,76.0,0.727020421,209722
4350,77.0,0.729070003,210201
4360,77.0,0.731592079,210684
4370,75.0,0.73296492,211167
4380,74.0,0.734332625,211644
4390,75.0,0.735700725,212126
4400,77.0,0.737068035,212598
4410,77.0,0.738853716,213074
4420,77.0,0.740484532,213551
4430,78.0,0.741851447,214036
4440,77.0,0.743210066,214514
4450,78.0,0.744560783,215000
4460,78.0,0.745920587,215483
4470,77.0,0.747784884,215968
4480,76.0,0.749573725,216460
4490,77.0,0.7509679,216945
4500,76.0,0.75234074,217428
4510,77.0,0.754783803,217916
4520,78.0,0.75612978,218401
4530,78.0,0.75772346,218895
4540,78.0,0.759094721,219375
4550,78.0,0.76045413,219863
4560,77.0,0.761812749,220354
4570,76.0,0.763395368,220832
4580,76.0,0.764799419,221328
4590,77.0,0.767176112,221805
4600,77.0,0.768506286,222273
4610,77.0,0.769852262,222755
4620,77.0,0.771777795,223221
4630,78.0,0.773333944,223697
4640,78.0,0.774712315,224175
4650,78.0,0.776091081,224666
4660,77.0,0.777430341,225141
4670,77.0,0.780363282,225624
4680,78.0,0.781704913,226104
4690,78.0,0.783170198,226589
4700,78.0,0.785197261,227054
4710,77.0,0.786705608,227538
4720,78.0,0.788075288,228011
4730,78.0,0.789420869,228481
4740,78.0,0.790785414,228969
4750,79.0,0.793200823,229466
4760,78.0,0.794651096,229941
4770,78.0,0.796120727,230424
4780,77.0,0.79757258,230901
4790,77.0,0.798965174,231380
4800,78.0,0.800306015,231868
4810,78.0,0.80177367,232356
4820,77.0,0.80346572,232842
4830,78.0,0.806382463,233337
4840,79.0,0.807997082,233827
4850,79.0,0.809620393,234316
4860,79.0,0.811268197,234802
4870,80.0,0.81288242,235283
4880,79.0,0.814325582,235765
4890,79.0,0.815711064,236236
4900,79.0,0.817074423,236720
4910,79.0,0.819835512,237210
4920,79.0,0.821207563,237699
4930,78.0,0.822557095,238177
4940,79.0,0.82418159,238653
4950,77.0,0.825564702,239141
4960,78.0,0.82691937,239616
4970,78.0,0.828770631,240103
4980,77.0,0.830182188,240588
4990,77.0,0.832711375,241072
5000,77.0,0.834078289,241555
