,train,test
0.1,0.0019425215881822629,0.00043851921148714914
0.2,0.004034771808034463,0.0004988057265078144
0.3,0.006885699769994697,0.0007418480858833968
0.4,0.007631577491875541,0.0005435267848324515
0.5,0.008669564317336198,0.0003788647962307878
0.6,0.009250701038144854,0.00035160549389510185
0.7,0.011919347230573408,0.0003373042367276702
0.8,0.013566204154001615,0.00032276594214865063
0.9,0.015107026341967556,0.00028555106852513613
