k,GMM,Kmeans
2,0.6238797948895335,0.6236813470737143
3,0.6029723964114512,0.6047567834908686
4,0.5959549632839571,0.5941427672119324
5,0.5693453814761603,0.577845974741506
6,0.5782212834898385,0.5793679171972003
7,0.5628539353958848,0.5641392519731445
8,0.5601062769461176,0.5592470830813275
9,0.5468798627914628,0.5538534939273763
10,0.5422985382937385,0.5512479766842592
15,0.5407241372093441,0.5479353792148136
20,0.539711477612922,0.5533017885770445
25,0.5675518882114936,0.5676377108719971
30,0.5649264074201139,0.5651312078873831
35,0.5642586904511864,0.5644402801183505
40,0.5483243634894579,0.5537053708856723
