,train,test
0.1,0.15521186008788845,0.009739630205842786
0.2,0.1953390543629439,0.009028043896171312
0.3,0.2357807972832461,0.008574433302806028
0.4,0.265988054894683,0.008189326521414842
0.5,0.3065559807304453,0.007410579611791946
0.6,0.3426843538715502,0.007893345806769503
0.7,0.36731230390092834,0.0060612046399342034
0.8,0.3947053743492347,0.0059896193415966085
0.9,0.4206872030612544,0.004719098815371581
