,x,y,target
0,19.63504981994629,0.0996018499135971,0.0
1,-0.2673659920692444,-21.622451782226562,0.0
2,-49.24742889404297,-5.818778991699219,1.0
3,-42.607906341552734,2.21492600440979,2.0
4,39.0096435546875,-19.153234481811523,1.0
5,-15.061192512512207,23.65705680847168,1.0
6,35.20375061035156,11.872878074645996,3.0
7,-19.749643325805664,4.690315246582031,0.0
8,-12.376068115234375,-20.006139755249023,3.0
9,6.200178623199463,-9.33118724822998,0.0
10,-24.604467391967773,31.611818313598633,2.0
11,-48.247291564941406,3.2524051666259766,3.0
12,8.457444190979004,24.5509090423584,2.0
13,-34.291419982910156,-1.1054117679595947,3.0
14,15.700078964233398,-7.6919074058532715,0.0
15,-18.085119247436523,2.6420347690582275,0.0
16,-8.857593536376953,-6.792176246643066,0.0
17,-3.0324959754943848,-11.747655868530273,3.0
18,42.72163391113281,-30.89134979248047,1.0
19,-41.65664291381836,19.45269012451172,3.0
20,-33.406864166259766,8.383330345153809,2.0
21,40.01993942260742,1.0961936712265015,2.0
22,14.59271240234375,23.448881149291992,2.0
23,-4.414743900299072,-27.61524772644043,0.0
24,-26.98733901977539,2.185410737991333,0.0
25,-4.192848205566406,-12.630455017089844,3.0
26,26.299821853637695,-21.45242691040039,0.0
27,36.847999572753906,-23.618528366088867,0.0
28,38.156131744384766,-15.502349853515625,3.0
29,13.214571952819824,8.429253578186035,3.0
30,8.930458068847656,20.94413948059082,1.0
31,24.078031539916992,-25.84715461730957,2.0
32,36.01901626586914,8.819133758544922,3.0
33,4.324979782104492,36.45883560180664,3.0
34,-2.3673458099365234,-5.732538223266602,3.0
35,-15.489185333251953,7.599606513977051,1.0
36,-29.304136276245117,8.686372756958008,3.0
37,-10.542627334594727,19.696409225463867,2.0
38,6.806121349334717,14.200881958007812,1.0
39,-17.354143142700195,39.498600006103516,3.0
40,-39.13314437866211,11.254602432250977,3.0
41,-20.997114181518555,-19.22527313232422,2.0
42,-11.787571907043457,7.551630973815918,3.0
43,-22.238981246948242,-3.5846033096313477,1.0
44,3.068714141845703,22.400156021118164,3.0
45,-6.26055383682251,-10.555891036987305,1.0
46,10.376160621643066,13.02115535736084,2.0
47,40.6371955871582,7.0703277587890625,2.0
48,-35.3236198425293,-2.2357184886932373,3.0
49,2.991332769393921,29.569847106933594,0.0
50,-12.471382141113281,36.15523147583008,2.0
51,-1.4313433170318604,25.278240203857422,0.0
52,-29.486831665039062,12.748183250427246,0.0
53,0.04163185879588127,-1.0464303493499756,0.0
54,-14.779524803161621,33.01186752319336,2.0
55,-15.532989501953125,-3.2712645530700684,0.0
56,-46.051700592041016,1.9973974227905273,3.0
57,-23.02446937561035,-9.036139488220215,2.0
58,8.573436737060547,-22.024858474731445,0.0
59,-9.893932342529297,16.67221450805664,2.0
60,35.79110336303711,-34.871978759765625,3.0
61,27.042644500732422,-18.655885696411133,1.0
62,24.513011932373047,-38.0001220703125,1.0
63,-26.6085147857666,21.20619010925293,1.0
64,7.041454315185547,11.330310821533203,2.0
65,15.881796836853027,-12.076986312866211,1.0
66,-6.593804836273193,31.560609817504883,3.0
67,-42.59700393676758,12.756897926330566,3.0
68,-28.81937599182129,23.099267959594727,1.0
69,-5.391763210296631,34.326072692871094,1.0
70,-20.537330627441406,-8.903779983520508,2.0
71,-28.551708221435547,-23.790283203125,1.0
72,-33.4255256652832,-15.417187690734863,0.0
73,-34.15808868408203,4.413471221923828,3.0
74,7.1890435218811035,11.681733131408691,2.0
75,-11.783102035522461,-18.838274002075195,2.0
76,17.536325454711914,-8.3174467086792,3.0
77,-33.32252883911133,-25.988746643066406,2.0
78,22.047569274902344,16.26886749267578,3.0
79,-1.0843061208724976,10.385636329650879,1.0
80,-17.795467376708984,15.67951774597168,3.0
81,5.625848770141602,-15.296754837036133,1.0
82,43.40541076660156,-24.091188430786133,0.0
83,-1.0155768394470215,18.16386604309082,3.0
84,33.789676666259766,-28.751249313354492,2.0
85,-25.408885955810547,6.077258110046387,3.0
86,1.8352956771850586,-0.6068225502967834,3.0
87,32.35675048828125,-5.657247066497803,3.0
88,-22.072168350219727,-20.274465560913086,2.0
89,17.388994216918945,12.209234237670898,1.0
90,14.706873893737793,25.103172302246094,2.0
91,-36.0653076171875,14.241494178771973,3.0
92,-4.399229526519775,-12.508414268493652,3.0
93,28.23770523071289,-27.208410263061523,1.0
94,3.7202706336975098,6.815718650817871,1.0
95,30.177352905273438,-33.81185531616211,2.0
96,-41.833641052246094,10.085822105407715,3.0
97,35.5544319152832,-11.327428817749023,2.0
98,42.09475326538086,3.259648323059082,0.0
99,-18.051124572753906,-6.174874305725098,2.0
100,-12.885282516479492,18.31418800354004,2.0
101,-23.002761840820312,11.499740600585938,2.0
102,26.44272804260254,-29.51070785522461,1.0
103,1.0465575456619263,6.722337245941162,2.0
104,-37.58638381958008,-2.3410727977752686,3.0
105,-2.3325443267822266,5.173167705535889,3.0
106,42.3408317565918,-11.784997940063477,3.0
107,4.248257160186768,-1.114072561264038,1.0
108,25.672639846801758,-30.123796463012695,1.0
109,-21.608091354370117,2.049635648727417,0.0
110,5.618635177612305,3.2595510482788086,0.0
111,1.5076878070831299,-3.9485509395599365,3.0
112,10.084930419921875,-21.68760871887207,2.0
113,-20.88551902770996,-10.783041954040527,1.0
114,50.911766052246094,-7.82509183883667,3.0
115,-5.183648109436035,11.57285213470459,1.0
116,27.26393699645996,-10.981515884399414,2.0
117,-0.39658331871032715,29.468788146972656,2.0
118,14.778244018554688,17.949478149414062,1.0
119,-31.087247848510742,5.795790672302246,1.0
120,7.099442005157471,-1.6624736785888672,1.0
121,-4.657960414886475,18.366403579711914,1.0
122,48.29630661010742,-19.904062271118164,1.0
123,-4.030735015869141,-5.436311721801758,1.0
124,-9.594799995422363,32.86967849731445,1.0
125,-15.639108657836914,-32.20732116699219,0.0
126,7.878709316253662,14.428631782531738,2.0
127,-22.6040096282959,-20.12148094177246,3.0
128,-1.3612561225891113,23.268665313720703,0.0
129,-32.688480377197266,-3.8481240272521973,2.0
130,19.962127685546875,-6.121636867523193,0.0
131,32.59021759033203,-19.27843475341797,2.0
132,-20.924484252929688,0.1087680533528328,0.0
133,-15.587852478027344,8.316542625427246,3.0
134,29.189905166625977,3.4847121238708496,3.0
135,10.119940757751465,14.420530319213867,3.0
136,-23.681137084960938,7.768309116363525,1.0
137,-3.7013192176818848,38.735572814941406,3.0
138,14.804540634155273,-17.992101669311523,2.0
139,-27.397388458251953,10.921982765197754,3.0
140,-9.772347450256348,12.478841781616211,3.0
141,-24.320903778076172,-9.509024620056152,3.0
142,44.127498626708984,7.009886264801025,2.0
143,-2.071823835372925,24.367530822753906,0.0
144,19.184133529663086,-28.50889778137207,1.0
145,-15.124251365661621,25.385889053344727,0.0
146,5.7704854011535645,6.144899368286133,2.0
147,-11.194869041442871,-6.6655802726745605,0.0
148,28.644668579101562,-9.827286720275879,3.0
149,-22.022748947143555,-25.833707809448242,3.0
150,24.016279220581055,-34.209434509277344,1.0
151,45.67049026489258,-16.822486877441406,1.0
152,-15.135425567626953,-31.595470428466797,1.0
153,38.70470428466797,4.063560962677002,2.0
154,16.17730140686035,1.1212750673294067,2.0
155,-32.90104293823242,-0.8432939648628235,2.0
156,23.116016387939453,-23.328166961669922,0.0
157,-33.205806732177734,-0.10880441218614578,3.0
158,-43.09897994995117,-6.88821268081665,3.0
159,-5.1221232414245605,-21.433629989624023,0.0
160,11.883870124816895,32.489044189453125,3.0
161,34.55614471435547,10.531854629516602,2.0
162,5.856648921966553,27.871158599853516,2.0
163,-12.63918685913086,8.81357192993164,1.0
164,37.05554962158203,-29.4306640625,2.0
165,44.917205810546875,-8.44835090637207,0.0
166,41.58058166503906,-19.605669021606445,1.0
167,-7.934892654418945,-17.71351432800293,3.0
168,32.6751594543457,-37.70863723754883,2.0
169,-13.720993995666504,-15.224577903747559,1.0
170,-21.723033905029297,20.281635284423828,1.0
171,-5.73866605758667,28.990007400512695,1.0
172,-19.932605743408203,-11.25235366821289,1.0
173,-46.089813232421875,6.4821906089782715,3.0
174,48.315311431884766,-21.609588623046875,0.0
175,39.490684509277344,11.326659202575684,3.0
176,12.863085746765137,-3.0429439544677734,2.0
177,-26.289804458618164,26.20233154296875,2.0
178,42.77018356323242,-12.84760856628418,3.0
179,8.943897247314453,26.42155647277832,3.0
180,-31.53057289123535,25.10271453857422,2.0
181,-40.609344482421875,5.2679033279418945,2.0
182,-30.54351043701172,25.407772064208984,3.0
183,-15.355939865112305,20.318273544311523,3.0
184,20.259540557861328,17.921762466430664,2.0
185,-5.359795570373535,24.04305076599121,1.0
186,4.066755771636963,11.101701736450195,0.0
187,18.35353660583496,-27.022991180419922,1.0
188,45.05190658569336,0.7759346961975098,0.0
189,-23.62944984436035,-5.894066333770752,3.0
190,-3.3607869148254395,1.9983270168304443,1.0
191,-1.9260579347610474,-7.19755744934082,1.0
192,1.0869230031967163,-22.181961059570312,1.0
193,-9.951308250427246,13.772111892700195,3.0
194,-3.0155911445617676,14.00524616241455,0.0
195,-7.954142093658447,-9.434024810791016,0.0
196,17.520259857177734,-7.300671100616455,2.0
197,24.10663414001465,-18.66632080078125,0.0
198,36.68370819091797,-26.36287498474121,0.0
199,37.95208740234375,-24.49225616455078,0.0
200,-28.860702514648438,-18.65936279296875,3.0
201,-11.97750473022461,0.15486784279346466,1.0
202,-4.715887546539307,23.050315856933594,0.0
203,35.19830322265625,-17.61056137084961,3.0
204,30.78655433654785,-26.543731689453125,1.0
205,17.241918563842773,12.576784133911133,2.0
206,-25.56209945678711,-1.7385395765304565,3.0
207,-30.27094268798828,0.30463212728500366,0.0
208,4.539206027984619,-20.000036239624023,2.0
209,51.604854583740234,-9.775123596191406,3.0
210,48.76910400390625,2.6728427410125732,2.0
211,16.533443450927734,8.33727741241455,1.0
212,8.709436416625977,-7.622089385986328,2.0
213,-13.093342781066895,7.8526997566223145,3.0
214,1.8628534078598022,-21.725305557250977,3.0
215,-8.122274398803711,35.2362060546875,0.0
216,50.09378433227539,4.99487829208374,3.0
217,9.60920524597168,14.242552757263184,2.0
218,0.08891607820987701,1.4225947856903076,0.0
219,-39.5484504699707,-10.472386360168457,1.0
220,-4.651864051818848,18.058629989624023,1.0
221,37.25767517089844,9.629473686218262,3.0
222,11.854615211486816,-6.966810703277588,0.0
223,-4.221818923950195,-10.94294261932373,3.0
224,13.962326049804688,18.702177047729492,1.0
225,12.847329139709473,16.540788650512695,0.0
226,-3.7575318813323975,11.157811164855957,1.0
227,-15.557829856872559,30.793994903564453,0.0
228,-12.061466217041016,5.716063499450684,0.0
229,28.33078956604004,-10.831282615661621,3.0
230,-22.21383285522461,33.54106140136719,3.0
231,21.84627914428711,12.43455696105957,3.0
232,-25.952924728393555,24.26543426513672,0.0
233,19.28390121459961,5.691723823547363,3.0
234,16.085344314575195,-11.309690475463867,0.0
235,-30.646263122558594,28.363162994384766,3.0
236,14.825325965881348,-16.73540687561035,1.0
237,-19.729063034057617,-1.867364764213562,3.0
238,34.05116271972656,-1.5834624767303467,0.0
239,-37.877384185791016,26.966115951538086,0.0
240,-25.69477653503418,9.15237808227539,0.0
241,12.017648696899414,-4.003027439117432,1.0
242,-3.077805757522583,-1.862269639968872,1.0
243,0.768581211566925,-9.668827056884766,3.0
244,-3.143156051635742,-9.68946361541748,3.0
245,-13.141185760498047,4.1873908042907715,0.0
246,23.721363067626953,3.92942214012146,2.0
247,-7.675557613372803,-15.589034080505371,3.0
248,-25.70040512084961,28.149038314819336,1.0
249,8.83554458618164,21.222505569458008,3.0
250,-8.557052612304688,-29.317588806152344,0.0
251,-20.64973258972168,28.568872451782227,1.0
252,-42.770973205566406,-11.201699256896973,1.0
253,-29.791975021362305,28.430553436279297,2.0
254,-11.290928840637207,36.713436126708984,3.0
255,29.892749786376953,-23.288076400756836,2.0
256,-5.263619899749756,36.20408630371094,2.0
257,-6.814737319946289,-7.655392169952393,2.0
258,-13.730438232421875,39.93061447143555,3.0
259,34.75946044921875,-6.625356674194336,3.0
260,-40.43349075317383,9.547371864318848,3.0
261,-18.38968276977539,-17.684988021850586,2.0
262,39.59933853149414,10.745943069458008,3.0
263,-5.91788387298584,14.088706970214844,1.0
264,-15.073312759399414,24.37116241455078,0.0
265,-12.467453956604004,-12.946250915527344,3.0
266,-5.261561393737793,-17.908994674682617,2.0
267,-16.742698669433594,32.25972366333008,0.0
268,-6.881472587585449,12.793315887451172,0.0
269,-22.54683494567871,-8.14173412322998,0.0
270,-35.0987663269043,1.3912005424499512,3.0
271,32.426937103271484,8.440465927124023,3.0
272,1.2328276634216309,-6.780022621154785,1.0
273,-34.04187774658203,32.56435775756836,1.0
274,48.587223052978516,-17.674457550048828,1.0
275,46.9617805480957,10.228988647460938,2.0
276,30.665884017944336,-32.42652893066406,3.0
277,28.11159324645996,-19.79794692993164,0.0
278,-37.84547805786133,3.7434706687927246,1.0
279,-31.38833236694336,19.327442169189453,1.0
280,23.394365310668945,-12.841195106506348,2.0
281,47.13236999511719,-10.688743591308594,1.0
282,-20.578187942504883,-5.987616539001465,0.0
283,42.42777633666992,-4.655166149139404,0.0
284,40.233333587646484,9.91336727142334,1.0
285,1.8048979043960571,-13.378748893737793,0.0
286,-30.929153442382812,-6.841690540313721,3.0
287,-13.398877143859863,9.602302551269531,1.0
288,1.5184292793273926,3.626547336578369,0.0
289,31.790658950805664,0.6454324126243591,2.0
290,-5.974822998046875,4.48634672164917,0.0
291,-9.205002784729004,0.9648008942604065,1.0
292,-29.947982788085938,22.361597061157227,1.0
293,-36.277687072753906,-18.758668899536133,3.0
294,34.64105987548828,10.205132484436035,3.0
295,-3.2343616485595703,-14.100359916687012,2.0
296,22.98723793029785,-15.190414428710938,2.0
297,32.5707893371582,-21.545244216918945,3.0
298,37.889469146728516,-2.0510969161987305,0.0
299,0.9323050379753113,-16.146116256713867,2.0
300,-19.861207962036133,-33.6911735534668,2.0
301,-17.250574111938477,10.518170356750488,3.0
302,-32.285247802734375,-16.555076599121094,3.0
303,6.885615825653076,10.0853853225708,1.0
304,8.433886528015137,-16.252864837646484,0.0
305,52.73343276977539,-8.952214241027832,3.0
306,9.681422233581543,-7.562619686126709,2.0
307,46.99440002441406,-18.975351333618164,1.0
308,31.167936325073242,0.38672223687171936,2.0
309,-0.2977302372455597,3.6118922233581543,0.0
310,-15.72977352142334,-6.485332489013672,0.0
311,-19.019657135009766,-26.013702392578125,2.0
312,23.957441329956055,-26.094205856323242,1.0
313,-24.11383056640625,13.431641578674316,3.0
314,-9.490571975708008,18.186899185180664,1.0
315,-14.69041919708252,-2.7536964416503906,0.0
316,14.231586456298828,34.16008758544922,3.0
317,10.540963172912598,-22.038619995117188,2.0
318,-0.06238103657960892,16.844560623168945,2.0
319,15.489148139953613,18.348125457763672,0.0
320,-33.06987380981445,4.515874862670898,3.0
321,38.174034118652344,-15.938108444213867,3.0
322,26.022092819213867,-23.94573974609375,0.0
323,-24.0526065826416,-17.279495239257812,3.0
324,-13.784262657165527,22.511646270751953,2.0
325,-33.5806770324707,-1.7490909099578857,3.0
326,2.8828184604644775,-18.98049545288086,2.0
327,-14.054561614990234,21.04534912109375,2.0
328,-32.94297790527344,3.7902565002441406,3.0
329,0.7850872278213501,-10.10474967956543,1.0
330,-8.341227531433105,-21.547121047973633,0.0
331,-8.9827299118042,41.87299346923828,0.0
332,-19.187509536743164,-2.840822219848633,3.0
333,-4.911845684051514,-19.25025749206543,1.0
334,-2.338259220123291,2.7073378562927246,1.0
335,-25.874229431152344,0.36858269572257996,2.0
336,-8.526212692260742,-19.53256607055664,2.0
337,-0.6679930686950684,-4.48569917678833,2.0
338,34.70354080200195,-19.20651626586914,3.0
339,-18.785274505615234,-16.695878982543945,1.0
340,17.362228393554688,-32.8740234375,2.0
341,-3.1819050312042236,13.577842712402344,2.0
342,20.795608520507812,9.7346773147583,3.0
343,-27.555160522460938,-9.906550407409668,2.0
344,0.19768348336219788,5.622745037078857,3.0
345,-37.06271743774414,-10.505780220031738,3.0
346,42.15791320800781,-18.974254608154297,0.0
347,-18.859272003173828,31.945907592773438,0.0
348,-16.883230209350586,17.68454933166504,1.0
349,-22.763046264648438,-3.6590185165405273,3.0
350,-28.545629501342773,-0.7740095257759094,3.0
351,-2.9107627868652344,2.1414990425109863,1.0
352,-10.85279369354248,-16.34010124206543,1.0
353,-20.76403045654297,36.399986267089844,2.0
354,27.359519958496094,-3.798980474472046,3.0
355,18.673376083374023,4.705594062805176,2.0
356,43.07002258300781,-8.871079444885254,0.0
357,-8.19130802154541,22.072450637817383,2.0
358,3.6913001537323,3.869128465652466,0.0
359,27.007219314575195,-13.365222930908203,3.0
360,41.78806686401367,-7.042713642120361,0.0
361,12.270716667175293,11.908987998962402,0.0
362,-8.980178833007812,-7.14947509765625,0.0
363,36.515159606933594,-33.27277755737305,0.0
364,30.419891357421875,-13.051928520202637,0.0
365,-23.176494598388672,14.054498672485352,3.0
366,1.4549816846847534,23.88243293762207,2.0
367,39.61208724975586,-8.324865341186523,0.0
368,31.83539390563965,-2.4245924949645996,3.0
369,20.378936767578125,15.045065879821777,3.0
370,40.31818389892578,-30.53354263305664,2.0
371,-37.63579559326172,-19.422332763671875,3.0
372,-14.337544441223145,16.830005645751953,1.0
373,10.457146644592285,17.821474075317383,3.0
374,39.023983001708984,-7.82715368270874,0.0
375,-30.733945846557617,-7.878871440887451,2.0
376,-15.222803115844727,16.65911865234375,0.0
377,-31.43586540222168,-32.53274154663086,3.0
378,-29.460548400878906,-2.3556792736053467,2.0
379,33.74219512939453,-3.4194564819335938,2.0
380,23.685043334960938,-13.764909744262695,0.0
381,-22.477956771850586,-29.862857818603516,3.0
382,8.64677619934082,9.215021133422852,1.0
383,-17.349912643432617,-18.52094268798828,3.0
384,40.39811706542969,-6.410915851593018,1.0
385,-20.623212814331055,25.930828094482422,0.0
386,23.364770889282227,-27.27737045288086,0.0
387,-24.085325241088867,39.93013381958008,0.0
388,-34.13440704345703,8.664361000061035,2.0
389,7.264775276184082,16.61628532409668,2.0
390,37.01852035522461,5.879084587097168,3.0
391,-22.811275482177734,-10.293272018432617,0.0
392,-21.785781860351562,22.346210479736328,0.0
393,9.052014350891113,-29.59662628173828,0.0
394,-19.95342254638672,20.142993927001953,2.0
395,-19.21988868713379,31.801301956176758,0.0
396,-7.275094032287598,9.037737846374512,3.0
397,46.6262321472168,-22.67844581604004,1.0
398,-17.21415901184082,-33.18408966064453,1.0
399,-10.191934585571289,24.787708282470703,3.0
400,40.52505874633789,-14.750932693481445,1.0
401,2.482619047164917,18.50736427307129,3.0
402,-37.06983184814453,14.531539916992188,3.0
403,5.998880386352539,20.356731414794922,2.0
404,-49.812278747558594,4.887742519378662,0.0
405,8.930259704589844,-30.03432273864746,0.0
406,33.07511520385742,8.416553497314453,3.0
407,-23.769351959228516,-14.26309585571289,2.0
408,-28.267332077026367,8.6404390335083,3.0
409,27.262971878051758,-14.228801727294922,1.0
410,4.3390092849731445,10.52497673034668,0.0
411,-8.512857437133789,15.84408950805664,3.0
412,11.371665000915527,-14.852611541748047,1.0
413,-14.647080421447754,-19.018354415893555,3.0
414,0.7781128287315369,12.333528518676758,1.0
415,8.833185195922852,35.646392822265625,3.0
416,9.01180648803711,5.727959156036377,2.0
417,42.74114227294922,-16.093233108520508,0.0
418,-11.4793119430542,15.251296997070312,1.0
419,-8.71401309967041,11.03896713256836,1.0
420,-27.11887550354004,11.790342330932617,3.0
421,32.42148208618164,-24.480337142944336,2.0
422,47.293853759765625,-23.682783126831055,3.0
423,18.899383544921875,-25.35805320739746,3.0
424,36.60197448730469,0.06432677060365677,3.0
425,-29.863529205322266,-7.555140495300293,2.0
426,-41.961666107177734,12.768515586853027,3.0
427,-6.2145609855651855,-32.815147399902344,3.0
428,10.84313678741455,20.840944290161133,3.0
429,-37.51234817504883,26.998046875,0.0
430,-21.74564552307129,5.374824047088623,0.0
431,-43.08688735961914,-6.734114646911621,3.0
432,-30.78271484375,6.074605464935303,1.0
433,14.796221733093262,11.567180633544922,0.0
434,-38.454383850097656,3.7823143005371094,0.0
435,52.971065521240234,-3.8363823890686035,1.0
436,26.7772159576416,-5.673233985900879,2.0
437,-16.078441619873047,31.262460708618164,0.0
438,45.349464416503906,-4.59979248046875,1.0
439,-4.296924591064453,31.594709396362305,0.0
440,-12.985458374023438,-23.812965393066406,2.0
441,-22.053014755249023,-14.260189056396484,2.0
442,-32.04384994506836,-9.34361457824707,2.0
443,13.383843421936035,12.353137016296387,2.0
444,26.616910934448242,-23.15059471130371,0.0
445,9.73173999786377,1.0171873569488525,2.0
446,37.785728454589844,-37.5902099609375,0.0
447,-17.68303871154785,-27.591835021972656,0.0
448,30.116174697875977,-0.47134438157081604,0.0
449,0.4391617476940155,12.847664833068848,2.0
450,-26.57788848876953,1.823541283607483,1.0
451,41.673828125,-10.860671043395996,2.0
452,-1.3684414625167847,34.216941833496094,2.0
453,-7.489480495452881,21.890060424804688,2.0
454,-24.18448257446289,0.1751285046339035,2.0
455,-8.463433265686035,28.50432586669922,2.0
456,14.657766342163086,24.8767032623291,2.0
457,15.985311508178711,5.235602855682373,2.0
458,12.427316665649414,23.497602462768555,3.0
459,-19.0889835357666,9.51763916015625,2.0
460,-16.82119369506836,25.72199249267578,2.0
461,-13.226075172424316,29.240379333496094,3.0
462,-32.982444763183594,13.806426048278809,1.0
463,20.64027976989746,-5.5346150398254395,0.0
464,-0.9280875325202942,-33.79568862915039,0.0
465,-18.479860305786133,20.37694549560547,2.0
466,51.040611267089844,-17.785301208496094,0.0
467,17.225257873535156,-32.746116638183594,2.0
468,16.230854034423828,25.86554718017578,3.0
469,32.62479019165039,-0.8451834917068481,3.0
470,14.69947624206543,-0.9110694527626038,1.0
471,5.9390716552734375,-16.2756290435791,0.0
472,-13.905289649963379,-4.370235919952393,0.0
473,44.378604888916016,-0.9997266530990601,1.0
474,-30.662538528442383,3.7882111072540283,3.0
475,-23.984817504882812,14.904523849487305,3.0
476,-11.22221565246582,31.874727249145508,1.0
477,-26.549325942993164,21.222553253173828,1.0
478,31.064777374267578,-10.544466972351074,3.0
479,-8.151331901550293,6.968385219573975,3.0
480,-28.18391990661621,31.834779739379883,2.0
481,16.30622100830078,18.748380661010742,1.0
482,-36.49919891357422,-7.120538711547852,3.0
483,34.478477478027344,1.9677777290344238,0.0
484,-2.5379087924957275,-33.48499298095703,2.0
485,3.448474884033203,24.09003257751465,3.0
486,20.98392677307129,-11.2382173538208,2.0
487,35.343040466308594,-31.851045608520508,2.0
488,-25.938682556152344,0.8555649518966675,0.0
489,6.785804748535156,22.580976486206055,3.0
490,27.543746948242188,-1.743672490119934,2.0
491,2.71355938911438,6.9939751625061035,1.0
492,-21.757984161376953,8.606727600097656,0.0
493,-10.43593692779541,25.41499900817871,3.0
494,5.798818111419678,-23.335283279418945,0.0
495,-28.067644119262695,-7.512890815734863,1.0
496,15.22922420501709,-5.60273551940918,0.0
497,-1.7475255727767944,29.488967895507812,1.0
498,-8.301382064819336,-4.912638187408447,0.0
499,-48.46699142456055,-6.464748382568359,2.0
500,8.81071662902832,10.764352798461914,2.0
501,-4.237858295440674,-27.78044891357422,0.0
502,4.56503438949585,-15.44798469543457,2.0
503,-16.591264724731445,-32.868072509765625,2.0
504,16.243227005004883,-35.424495697021484,3.0
505,45.376075744628906,-19.793941497802734,0.0
506,-12.063911437988281,6.955307960510254,1.0
507,6.336729049682617,17.701753616333008,1.0
508,-27.22344970703125,32.99796676635742,1.0
509,0.1227288544178009,5.865715503692627,2.0
510,-2.2605535984039307,-20.67806053161621,1.0
511,-29.915164947509766,-29.754165649414062,3.0
512,-15.854164123535156,-7.038216590881348,1.0
513,27.07176399230957,16.973413467407227,3.0
514,-1.8099822998046875,-23.884788513183594,2.0
515,-10.174967765808105,12.02092170715332,3.0
516,-0.1076871007680893,-17.27836036682129,2.0
517,14.369795799255371,0.9862569570541382,1.0
518,-35.71707534790039,22.100139617919922,3.0
519,47.93734359741211,-4.0989251136779785,0.0
520,35.423797607421875,-14.676176071166992,0.0
521,19.507511138916016,12.069856643676758,3.0
522,-45.7633056640625,0.5233396291732788,3.0
523,18.2153377532959,27.737438201904297,0.0
524,-17.631973266601562,-2.7561962604522705,2.0
525,32.651554107666016,11.619217872619629,0.0
526,7.613256454467773,-26.720046997070312,0.0
527,32.95780563354492,-28.37037467956543,1.0
528,-9.565118789672852,-10.406864166259766,1.0
529,8.866189956665039,-10.033596992492676,3.0
530,40.397178649902344,7.2772297859191895,2.0
531,3.181424379348755,-14.281208992004395,1.0
532,-37.91755294799805,15.105799674987793,3.0
533,53.726097106933594,-20.441390991210938,0.0
534,35.07874298095703,-30.185855865478516,2.0
535,14.89023494720459,-16.41078758239746,1.0
536,10.25048828125,26.85797691345215,1.0
537,37.73321533203125,8.457621574401855,3.0
538,18.234861373901367,-23.20267105102539,1.0
539,-0.22100810706615448,-9.207164764404297,1.0
540,1.8620600700378418,19.23029136657715,3.0
541,-22.592885971069336,-30.04928207397461,2.0
542,9.027029991149902,16.805503845214844,3.0
543,-21.936124801635742,-14.946109771728516,1.0
544,-15.355875968933105,2.8025600910186768,0.0
545,2.7535266876220703,-14.30757999420166,1.0
546,-2.9722495079040527,-11.449974060058594,3.0
547,1.8662742376327515,26.454729080200195,0.0
548,-23.259855270385742,9.527900695800781,0.0
549,-9.280556678771973,-13.571586608886719,0.0
550,-20.76374626159668,-15.186725616455078,0.0
551,-20.24361801147461,22.403154373168945,0.0
552,-34.062477111816406,24.73124122619629,3.0
553,-7.632969379425049,-14.403460502624512,0.0
554,32.64076614379883,5.146452903747559,3.0
555,28.953598022460938,-4.169092178344727,2.0
556,34.116817474365234,-35.419715881347656,1.0
557,43.96897888183594,-29.913257598876953,0.0
558,-19.477676391601562,-33.1934928894043,3.0
559,26.539188385009766,-17.712255477905273,2.0
560,16.400732040405273,3.8964109420776367,0.0
561,-21.021203994750977,17.149185180664062,2.0
562,6.68937873840332,-4.496864318847656,1.0
563,4.408682346343994,-9.688282012939453,1.0
564,5.773383140563965,9.084843635559082,1.0
565,3.5481274127960205,36.315826416015625,3.0
566,-44.40244674682617,-2.792837381362915,3.0
567,-27.74758529663086,37.95619583129883,1.0
568,10.458378791809082,32.7567138671875,3.0
569,10.746712684631348,27.71958351135254,2.0
570,11.895015716552734,14.547627449035645,0.0
571,-29.740385055541992,-12.960097312927246,3.0
572,24.98661231994629,-1.1779972314834595,2.0
573,30.063772201538086,1.1350423097610474,2.0
574,-20.783527374267578,25.87723731994629,0.0
575,29.523683547973633,-30.503660202026367,0.0
576,0.9131242036819458,22.473146438598633,2.0
577,-23.76906967163086,-24.185195922851562,1.0
578,-4.952714920043945,16.844133377075195,0.0
579,-8.087215423583984,-4.624533176422119,0.0
580,7.8572001457214355,-3.046414375305176,1.0
581,4.149947643280029,2.8982129096984863,1.0
582,0.019356677308678627,-3.793177366256714,2.0
583,-22.36927032470703,-28.434722900390625,1.0
584,-28.673309326171875,3.4992945194244385,0.0
585,-29.374452590942383,-4.269012928009033,0.0
586,-5.7339863777160645,-11.290390968322754,3.0
587,-27.56795310974121,15.369720458984375,0.0
588,12.32011890411377,-9.774544715881348,0.0
589,23.1403751373291,22.0700740814209,0.0
590,21.49317169189453,6.124757289886475,3.0
591,40.88467788696289,-22.06869888305664,1.0
592,44.96794128417969,-10.02787971496582,2.0
593,8.865327835083008,3.4364352226257324,3.0
594,31.957984924316406,1.790820598602295,3.0
595,12.371734619140625,15.622289657592773,1.0
596,35.74732971191406,-24.021760940551758,1.0
597,-29.545841217041016,-32.003562927246094,1.0
598,-22.94673728942871,-37.27866744995117,0.0
599,38.3322639465332,-4.223784446716309,0.0
600,31.001638412475586,-26.95665740966797,1.0
601,-28.407848358154297,-18.893421173095703,2.0
602,43.521488189697266,-18.25009536743164,0.0
603,-5.730672359466553,7.685340404510498,2.0
604,-20.563499450683594,-18.2078914642334,1.0
605,42.71027374267578,-30.959205627441406,1.0
606,16.299341201782227,1.1502538919448853,2.0
607,-21.36063575744629,24.303226470947266,0.0
608,49.15629577636719,-19.663740158081055,0.0
609,51.4401969909668,-10.20864486694336,3.0
610,33.91572952270508,-22.075895309448242,0.0
611,-27.408828735351562,8.935173988342285,2.0
612,-43.87773895263672,2.494856834411621,2.0
613,-0.2336573749780655,27.90567398071289,2.0
614,-33.241703033447266,-23.317577362060547,3.0
615,-3.1560232639312744,-2.9269275665283203,2.0
616,32.2049674987793,-8.064532279968262,2.0
617,-23.461275100708008,-11.980425834655762,3.0
618,31.38221549987793,-7.379067897796631,1.0
619,38.24123764038086,-9.217183113098145,0.0
620,33.70338439941406,-1.6385220289230347,2.0
621,-31.309080123901367,-18.025924682617188,3.0
622,20.183393478393555,21.650928497314453,1.0
623,7.435936450958252,8.10047721862793,2.0
624,-30.828264236450195,36.178611755371094,3.0
625,-14.866583824157715,-36.37385559082031,0.0
626,46.39384460449219,-10.119400024414062,2.0
627,-15.284064292907715,-24.57027816772461,1.0
628,-28.27088165283203,18.46675682067871,2.0
629,23.16478729248047,9.57668685913086,3.0
630,40.57374954223633,-18.11507225036621,0.0
631,25.085920333862305,-34.837745666503906,0.0
632,-13.315068244934082,-14.663359642028809,1.0
633,22.915849685668945,-7.662769794464111,3.0
634,45.01155471801758,-20.861507415771484,0.0
635,-15.763434410095215,9.387185096740723,2.0
636,19.38589096069336,22.080034255981445,3.0
637,-25.817819595336914,29.53296661376953,2.0
638,-16.122024536132812,-11.639537811279297,1.0
639,-40.270286560058594,14.98206901550293,2.0
640,11.243851661682129,-26.0945987701416,1.0
641,-34.65486145019531,-3.066453456878662,1.0
642,36.8032112121582,2.4392197132110596,0.0
643,25.082151412963867,5.180172443389893,3.0
644,13.48562240600586,-20.824655532836914,1.0
645,-23.43063735961914,-25.413991928100586,1.0
646,-26.53620147705078,-33.280967712402344,0.0
647,30.913789749145508,-17.178497314453125,1.0
648,-22.581329345703125,34.70132064819336,2.0
649,9.142904281616211,-3.8033556938171387,0.0
650,33.55260467529297,-4.146879196166992,2.0
651,-10.826361656188965,7.308810710906982,3.0
652,40.98693084716797,-13.820951461791992,3.0
653,19.19952964782715,26.548412322998047,1.0
654,23.698936462402344,-10.64899730682373,2.0
655,5.985286235809326,-9.333271980285645,0.0
656,-29.917325973510742,-29.319257736206055,3.0
657,12.72446346282959,1.3377916812896729,1.0
658,-17.481788635253906,-5.865338325500488,1.0
659,28.308162689208984,-1.271421194076538,2.0
660,-13.816326141357422,-17.817663192749023,2.0
661,14.367558479309082,16.45195198059082,0.0
662,-29.475767135620117,5.543500900268555,0.0
663,3.4402642250061035,1.027483344078064,2.0
664,-22.297094345092773,22.589712142944336,0.0
665,14.558600425720215,4.876803398132324,0.0
666,53.63899230957031,-20.33155632019043,1.0
667,6.909488677978516,29.594974517822266,3.0
668,39.66722106933594,-11.647531509399414,2.0
669,7.480599880218506,8.423382759094238,2.0
670,13.331151962280273,18.570175170898438,2.0
671,2.169173002243042,-19.617366790771484,3.0
672,1.347435474395752,-27.561918258666992,0.0
673,-11.846158981323242,-0.21778461337089539,0.0
674,-10.031517028808594,-14.557079315185547,0.0
675,-16.8978328704834,0.25387832522392273,1.0
676,-13.490864753723145,26.54578971862793,2.0
677,42.55752182006836,-24.100196838378906,0.0
678,-31.826107025146484,-18.740999221801758,3.0
679,36.236454010009766,-5.471919059753418,1.0
680,-19.87875747680664,4.529226303100586,0.0
681,34.43573760986328,-10.27866268157959,1.0
682,11.46988296508789,31.7669620513916,2.0
683,-25.691844940185547,-15.355888366699219,3.0
684,-28.614601135253906,14.595463752746582,0.0
685,-22.60924530029297,-18.74904441833496,2.0
686,-4.1108927726745605,28.44393539428711,0.0
687,28.513364791870117,-19.833723068237305,0.0
688,-4.3102006912231445,-5.246967315673828,2.0
689,32.43355941772461,-5.246227741241455,2.0
690,24.039480209350586,4.029405117034912,3.0
691,-7.3713555335998535,-2.923797369003296,0.0
692,23.442995071411133,-34.046512603759766,1.0
693,0.1915356069803238,16.626142501831055,2.0
694,8.733587265014648,-14.553277015686035,2.0
695,6.363178253173828,-18.524658203125,1.0
696,5.554792404174805,23.45394515991211,2.0
697,1.8880095481872559,27.587169647216797,1.0
698,-27.28325080871582,4.444009780883789,0.0
699,12.52281665802002,-9.359013557434082,1.0
700,-13.126907348632812,38.688209533691406,3.0
701,-17.648109436035156,-27.55399513244629,0.0
702,-7.19148588180542,-11.965243339538574,0.0
703,-46.30113983154297,2.2997994422912598,3.0
704,-9.645328521728516,-12.044739723205566,1.0
705,50.89937973022461,-0.7541416883468628,3.0
706,-21.332632064819336,8.290262222290039,1.0
707,35.09797668457031,2.427124261856079,1.0
708,-13.461520195007324,13.914151191711426,1.0
709,42.6822624206543,-14.34443473815918,2.0
710,-1.467331886291504,7.8207879066467285,1.0
711,15.389477729797363,4.577467918395996,1.0
712,-16.540332794189453,-21.725900650024414,0.0
713,-15.938031196594238,12.812295913696289,3.0
714,-3.308361053466797,-19.935544967651367,2.0
715,-24.104129791259766,27.347776412963867,0.0
716,7.104710578918457,34.08682632446289,2.0
717,-30.848100662231445,1.3542333841323853,0.0
718,25.760894775390625,7.90378999710083,3.0
719,3.9705841541290283,-20.960433959960938,3.0
720,19.928552627563477,26.985074996948242,2.0
721,-16.95804786682129,-5.490699768066406,0.0
722,2.92276668548584,-5.158442497253418,2.0
723,8.792213439941406,-15.53317928314209,2.0
724,-21.372156143188477,35.845401763916016,1.0
725,26.75365447998047,-20.032323837280273,1.0
726,-43.680389404296875,6.013659954071045,1.0
727,-7.325733184814453,-3.988304853439331,1.0
728,-15.909871101379395,21.478256225585938,3.0
729,-14.866776466369629,10.956385612487793,3.0
730,27.123640060424805,-15.125028610229492,1.0
731,-31.34332275390625,-8.33324909210205,2.0
732,16.074697494506836,-3.3574635982513428,1.0
733,48.071529388427734,-4.710262298583984,0.0
734,3.4383325576782227,30.411436080932617,1.0
735,44.775856018066406,-7.77130651473999,0.0
736,-20.15387725830078,28.436372756958008,0.0
737,19.157819747924805,-28.55367088317871,1.0
738,49.432899475097656,-12.05826473236084,2.0
739,-33.07087326049805,9.77950668334961,0.0
740,-19.90557289123535,-2.8894193172454834,2.0
741,-5.760131359100342,14.62114429473877,1.0
742,13.083868026733398,3.688023328781128,0.0
743,-20.434553146362305,-18.035057067871094,2.0
744,-9.297225952148438,-3.0862553119659424,0.0
745,-23.072288513183594,-12.713760375976562,2.0
746,-17.414506912231445,14.725805282592773,3.0
747,51.956661224365234,1.7060879468917847,3.0
748,23.823444366455078,10.435132026672363,3.0
749,-16.145811080932617,12.708139419555664,2.0
750,11.959561347961426,3.734311103820801,0.0
751,-39.54463577270508,0.3636610209941864,3.0
752,-14.79875373840332,35.24517822265625,2.0
753,1.1884934902191162,9.145021438598633,1.0
754,-39.70958709716797,15.101273536682129,3.0
755,47.09209060668945,3.5780117511749268,2.0
756,-12.87010669708252,-7.68096923828125,0.0
757,-12.518220901489258,-4.9087605476379395,0.0
758,-5.512873649597168,-9.007800102233887,3.0
759,-0.9417762160301208,31.532676696777344,1.0
760,22.082542419433594,-13.83675765991211,2.0
761,-4.587829113006592,-32.826725006103516,1.0
762,-27.178091049194336,-33.13581466674805,1.0
763,6.451658725738525,-1.4326659440994263,1.0
764,-0.8500731587409973,-19.59518051147461,1.0
765,-21.036212921142578,6.783969879150391,2.0
766,-29.9962215423584,22.537322998046875,1.0
767,-21.51944923400879,-9.250312805175781,1.0
768,27.590829849243164,-1.413865566253662,2.0
769,-38.874576568603516,1.2994638681411743,3.0
770,-19.071203231811523,23.70465660095215,0.0
771,4.0602874755859375,12.173062324523926,0.0
772,10.79909896850586,-24.140024185180664,1.0
773,-10.843890190124512,-25.05550193786621,3.0
774,-32.62200927734375,-2.485992670059204,3.0
775,-14.398645401000977,-4.104544162750244,1.0
776,-49.18738555908203,3.0593631267547607,3.0
777,-17.942890167236328,32.91920852661133,0.0
778,47.78169250488281,-3.7481400966644287,2.0
779,47.276920318603516,-8.261199951171875,2.0
780,2.228332757949829,27.277036666870117,0.0
781,19.44398307800293,0.15859732031822205,0.0
782,-23.955583572387695,-0.04654281958937645,2.0
783,13.909982681274414,5.037201404571533,0.0
784,18.530487060546875,8.690437316894531,2.0
785,-13.904866218566895,43.4366455078125,3.0
786,24.673927307128906,-38.029727935791016,1.0
787,-33.65711212158203,26.20816993713379,2.0
788,-8.43839168548584,0.08432473242282867,1.0
789,-19.232378005981445,19.544681549072266,2.0
790,45.370819091796875,-5.330432415008545,3.0
791,33.76224136352539,-18.559030532836914,3.0
792,-1.2335528135299683,-15.389068603515625,3.0
793,34.87603759765625,-22.48367691040039,0.0
794,45.14506912231445,1.0961501598358154,0.0
795,15.250598907470703,22.872159957885742,2.0
796,19.645706176757812,16.42837905883789,2.0
797,30.260026931762695,22.773591995239258,2.0
798,-2.5524728298187256,28.56352996826172,0.0
799,31.08710289001465,-17.202638626098633,0.0
800,-1.3325690031051636,10.643199920654297,0.0
801,11.545368194580078,-4.395359992980957,0.0
802,31.17082405090332,-23.828048706054688,2.0
803,29.355791091918945,3.7636919021606445,3.0
804,-30.484277725219727,-9.072104454040527,0.0
805,40.037628173828125,-9.964632034301758,0.0
806,-25.364788055419922,32.77678680419922,0.0
807,10.30517292022705,-20.38182830810547,1.0
808,-21.213180541992188,13.236486434936523,3.0
809,-20.733238220214844,-5.8843278884887695,0.0
810,46.421749114990234,0.8009524941444397,0.0
811,21.01010513305664,0.24641361832618713,0.0
812,35.6737174987793,-8.109702110290527,1.0
813,45.239418029785156,-22.165918350219727,0.0
814,-1.3785394430160522,-1.5462976694107056,2.0
815,-1.5735538005828857,-29.68588638305664,0.0
816,49.71324157714844,-16.96940803527832,1.0
817,-40.700965881347656,-4.767459869384766,1.0
818,38.93332290649414,-24.296876907348633,0.0
819,-5.743927478790283,25.65681266784668,1.0
820,-36.11037063598633,-24.631498336791992,3.0
821,37.663124084472656,-9.531975746154785,0.0
822,-16.030858993530273,35.681461334228516,3.0
823,-12.746838569641113,14.190720558166504,2.0
824,-39.219520568847656,9.986471176147461,3.0
825,-23.139610290527344,37.206878662109375,1.0
826,-3.9822397232055664,32.46162033081055,0.0
827,31.087106704711914,-32.384864807128906,1.0
828,-14.72506046295166,-28.472993850708008,0.0
829,-12.443374633789062,35.65492248535156,1.0
830,-39.27399826049805,-17.366146087646484,1.0
831,-28.8784122467041,14.120182991027832,1.0
832,2.074507236480713,11.216514587402344,0.0
833,-42.338191986083984,-1.1412365436553955,3.0
834,-44.75442123413086,2.2454793453216553,3.0
835,40.55159378051758,-6.578461170196533,0.0
836,-13.854379653930664,43.200233459472656,2.0
837,-32.898921966552734,-8.0740385055542,3.0
838,-39.506553649902344,4.374089241027832,1.0
839,38.031707763671875,-21.89327621459961,0.0
840,37.53569030761719,-23.055883407592773,0.0
841,-32.50826644897461,3.3864731788635254,1.0
842,43.86247634887695,0.031452856957912445,0.0
843,-13.846043586730957,-32.83820724487305,0.0
844,-27.962793350219727,-29.982568740844727,2.0
845,-34.99673080444336,9.25667667388916,3.0
846,-21.283754348754883,2.62473726272583,0.0
847,3.6463847160339355,17.20408821105957,2.0
848,36.08271789550781,-17.026338577270508,3.0
849,-36.341529846191406,-24.606155395507812,2.0
850,-50.01805114746094,7.350096702575684,1.0
851,27.064044952392578,-7.623164176940918,3.0
852,-9.204830169677734,18.605981826782227,1.0
853,6.520643711090088,17.488754272460938,2.0
854,-19.51088523864746,12.03570556640625,3.0
855,-6.404663562774658,21.5131778717041,3.0
856,-21.18585968017578,19.183706283569336,0.0
857,-0.2182462364435196,-1.5584808588027954,2.0
858,-23.765396118164062,26.724506378173828,0.0
859,1.3218762874603271,-27.600427627563477,0.0
860,-27.770118713378906,-19.991498947143555,1.0
861,-12.868234634399414,9.489156723022461,2.0
862,-19.366270065307617,11.767420768737793,3.0
863,-8.297791481018066,27.345760345458984,3.0
864,-4.411113739013672,-4.430654048919678,2.0
865,43.346649169921875,-1.1713793277740479,1.0
866,-18.74560546875,-9.825740814208984,2.0
867,-14.543217658996582,6.115541934967041,2.0
868,0.5453521013259888,21.139360427856445,3.0
869,-20.948083877563477,-26.328397750854492,3.0
870,13.718692779541016,-7.520788192749023,0.0
871,13.710948944091797,-5.920372009277344,1.0
872,-43.53975296020508,12.906196594238281,3.0
873,51.649112701416016,-13.159932136535645,3.0
874,51.43734359741211,-18.142940521240234,0.0
875,-5.200787544250488,-22.185791015625,0.0
876,-4.679808616638184,6.583377361297607,2.0
877,19.828935623168945,-2.1735680103302,0.0
878,-48.33720779418945,-6.553843021392822,1.0
879,-40.025596618652344,-5.03195333480835,1.0
880,-0.007920932956039906,24.53750228881836,1.0
881,-24.914749145507812,34.422245025634766,1.0
882,-36.2316780090332,-0.8726267218589783,3.0
883,-21.35666275024414,30.61258316040039,1.0
884,39.51667022705078,-1.6759464740753174,0.0
885,-7.201164245605469,-31.098541259765625,2.0
886,10.522018432617188,4.7585601806640625,2.0
887,-17.38414192199707,38.814125061035156,2.0
888,0.5225627422332764,32.87178421020508,0.0
889,12.83795166015625,-14.652514457702637,0.0
890,31.058549880981445,-11.494434356689453,0.0
891,-31.368967056274414,-32.48494338989258,3.0
892,23.95046615600586,9.52802848815918,2.0
893,3.33727765083313,-17.68296241760254,3.0
894,-18.433195114135742,-25.212013244628906,2.0
895,-0.605756402015686,37.650726318359375,3.0
896,-9.852889060974121,9.310637474060059,0.0
897,9.603544235229492,-27.00189971923828,0.0
898,-10.637617111206055,-18.775243759155273,1.0
899,-11.460779190063477,-19.142009735107422,2.0
900,45.136993408203125,-13.66098403930664,3.0
901,-39.30323791503906,3.3292670249938965,1.0
902,-8.01806640625,7.11221170425415,2.0
903,-27.540729522705078,-23.237668991088867,1.0
904,-6.159210205078125,10.797185897827148,1.0
905,36.244014739990234,-21.699626922607422,1.0
906,4.361532211303711,26.43702507019043,2.0
907,10.795811653137207,17.1994571685791,3.0
908,35.11659240722656,-12.398118019104004,0.0
909,-8.031715393066406,25.03540802001953,2.0
910,26.031705856323242,-15.868962287902832,0.0
911,-13.827256202697754,-30.41735076904297,0.0
912,14.027458190917969,8.531538009643555,2.0
913,3.182673454284668,-32.98354721069336,2.0
914,-37.409912109375,9.875940322875977,3.0
915,-42.770263671875,11.522254943847656,3.0
916,-46.04681396484375,6.489163875579834,3.0
917,38.78171157836914,-3.90524959564209,1.0
918,-9.344470024108887,-29.346036911010742,0.0
919,-17.235374450683594,26.132566452026367,1.0
920,27.018911361694336,-28.93768882751465,1.0
921,38.08878707885742,-13.219941139221191,2.0
922,38.16239929199219,1.110906720161438,2.0
923,35.961158752441406,-7.984475612640381,0.0
924,-12.647590637207031,11.584741592407227,1.0
925,-23.310272216796875,-6.293694019317627,2.0
926,4.957075595855713,36.756282806396484,3.0
927,6.901534557342529,-20.225950241088867,2.0
928,41.677818298339844,2.675487518310547,1.0
929,3.3449013233184814,-5.717831134796143,2.0
930,13.8621187210083,-22.719926834106445,1.0
931,-5.666680812835693,-14.46677303314209,0.0
932,-0.7362810373306274,-12.837276458740234,2.0
933,45.326866149902344,-30.124195098876953,0.0
934,-23.684242248535156,14.553121566772461,3.0
935,-19.270671844482422,-25.820539474487305,2.0
936,33.2271728515625,-37.19261932373047,1.0
937,10.765632629394531,8.809443473815918,1.0
938,21.625944137573242,21.610496520996094,1.0
939,37.136253356933594,-4.5429301261901855,2.0
940,-15.273521423339844,-10.226048469543457,2.0
941,-30.76491355895996,30.940933227539062,3.0
942,34.1041145324707,-25.32080841064453,0.0
943,18.445804595947266,27.04142951965332,2.0
944,-14.661928176879883,22.364517211914062,2.0
945,48.004730224609375,-13.944703102111816,1.0
946,38.8337516784668,-5.8246660232543945,2.0
947,-36.80873489379883,19.016422271728516,2.0
948,29.21329689025879,-11.952028274536133,1.0
949,-0.5308272242546082,-3.663726568222046,3.0
950,-10.25831127166748,-9.433815002441406,0.0
951,35.484771728515625,0.9225872755050659,2.0
952,-14.719990730285645,13.70492935180664,1.0
953,21.138185501098633,-12.507526397705078,0.0
954,-26.142120361328125,26.484289169311523,2.0
955,-4.142119884490967,37.40439224243164,2.0
956,-18.633358001708984,-31.560136795043945,1.0
957,-11.95791244506836,1.8412853479385376,1.0
958,-41.265445709228516,4.237351894378662,2.0
959,-5.477499961853027,7.4089035987854,2.0
960,6.168406009674072,34.31391143798828,2.0
961,-33.75164031982422,25.729490280151367,3.0
962,23.14267349243164,-13.910107612609863,1.0
963,-19.258005142211914,-13.427128791809082,0.0
964,48.99387741088867,-9.864092826843262,3.0
965,5.630642414093018,1.1650829315185547,2.0
966,-1.5239670276641846,7.370082378387451,2.0
967,-19.240938186645508,28.227886199951172,1.0
968,36.60609817504883,-27.1909122467041,1.0
969,-18.02202606201172,29.748422622680664,1.0
970,11.80860710144043,11.558222770690918,1.0
971,-14.064068794250488,37.76508331298828,2.0
972,20.453025817871094,16.22439193725586,3.0
973,19.286972045898438,21.514232635498047,2.0
974,-13.580893516540527,2.577695608139038,0.0
975,33.33639144897461,-28.510284423828125,1.0
976,40.18478775024414,0.42466261982917786,0.0
977,4.312924385070801,25.833431243896484,3.0
978,35.64949035644531,5.889530658721924,3.0
979,-32.780826568603516,-15.9564847946167,1.0
980,-38.560245513916016,-12.184394836425781,1.0
981,40.99443435668945,-2.3181614875793457,0.0
982,5.521997928619385,-12.416308403015137,0.0
983,-4.515604496002197,28.549985885620117,0.0
984,15.771953582763672,-13.341413497924805,2.0
985,-30.076641082763672,18.93088150024414,1.0
986,27.127147674560547,-7.034566402435303,2.0
987,-16.468048095703125,35.70210266113281,3.0
988,52.83498764038086,-4.161128044128418,0.0
989,-24.16806411743164,-2.6102097034454346,3.0
990,3.9454030990600586,-24.96528434753418,0.0
991,-12.36847972869873,-14.004035949707031,1.0
992,11.716877937316895,3.874330759048462,1.0
993,-10.258749008178711,-1.9642034769058228,3.0
994,-33.310874938964844,-25.71099281311035,3.0
995,-32.03108596801758,-0.660577118396759,1.0
996,-2.437450408935547,14.906599998474121,0.0
997,48.77315139770508,-9.928177833557129,3.0
998,-2.5487937927246094,26.78910255432129,0.0
999,-26.964059829711914,-15.236702919006348,3.0
1000,-13.787020683288574,-19.024097442626953,2.0
1001,29.673809051513672,-24.649513244628906,1.0
1002,31.933250427246094,-13.653307914733887,1.0
1003,12.599872589111328,17.959970474243164,3.0
1004,5.163239479064941,31.987470626831055,2.0
1005,6.304931640625,27.503633499145508,2.0
1006,10.418046951293945,26.31673240661621,0.0
1007,-22.61647605895996,5.422184944152832,1.0
1008,-22.68660545349121,-18.3653564453125,3.0
1009,-36.312313079833984,0.5605050325393677,3.0
1010,53.01749038696289,-8.587187767028809,3.0
1011,-24.09809112548828,29.09672737121582,0.0
1012,-20.31380844116211,14.926057815551758,3.0
1013,-10.959185600280762,-7.5489420890808105,0.0
1014,13.827574729919434,19.91935920715332,2.0
1015,-38.30072784423828,19.399986267089844,2.0
1016,-12.13133716583252,-8.984999656677246,0.0
1017,48.09398651123047,-18.230138778686523,2.0
1018,-6.344438076019287,0.5362991690635681,2.0
1019,-38.396427154541016,7.18765926361084,1.0
1020,13.918813705444336,-1.2491141557693481,2.0
1021,-34.170127868652344,20.766265869140625,3.0
1022,-6.54215669631958,-4.222962379455566,2.0
1023,-42.681304931640625,-11.047075271606445,1.0
1024,46.972877502441406,10.217432022094727,1.0
1025,37.78206253051758,-38.84741973876953,1.0
1026,12.98816204071045,-8.301365852355957,0.0
1027,-31.15863609313965,0.5754979252815247,0.0
1028,51.44854736328125,1.249315619468689,2.0
1029,-23.14264678955078,25.8691463470459,0.0
1030,27.05471420288086,17.562637329101562,3.0
1031,-15.187527656555176,-22.70998764038086,1.0
1032,-9.956639289855957,27.718830108642578,3.0
1033,-5.051100254058838,36.292564392089844,1.0
1034,-19.54295539855957,18.91498374938965,1.0
1035,41.597904205322266,-2.709806442260742,0.0
1036,41.99028396606445,0.9673282504081726,1.0
1037,26.264867782592773,-34.68675231933594,2.0
1038,-4.174378871917725,4.705475807189941,2.0
1039,-5.006560325622559,-1.215101957321167,0.0
1040,-9.019140243530273,-5.593266010284424,0.0
1041,6.1017560958862305,33.779335021972656,3.0
1042,-16.954044342041016,-18.74993324279785,2.0
1043,-13.956579208374023,13.151126861572266,3.0
1044,4.576768398284912,19.246326446533203,2.0
1045,-18.753910064697266,-21.45714569091797,3.0
1046,-26.2882022857666,-0.7213093042373657,1.0
1047,23.801626205444336,13.420796394348145,2.0
1048,-24.63210105895996,-13.236108779907227,1.0
1049,-33.84870910644531,13.754246711730957,2.0
1050,-14.15951156616211,15.851792335510254,0.0
1051,-18.24453353881836,-21.566709518432617,2.0
1052,19.62773323059082,-16.462671279907227,3.0
1053,-37.55438995361328,6.082840919494629,0.0
1054,-14.093404769897461,10.628491401672363,2.0
1055,-39.840118408203125,21.400239944458008,1.0
1056,40.35019302368164,-27.843219757080078,1.0
1057,42.75972366333008,-9.053121566772461,3.0
1058,22.353408813476562,-18.999900817871094,0.0
1059,31.961864471435547,-7.457361221313477,2.0
1060,19.662050247192383,-16.314870834350586,3.0
1061,1.3729158639907837,23.112140655517578,1.0
1062,-25.512483596801758,35.60301208496094,0.0
1063,15.184586524963379,8.577620506286621,1.0
1064,-12.912642478942871,3.5471508502960205,1.0
1065,-3.8501038551330566,12.521170616149902,1.0
1066,-13.362674713134766,18.573043823242188,3.0
1067,23.975122451782227,-24.590213775634766,1.0
1068,20.277355194091797,-24.831039428710938,3.0
1069,32.919925689697266,-15.55975341796875,2.0
1070,32.03664779663086,-24.830381393432617,0.0
1071,45.002532958984375,-7.341386318206787,0.0
1072,44.85826873779297,-25.90692710876465,3.0
1073,15.881978988647461,-7.753687858581543,1.0
1074,31.532791137695312,-15.615750312805176,0.0
1075,-12.594173431396484,-35.46402359008789,0.0
1076,-33.16067123413086,-23.09438705444336,3.0
1077,7.019576549530029,22.272436141967773,1.0
1078,-10.197311401367188,-21.931411743164062,2.0
1079,8.458170890808105,1.2145763635635376,3.0
1080,-22.775487899780273,21.254980087280273,0.0
1081,49.49187469482422,-2.190626859664917,3.0
1082,-36.495948791503906,12.83765697479248,2.0
1083,-12.759098052978516,-23.414630889892578,2.0
1084,-3.246445417404175,6.458669185638428,2.0
1085,-30.4832820892334,26.29646873474121,3.0
1086,-34.209407806396484,29.53817367553711,3.0
1087,3.138068914413452,17.90679359436035,2.0
1088,40.50080871582031,-23.798009872436523,0.0
1089,-14.335609436035156,27.813777923583984,0.0
1090,8.695974349975586,-18.0666561126709,2.0
1091,-29.64397621154785,14.23748779296875,0.0
1092,-20.616331100463867,14.032577514648438,2.0
1093,2.7248849868774414,-2.9705758094787598,2.0
1094,4.181363105773926,24.3027286529541,3.0
1095,-18.24012565612793,-11.676642417907715,1.0
1096,1.9818459749221802,-9.000469207763672,3.0
1097,-28.808664321899414,-23.897733688354492,3.0
1098,0.7931967377662659,33.0006217956543,0.0
1099,-19.505098342895508,9.961421012878418,3.0
1100,19.846439361572266,5.988802433013916,3.0
1101,-16.303804397583008,17.1846866607666,1.0
1102,-3.6605775356292725,20.2630558013916,1.0
1103,-1.1997257471084595,37.445106506347656,3.0
1104,-12.328140258789062,-3.9365506172180176,0.0
1105,19.690135955810547,25.446964263916016,1.0
1106,4.402538299560547,-31.08980369567871,2.0
1107,4.5792622566223145,2.2626700401306152,2.0
1108,16.91912269592285,10.264707565307617,0.0
1109,-12.944732666015625,25.480680465698242,1.0
1110,23.175142288208008,-23.492252349853516,1.0
1111,-13.591629981994629,5.902248382568359,1.0
1112,42.87287902832031,-11.340232849121094,2.0
1113,41.026920318603516,-12.204754829406738,3.0
1114,38.14981460571289,-0.03167783096432686,1.0
1115,-16.0908260345459,6.854992866516113,1.0
1116,-1.4778869152069092,-20.685964584350586,0.0
1117,-27.539072036743164,36.298709869384766,1.0
1118,-4.132277965545654,-18.232166290283203,1.0
1119,9.402228355407715,-12.402909278869629,3.0
1120,49.377620697021484,2.222599506378174,3.0
1121,-36.7987060546875,3.1190528869628906,2.0
1122,-4.121510982513428,-17.03573989868164,2.0
1123,22.147525787353516,-18.988731384277344,1.0
1124,5.6425275802612305,32.91098403930664,3.0
1125,-32.75008773803711,30.44153594970703,2.0
1126,-47.98146438598633,0.0029755858704447746,3.0
1127,-2.689232110977173,7.067077159881592,3.0
1128,-11.386222839355469,31.97161865234375,1.0
1129,36.017452239990234,-22.384902954101562,0.0
1130,-15.146844863891602,5.215991973876953,1.0
1131,-21.159929275512695,-3.532338857650757,0.0
1132,-15.10712718963623,0.4835487902164459,0.0
1133,7.053503513336182,-26.553312301635742,0.0
1134,23.59856605529785,22.449750900268555,2.0
1135,25.529834747314453,-37.172088623046875,2.0
1136,-13.731669425964355,-28.0327091217041,0.0
1137,-4.262395858764648,11.006718635559082,2.0
1138,-46.05883026123047,9.167244911193848,3.0
1139,-14.772211074829102,4.761046409606934,1.0
1140,-11.507807731628418,9.953500747680664,1.0
1141,43.97175979614258,-3.456522226333618,1.0
1142,-23.767881393432617,38.268001556396484,0.0
1143,-15.828054428100586,-25.491674423217773,0.0
1144,-12.66372013092041,38.079795837402344,3.0
1145,-19.154436111450195,6.635429859161377,0.0
1146,-25.724945068359375,19.743894577026367,0.0
1147,-23.711151123046875,10.342081069946289,0.0
1148,-3.5705981254577637,21.31505584716797,0.0
1149,-31.73891830444336,30.24919319152832,2.0
1150,5.4886603355407715,-23.47378158569336,0.0
1151,-43.160980224609375,6.055595874786377,2.0
1152,-8.291897773742676,4.565040111541748,2.0
1153,10.66759204864502,9.43112564086914,1.0
1154,38.05235290527344,-12.835071563720703,0.0
1155,-27.74310302734375,35.747982025146484,3.0
1156,48.90491485595703,-13.646095275878906,3.0
1157,45.125858306884766,-14.080116271972656,2.0
1158,38.781829833984375,3.3861100673675537,2.0
1159,24.837682723999023,9.24831485748291,3.0
1160,-29.74187660217285,-12.95363712310791,3.0
1161,-21.943012237548828,-21.13294792175293,2.0
1162,36.389427185058594,-28.91107749938965,1.0
1163,34.90870666503906,-12.97809886932373,0.0
1164,30.393404006958008,22.841468811035156,0.0
1165,-26.075050354003906,-4.92600679397583,3.0
1166,37.012939453125,9.801616668701172,3.0
1167,-33.123775482177734,31.023868560791016,1.0
1168,-21.4478759765625,29.730417251586914,2.0
1169,-9.281461715698242,41.253318786621094,1.0
1170,36.28966522216797,6.027914047241211,3.0
1171,-5.429480075836182,-5.655275821685791,2.0
1172,5.574701309204102,29.152807235717773,3.0
1173,15.288688659667969,-36.242881774902344,3.0
1174,44.16160202026367,-18.61241340637207,1.0
1175,-22.925065994262695,-37.360557556152344,0.0
1176,-11.931846618652344,1.5371439456939697,2.0
1177,2.620912551879883,22.373634338378906,1.0
1178,-6.276045799255371,0.9575652480125427,1.0
1179,-7.856484889984131,12.995579719543457,0.0
1180,-12.637541770935059,19.948680877685547,3.0
1181,-13.492273330688477,-25.2993106842041,2.0
1182,8.613574981689453,-1.1452279090881348,1.0
1183,-39.728492736816406,20.251869201660156,1.0
1184,-17.98375129699707,-8.744538307189941,0.0
1185,-21.10700798034668,0.03670382872223854,0.0
1186,-25.04715919494629,-21.1297550201416,3.0
1187,19.366107940673828,-20.512914657592773,3.0
1188,-39.99064636230469,22.00799560546875,2.0
1189,-8.453649520874023,-17.06328773498535,3.0
1190,-17.566152572631836,23.105632781982422,1.0
1191,24.934680938720703,-1.1185941696166992,3.0
1192,-36.486671447753906,-6.161076068878174,3.0
1193,-34.9276237487793,7.5743560791015625,2.0
1194,-36.44981384277344,13.686043739318848,3.0
1195,-35.761619567871094,-0.033500488847494125,3.0
1196,-38.415977478027344,-11.2565336227417,3.0
1197,37.60310363769531,-38.246131896972656,1.0
1198,-13.958322525024414,-2.4945950508117676,0.0
1199,22.475236892700195,-15.78234577178955,2.0
1200,-1.1891846656799316,24.642044067382812,0.0
1201,-15.977431297302246,15.377803802490234,2.0
1202,-27.613819122314453,-8.291077613830566,3.0
1203,11.32381534576416,31.08226776123047,2.0
1204,-24.456741333007812,-21.319459915161133,3.0
1205,28.375568389892578,-26.593639373779297,1.0
1206,12.2023286819458,-15.811907768249512,1.0
1207,13.141485214233398,1.3131928443908691,1.0
1208,-19.949535369873047,-12.996772766113281,2.0
1209,-17.489646911621094,27.174983978271484,0.0
1210,29.552453994750977,-15.769936561584473,2.0
1211,-18.768884658813477,3.1107840538024902,0.0
1212,-9.563920021057129,-2.96086049079895,2.0
1213,-37.81888198852539,-18.686431884765625,1.0
1214,-13.02926254272461,25.174320220947266,3.0
1215,-25.51140594482422,-19.037858963012695,2.0
1216,-1.1973685026168823,-15.518941879272461,2.0
1217,27.30862808227539,-25.61368751525879,0.0
1218,14.900223731994629,27.808778762817383,2.0
1219,-20.031436920166016,-1.7325623035430908,1.0
1220,33.78262710571289,5.41549825668335,3.0
1221,-4.326429843902588,10.10574722290039,2.0
1222,-4.8960957527160645,-23.345897674560547,0.0
1223,-12.418776512145996,28.412343978881836,2.0
1224,-42.09120559692383,-4.067221641540527,2.0
1225,-7.942368030548096,-9.760671615600586,0.0
1226,34.638206481933594,-9.901790618896484,3.0
1227,-5.640047073364258,35.62069320678711,1.0
1228,-16.877931594848633,7.288420677185059,3.0
1229,-43.9822883605957,-2.95192551612854,3.0
1230,4.269736289978027,13.817146301269531,1.0
1231,-5.6603851318359375,5.103084564208984,0.0
1232,-20.608631134033203,9.867060661315918,2.0
1233,-0.5023832321166992,13.247875213623047,1.0
1234,-10.845147132873535,3.34767484664917,3.0
1235,20.59912872314453,11.487457275390625,3.0
1236,18.176603317260742,-26.8354434967041,2.0
1237,13.934179306030273,-20.390796661376953,2.0
1238,15.398625373840332,-27.52091407775879,1.0
1239,-16.98642921447754,-15.706796646118164,3.0
1240,-23.496170043945312,17.280864715576172,2.0
1241,-22.160507202148438,34.99867248535156,0.0
1242,-3.947355270385742,1.0534062385559082,1.0
1243,4.096222877502441,12.721811294555664,0.0
1244,-18.63665199279785,23.48480987548828,0.0
1245,-10.862932205200195,22.329357147216797,3.0
1246,-8.55629825592041,4.554073333740234,2.0
1247,45.8455924987793,-3.7538278102874756,1.0
1248,-28.050134658813477,23.336597442626953,1.0
1249,27.428138732910156,-4.026664733886719,2.0
1250,43.02421188354492,-14.954486846923828,2.0
1251,-26.823694229125977,9.090065002441406,2.0
1252,-13.218781471252441,-22.628128051757812,0.0
1253,26.64691162109375,-10.950308799743652,2.0
1254,-32.054283142089844,-10.01162338256836,0.0
1255,17.59629249572754,7.7764177322387695,2.0
1256,21.36063003540039,11.106650352478027,3.0
1257,-20.753061294555664,38.94712448120117,0.0
1258,-38.88102722167969,-17.403650283813477,0.0
1259,-14.124808311462402,-36.285614013671875,0.0
1260,48.7346076965332,-3.056062936782837,2.0
1261,35.44230270385742,1.1576913595199585,1.0
1262,42.11204147338867,-5.03912878036499,1.0
1263,-9.413023948669434,27.536603927612305,3.0
1264,5.739137649536133,-14.439056396484375,1.0
1265,-17.37926483154297,-0.36317136883735657,0.0
1266,36.00487518310547,10.990068435668945,3.0
1267,43.11103439331055,2.9483819007873535,1.0
1268,-36.574642181396484,-6.514229774475098,3.0
1269,-42.11469268798828,5.955867767333984,3.0
1270,31.59709358215332,-2.8560526371002197,1.0
1271,-3.2132346630096436,5.546526908874512,3.0
1272,-29.47125244140625,-4.11795711517334,3.0
1273,9.152813911437988,36.20415496826172,2.0
1274,-14.625411033630371,32.33018493652344,0.0
1275,-16.668550491333008,30.982961654663086,0.0
1276,9.40869426727295,-11.75264835357666,3.0
1277,-27.45185661315918,-10.718547821044922,1.0
1278,-13.219669342041016,16.175661087036133,0.0
1279,16.28152084350586,-3.717332601547241,0.0
1280,-6.350813865661621,35.601322174072266,0.0
1281,-9.36092758178711,-20.822317123413086,2.0
1282,-5.66543436050415,1.2536457777023315,1.0
1283,-35.78761672973633,26.762117385864258,1.0
1284,11.55517292022705,-18.241954803466797,2.0
1285,11.525627136230469,-14.562881469726562,0.0
1286,28.740554809570312,-17.346141815185547,0.0
1287,-35.96007537841797,22.24541664123535,3.0
1288,-9.090246200561523,22.322940826416016,1.0
1289,28.978412628173828,-13.03325080871582,1.0
1290,-6.894169330596924,-1.7574816942214966,0.0
1291,-15.67712688446045,-10.898597717285156,0.0
1292,-22.79477882385254,17.552448272705078,1.0
1293,-13.31478214263916,-25.67325782775879,1.0
1294,47.51435852050781,-14.78482437133789,3.0
1295,-23.352569580078125,22.3779296875,1.0
1296,-38.547664642333984,7.6340789794921875,3.0
1297,11.429376602172852,20.97395896911621,1.0
1298,39.9962043762207,-18.504907608032227,0.0
1299,-23.786958694458008,-23.99143409729004,2.0
1300,-6.697423934936523,25.67679214477539,3.0
1301,-10.257392883300781,-29.860319137573242,0.0
1302,-31.845422744750977,21.782407760620117,2.0
1303,-1.9806773662567139,18.20122528076172,3.0
1304,-27.477140426635742,32.349517822265625,2.0
1305,18.32694435119629,16.80448341369629,0.0
1306,39.24506759643555,-2.002476453781128,0.0
1307,13.37042236328125,-11.121074676513672,2.0
1308,-15.98458194732666,27.31325912475586,2.0
1309,-35.97154998779297,17.64063262939453,1.0
1310,-10.689038276672363,17.09539031982422,1.0
1311,-42.113624572753906,-2.540133476257324,3.0
1312,-7.33042573928833,30.93450164794922,1.0
1313,0.14084450900554657,1.5723544359207153,1.0
1314,-9.161896705627441,-13.181488037109375,1.0
1315,10.237565040588379,5.450043201446533,0.0
1316,-2.2516069412231445,-7.560705661773682,2.0
1317,-1.663586139678955,-23.191356658935547,3.0
1318,6.026696681976318,-19.382898330688477,3.0
1319,-28.194177627563477,18.202795028686523,2.0
1320,-22.911130905151367,-25.284046173095703,3.0
1321,50.2002067565918,-6.54702615737915,2.0
1322,-20.716928482055664,38.58980941772461,1.0
1323,34.29646682739258,-11.404657363891602,0.0
1324,9.422934532165527,-13.634781837463379,2.0
1325,44.550872802734375,-25.546939849853516,3.0
1326,3.02567195892334,-19.670839309692383,3.0
1327,35.979026794433594,-34.62478256225586,2.0
1328,-32.36727523803711,7.9299774169921875,0.0
1329,-27.515810012817383,-3.0362370014190674,1.0
1330,-16.975244522094727,-15.62232494354248,3.0
1331,11.624463081359863,8.269363403320312,1.0
1332,-31.09124183654785,19.217384338378906,2.0
1333,-21.713226318359375,-7.426727294921875,1.0
1334,-7.261324882507324,2.2015814781188965,3.0
1335,-12.451140403747559,18.12026023864746,2.0
1336,26.764448165893555,18.472333908081055,2.0
1337,49.59033203125,-13.171477317810059,1.0
1338,35.48723220825195,-24.658308029174805,0.0
1339,39.92612075805664,-26.195796966552734,0.0
1340,10.420833587646484,-2.0693142414093018,0.0
1341,-14.813027381896973,1.9839332103729248,0.0
1342,31.171785354614258,-20.008472442626953,1.0
1343,-31.666303634643555,14.549891471862793,1.0
1344,12.275232315063477,-2.7787694931030273,0.0
1345,20.185049057006836,-12.84195327758789,0.0
1346,14.276352882385254,12.020686149597168,0.0
1347,-7.47036075592041,19.388240814208984,3.0
1348,-17.337215423583984,20.356719970703125,3.0
1349,11.959308624267578,-26.26021385192871,2.0
1350,45.0971565246582,-12.257501602172852,2.0
1351,-12.48623275756836,-10.12468433380127,1.0
1352,25.745054244995117,-14.567549705505371,1.0
1353,5.871811866760254,0.6016426682472229,1.0
1354,-16.658132553100586,-12.253938674926758,0.0
1355,36.38251495361328,-29.705259323120117,0.0
1356,-15.604196548461914,0.7871180772781372,0.0
1357,29.834909439086914,-12.628900527954102,1.0
1358,50.39756393432617,-6.105963706970215,1.0
1359,-27.093685150146484,-10.79891586303711,1.0
1360,-22.405366897583008,-0.9158653020858765,1.0
1361,-1.4516513347625732,33.636512756347656,1.0
1362,-8.71109676361084,18.859155654907227,3.0
1363,-4.96466064453125,-8.436184883117676,2.0
1364,-30.58686637878418,-2.034928560256958,3.0
1365,25.75676727294922,-20.697345733642578,0.0
1366,46.149044036865234,-18.848491668701172,1.0
1367,6.552070617675781,-4.790384292602539,1.0
1368,-0.7408974170684814,-33.80952453613281,1.0
1369,-3.4402763843536377,-28.51706314086914,1.0
1370,16.86753273010254,-19.012453079223633,0.0
1371,24.29789161682129,23.373292922973633,2.0
1372,40.29821014404297,-11.147565841674805,1.0
1373,4.073202610015869,6.62844181060791,1.0
1374,-24.898073196411133,23.038991928100586,1.0
1375,8.28368091583252,14.28133773803711,2.0
1376,-3.0271055698394775,-1.115001916885376,2.0
1377,-15.014735221862793,34.09031295776367,2.0
1378,21.73284339904785,3.0754377841949463,1.0
1379,16.510149002075195,-4.5938310623168945,0.0
1380,-24.334684371948242,3.68231463432312,1.0
1381,-5.583435535430908,12.222023010253906,0.0
1382,31.78750228881836,-15.668144226074219,1.0
1383,-24.441320419311523,31.3004093170166,3.0
1384,-15.87301254272461,-14.529095649719238,2.0
1385,34.54836654663086,-8.607832908630371,3.0
1386,-7.726070404052734,30.67786407470703,0.0
1387,4.925136566162109,3.698643207550049,2.0
1388,35.588470458984375,-3.4322285652160645,1.0
1389,27.24679183959961,-34.51030731201172,3.0
1390,38.23747253417969,-7.1476240158081055,1.0
1391,24.66620635986328,-20.527172088623047,0.0
1392,-33.84222412109375,32.74077224731445,0.0
1393,31.694156646728516,5.556885719299316,2.0
1394,14.722007751464844,-17.252283096313477,1.0
1395,-12.459792137145996,-35.33898162841797,0.0
1396,-19.874191284179688,5.107767581939697,1.0
1397,23.13909339904785,7.757907867431641,3.0
1398,-7.725793838500977,25.87519073486328,2.0
1399,18.161678314208984,7.033998012542725,3.0
