iterations,fitness,time,fevals
0,24.0,0.001657285,551
10,25.0,0.003109533,1013
20,27.0,0.004516349,1475
30,30.0,0.006009289,1925
40,30.0,0.007459167,2403
50,29.0,0.010198923,2862
60,31.0,0.011869245,3324
70,30.0,0.013782135,3787
80,32.0,0.015238729,4246
90,34.0,0.016768804,4686
100,34.0,0.018408312,5138
110,35.0,0.019986585,5587
120,38.0,0.021396166,6029
130,38.0,0.024146588,6489
140,36.0,0.025532466,6936
150,35.0,0.026912812,7391
160,35.0,0.028301455,7847
170,36.0,0.030329703,8295
180,36.0,0.03196052,8747
190,36.0,0.033572373,9200
200,37.0,0.035199238,9647
210,38.0,0.036939486,10110
220,42.0,0.038537512,10562
230,45.0,0.040152921,11026
240,44.0,0.041728823,11488
250,44.0,0.043392825,11933
260,47.0,0.045041814,12374
270,47.0,0.046605469,12830
280,46.0,0.047941569,13279
290,46.0,0.049288731,13729
300,48.0,0.052560635,14196
310,47.0,0.054142068,14659
320,47.0,0.055547303,15120
330,49.0,0.056971106,15576
340,49.0,0.058348292,16030
350,51.0,0.059776442,16488
360,50.0,0.061150468,16947
370,50.0,0.062516988,17391
380,50.0,0.065685781,17849
390,52.0,0.067853092,18313
400,51.0,0.069225932,18771
410,51.0,0.071075613,19231
420,51.0,0.072423565,19679
430,51.0,0.073819714,20143
440,51.0,0.075306332,20592
450,51.0,0.076665741,21048
460,53.0,0.079699817,21512
470,52.0,0.081080163,21975
480,52.0,0.082454189,22443
490,52.0,0.084020215,22908
500,54.0,0.085464562,23348
510,57.0,0.086810538,23806
520,57.0,0.088151379,24262
530,58.0,0.089639183,24726
540,56.0,0.092250938,25179
550,55.0,0.093716223,25647
560,56.0,0.095141607,26101
570,57.0,0.096533805,26546
580,56.0,0.09786793,27001
590,57.0,0.099275536,27447
600,55.0,0.100606895,27887
610,58.0,0.101952477,28342
620,62.0,0.105112578,28790
630,63.0,0.106478702,29250
640,63.0,0.107842061,29707
650,63.0,0.109562556,30171
660,63.0,0.111060631,30628
670,63.0,0.113255595,31086
680,62.0,0.114607497,31547
690,64.0,0.115965325,32009
700,63.0,0.118950019,32466
710,63.0,0.120407403,32911
720,66.0,0.121741922,33359
730,65.0,0.124002467,33817
740,64.0,0.125664888,34269
750,64.0,0.127016395,34731
760,65.0,0.128363952,35203
770,61.0,0.129736397,35670
780,61.0,0.132762573,36124
790,61.0,0.134111314,36581
800,62.0,0.135659562,37036
810,64.0,0.137291168,37499
820,63.0,0.138626873,37956
830,62.0,0.139971664,38410
840,62.0,0.141563764,38855
850,63.0,0.142913692,39314
860,63.0,0.146487818,39763
870,62.0,0.147825498,40211
880,63.0,0.149163573,40643
890,62.0,0.150575525,41100
900,63.0,0.151915575,41545
910,61.0,0.153256416,41993
920,61.0,0.154600022,42447
930,62.0,0.155947973,42910
940,62.0,0.158622939,43366
950,62.0,0.16022136,43828
960,62.0,0.161575632,44280
970,63.0,0.163149165,44720
980,62.0,0.164578499,45189
990,62.0,0.166087636,45655
1000,62.0,0.167430057,46113
1010,59.0,0.16878749,46577
1020,62.0,0.17142769,47028
1030,61.0,0.172790259,47476
1040,62.0,0.174139396,47938
1050,62.0,0.175853965,48406
1060,62.0,0.177231941,48862
1070,61.0,0.178601621,49319
1080,61.0,0.179951943,49764
1090,62.0,0.181472142,50202
1100,62.0,0.18444854,50651
1110,62.0,0.185821776,51109
1120,62.0,0.187250716,51569
1130,62.0,0.189674026,52020
1140,62.0,0.191045286,52485
1150,66.0,0.192406275,52949
1160,66.0,0.193743955,53400
1170,66.0,0.195090721,53852
1180,67.0,0.198403317,54300
1190,67.0,0.199790775,54763
1200,67.0,0.201211418,55223
1210,68.0,0.20329142,55663
1220,68.0,0.204619223,56120
1230,69.0,0.205943075,56574
1240,70.0,0.207273644,57028
1250,69.0,0.208597102,57486
1260,68.0,0.211779327,57941
1270,69.0,0.213126094,58403
1280,69.0,0.214458638,58861
1290,69.0,0.216332417,59320
1300,69.0,0.21784748,59777
1310,69.0,0.219163432,60228
1320,68.0,0.220493211,60688
1330,69.0,0.221864867,61153
1340,70.0,0.223160671,61611
1350,71.0,0.226401365,62066
1360,71.0,0.227736675,62531
1370,70.0,0.22954922,62979
1380,70.0,0.231082061,63437
1390,72.0,0.232553667,63902
1400,72.0,0.23388147,64353
1410,71.0,0.235228236,64809
1420,71.0,0.236638212,65256
1430,71.0,0.239465276,65693
1440,71.0,0.240782413,66155
1450,71.0,0.242083353,66606
1460,71.0,0.24352849,67065
1470,72.0,0.244840491,67517
1480,72.0,0.246389529,67969
1490,73.0,0.247922764,68428
1500,72.0,0.249241086,68886
1510,72.0,0.252339953,69354
1520,72.0,0.253800497,69809
1530,73.0,0.255108943,70254
1540,72.0,0.256439907,70713
1550,73.0,0.257744797,71164
1560,73.0,0.259056798,71617
1570,73.0,0.260441096,72062
1580,73.0,0.26196643,72515
1590,73.0,0.264554877,72961
1600,72.0,0.265883865,73422
1610,72.0,0.267210878,73882
1620,72.0,0.268592015,74340
1630,71.0,0.270109843,74787
1640,71.0,0.271463326,75256
1650,71.0,0.272801401,75714
1660,71.0,0.27410076,76162
1670,70.0,0.277735331,76627
1680,70.0,0.279043776,77080
1690,70.0,0.280567135,77543
1700,70.0,0.281854247,78007
1710,70.0,0.283172964,78463
1720,69.0,0.284704225,78919
1730,71.0,0.286075485,79376
1740,71.0,0.287381165,79848
1750,70.0,0.290589069,80303
1760,70.0,0.292335639,80747
1770,69.0,0.293898899,81195
1780,69.0,0.295220777,81652
1790,70.0,0.296535939,82105
1800,70.0,0.297973174,82548
1810,71.0,0.299296632,82998
1820,71.0,0.300634312,83459
1830,72.0,0.303682611,83910
1840,73.0,0.305100489,84357
1850,74.0,0.3064117,84819
1860,72.0,0.307707899,85275
1870,73.0,0.309401925,85733
1880,74.0,0.310910667,86190
1890,74.0,0.312296545,86650
1900,75.0,0.31360183,87108
1910,74.0,0.316356598,87560
1920,74.0,0.317936847,88004
1930,74.0,0.319249243,88457
1940,75.0,0.320618923,88903
1950,75.0,0.321913936,89367
1960,77.0,0.323201839,89825
1970,77.0,0.324469198,90262
1980,77.0,0.325756706,90723
1990,77.0,0.328353844,91180
2000,78.0,0.330028117,91640
2010,78.0,0.331329451,92096
2020,77.0,0.332689255,92555
2030,77.0,0.333983478,93017
2040,77.0,0.335280071,93476
2050,76.0,0.336585751,93941
2060,77.0,0.337889851,94393
2070,78.0,0.340656866,94843
2080,78.0,0.342742398,95295
2090,78.0,0.344046893,95747
2100,78.0,0.345543388,96207
2110,78.0,0.346844328,96662
2120,78.0,0.34813302,97112
2130,79.0,0.349430009,97567
2140,79.0,0.350725022,98016
2150,78.0,0.35332532,98479
2160,77.0,0.354979445,98925
2170,78.0,0.356295396,99388
2180,79.0,0.357603446,99849
2190,78.0,0.359309323,100294
2200,79.0,0.360620929,100745
2210,79.0,0.361927004,101201
2220,79.0,0.363218067,101646
2230,78.0,0.365788341,102104
2240,78.0,0.367085725,102558
2250,78.0,0.368931455,103025
2260,79.0,0.37062074,103484
2270,79.0,0.371929976,103932
2280,79.0,0.373245928,104393
2290,80.0,0.374575311,104860
2300,80.0,0.376103411,105320
2310,79.0,0.378948648,105775
2320,79.0,0.380251563,106231
2330,79.0,0.381541441,106678
2340,79.0,0.382841591,107129
2350,79.0,0.384195073,107588
2360,78.0,0.385906087,108041
2370,78.0,0.387271817,108502
2380,78.0,0.388660065,108953
2390,78.0,0.389950338,109404
2400,78.0,0.391254438,109853
2410,77.0,0.392568019,110304
2420,77.0,0.394636564,110753
2430,77.0,0.395952911,111206
2440,77.0,0.397279529,111671
2450,78.0,0.399039926,112123
2460,78.0,0.400357457,112582
2470,78.0,0.40183894,113036
2480,77.0,0.404327831,113488
2490,78.0,0.405642992,113954
2500,77.0,0.406926944,114406
2510,76.0,0.408234994,114862
2520,76.0,0.409530402,115325
2530,76.0,0.410802501,115769
2540,77.0,0.412472033,116225
2550,77.0,0.413780873,116681
2560,77.0,0.416324677,117128
2570,77.0,0.417652085,117589
2580,77.0,0.41895658,118043
2590,77.0,0.420897124,118487
2600,77.0,0.422234014,118942
2610,78.0,0.423551546,119393
2620,78.0,0.424922016,119849
2630,78.0,0.426242709,120314
2640,77.0,0.42930128,120763
2650,78.0,0.430740095,121224
2660,77.0,0.432042615,121680
2670,77.0,0.433341974,122120
2680,77.0,0.43481279,122575
2690,79.0,0.436329828,123027
2700,76.0,0.438051509,123489
2710,77.0,0.439704054,123954
2720,77.0,0.442287365,124410
2730,78.0,0.443647564,124865
2740,78.0,0.445047269,125331
2750,78.0,0.446403122,125800
2760,78.0,0.447703666,126253
2770,79.0,0.448970235,126701
2780,79.0,0.450311471,127168
2790,87.0,0.45170604,127631
2800,88.0,0.45428777,128081
2810,87.0,0.455573697,128540
2820,88.0,0.457327378,129005
2830,87.0,0.458992565,129470
2840,87.0,0.460531726,129922
2850,87.0,0.46183701,130383
2860,87.0,0.463134789,130835
2870,89.0,0.464391481,131270
2880,89.0,0.467098051,131721
2890,89.0,0.468690941,132167
2900,89.0,0.470069312,132622
2910,87.0,0.471377362,133080
2920,86.0,0.47269687,133546
2930,87.0,0.474414599,134000
2940,87.0,0.475815094,134449
2950,86.0,0.477232181,134898
2960,86.0,0.480367393,135358
2970,88.0,0.482208777,135811
2980,88.0,0.483526309,136278
2990,87.0,0.484837915,136746
3000,88.0,0.486147151,137212
3010,87.0,0.487433473,137666
3020,87.0,0.488805523,138129
3030,87.0,0.490375895,138582
3040,87.0,0.492913774,139013
3050,87.0,0.494281873,139472
3060,87.0,0.496498171,139930
3070,87.0,0.497774221,140371
3080,87.0,0.499056987,140813
3090,87.0,0.500386766,141278
3100,87.0,0.501669532,141739
3110,89.0,0.503287312,142184
3120,88.0,0.506567117,142644
3130,88.0,0.5078325,143091
3140,87.0,0.509126724,143543
3150,87.0,0.510396848,143973
3160,89.0,0.511691071,144427
3170,89.0,0.513232208,144877
3180,89.0,0.514545394,145331
3190,89.0,0.515837642,145787
3200,90.0,0.51837157,146247
3210,91.0,0.519672114,146719
3220,89.0,0.521126337,147178
3230,91.0,0.522836561,147633
3240,91.0,0.524149352,148084
3250,91.0,0.525710637,148540
3260,92.0,0.526984317,148983
3270,92.0,0.52827538,149449
3280,95.0,0.530845654,149897
3290,96.0,0.532232717,150369
3300,96.0,0.533499286,150818
3310,96.0,0.534937312,151265
3320,91.0,0.536373362,151708
3330,91.0,0.537656129,152178
3340,91.0,0.538960624,152641
3350,92.0,0.540235094,153087
3360,91.0,0.542775738,153540
3370,91.0,0.544425912,154014
3380,90.0,0.546388581,154464
3390,90.0,0.547701373,154921
3400,90.0,0.549028386,155388
3410,91.0,0.550338807,155840
3420,89.0,0.551609721,156283
3430,89.0,0.553152834,156728
3440,90.0,0.555685182,157186
3450,87.0,0.556957677,157637
3460,86.0,0.558255456,158104
3470,87.0,0.559557975,158564
3480,87.0,0.560892099,159029
3490,92.0,0.56329052,159481
3500,92.0,0.564557879,159935
3510,91.0,0.565851312,160393
3520,87.0,0.567224943,160844
3530,91.0,0.570866625,161288
3540,91.0,0.572147021,161740
3550,87.0,0.573518282,162198
3560,89.0,0.574789591,162646
3570,87.0,0.576227222,163096
3580,87.0,0.577641544,163542
3590,92.0,0.578930631,163993
3600,86.0,0.580568164,164443
3610,87.0,0.583719969,164895
3620,92.0,0.585536069,165349
3630,92.0,0.586856762,165798
3640,92.0,0.588205898,166261
3650,92.0,0.589504072,166728
3660,93.0,0.590749307,167166
3670,93.0,0.592008764,167618
3680,93.0,0.593273752,168058
3690,92.0,0.596982989,168492
3700,92.0,0.598235731,168932
3710,92.0,0.599527584,169380
3720,92.0,0.600817462,169839
3730,92.0,0.602075734,170285
3740,92.0,0.603413019,170729
3750,92.0,0.604705266,171198
3760,91.0,0.606028724,171660
3770,91.0,0.608609664,172127
3780,92.0,0.609866357,172570
3790,91.0,0.611140432,173021
3800,92.0,0.612819841,173460
3810,93.0,0.614068237,173917
3820,92.0,0.615341522,174371
3830,92.0,0.616883055,174831
3840,92.0,0.61815555,175279
3850,92.0,0.621071898,175725
3860,92.0,0.622355849,176182
3870,91.0,0.624421628,176636
3880,90.0,0.625743506,177105
3890,84.0,0.627345483,177550
3900,87.0,0.628643262,178007
3910,85.0,0.629925633,178443
3920,89.0,0.631313881,178886
3930,86.0,0.634151217,179346
3940,84.0,0.636548848,179793
3950,84.0,0.637857293,180243
3960,84.0,0.639188652,180707
3970,84.0,0.64060574,181181
3980,85.0,0.641872309,181627
3990,77.0,0.643978385,182080
4000,81.0,0.645964757,182547
4010,83.0,0.648637747,183009
4020,83.0,0.64993197,183467
4030,80.0,0.651257008,183932
4040,79.0,0.65264249,184393
4050,80.0,0.653925651,184844
4060,80.0,0.655206442,185286
4070,86.0,0.656658295,185744
4080,83.0,0.65796437,186195
4090,83.0,0.660593508,186640
4100,83.0,0.661897608,187105
4110,83.0,0.663173263,187552
4120,83.0,0.664467486,188008
4130,83.0,0.666158352,188468
4140,83.0,0.667499192,188944
4150,83.0,0.668794995,189397
4160,87.0,0.670254354,189852
4170,87.0,0.673518751,190317
4180,87.0,0.675090703,190755
4190,83.0,0.676646457,191219
4200,88.0,0.678251199,191695
4210,88.0,0.679921917,192153
4220,88.0,0.68134572,192599
4230,83.0,0.68274266,193058
4240,85.0,0.68420755,193514
4250,87.0,0.686886861,193968
4260,89.0,0.688285776,194422
4270,89.0,0.689700494,194883
4280,90.0,0.691087162,195341
4290,87.0,0.692462769,195793
4300,87.0,0.693881436,196239
4310,87.0,0.695255857,196696
4320,88.0,0.696623562,197151
4330,88.0,0.699219119,197592
4340,87.0,0.700478972,198033
4350,88.0,0.702043023,198485
4360,87.0,0.703351468,198946
4370,87.0,0.70467216,199411
4380,87.0,0.706113742,199872
4390,86.0,0.707456163,200335
4400,88.0,0.708801349,200774
4410,87.0,0.711752462,201246
4420,87.0,0.713041944,201707
4430,87.0,0.714525402,202163
4440,88.0,0.715849255,202632
4450,88.0,0.717141107,203067
4460,88.0,0.718494984,203515
4470,88.0,0.720149108,203981
4480,87.0,0.721443331,204436
4490,87.0,0.724495186,204891
4500,88.0,0.725767681,205328
4510,86.0,0.727221114,205791
4520,86.0,0.72862793,206254
4530,88.0,0.72993361,206708
4540,87.0,0.731268129,207174
4550,86.0,0.732588821,207623
4560,87.0,0.733884624,208081
4570,87.0,0.73529223,208534
4580,87.0,0.738628528,208981
4590,88.0,0.740049961,209437
4600,88.0,0.741523543,209895
4610,88.0,0.743153964,210353
4620,87.0,0.744707743,210803
4630,88.0,0.746167102,211265
4640,90.0,0.74748898,211735
4650,88.0,0.749037623,212189
4660,87.0,0.75143723,212637
4670,87.0,0.752702218,213087
4680,86.0,0.753979058,213548
4690,87.0,0.755582219,214014
4700,86.0,0.757116245,214470
4710,86.0,0.758416789,214927
4720,87.0,0.759711407,215376
4730,87.0,0.760994174,215843
4740,87.0,0.763529287,216302
4750,89.0,0.765171165,216771
4760,89.0,0.766798426,217235
4770,87.0,0.768272008,217687
4780,87.0,0.769668947,218132
4790,87.0,0.770902331,218580
4800,87.0,0.772236061,219023
4810,87.0,0.773983025,219477
4820,87.0,0.776886731,219926
4830,88.0,0.778143028,220370
4840,87.0,0.779498091,220826
4850,87.0,0.781066487,221281
4860,87.0,0.783579872,221733
4870,87.0,0.78486896,222190
4880,88.0,0.786171084,222639
4890,87.0,0.787940962,223088
4900,87.0,0.790430248,223527
4910,87.0,0.791746199,223986
4920,86.0,0.793013953,224429
4930,85.0,0.794288423,224876
4940,87.0,0.795570795,225317
4950,91.0,0.797352524,225771
4960,87.0,0.798737216,226231
4970,86.0,0.800040526,226701
4980,87.0,0.802619096,227162
4990,87.0,0.803902652,227611
5000,87.0,0.805209517,228052
