,train,test
0.1,0.0029387898291815874,0.009206612079583464
0.2,0.00886756956847421,0.016011087029869486
0.3,0.0147470455262237,0.01929642555485316
0.4,0.02117115444330011,0.020656151160324043
0.5,0.031145609711620635,0.019430983792199187
0.6,0.038215803600246546,0.01856548118989849
0.7,0.04911754922281943,0.015995758610552004
0.8,0.06067359711385052,0.011599425737358615
0.9,0.07033508398631057,0.006435249675473642
