mean_fit_time,std_fit_time,mean_score_time,std_score_time,param_SVM__max_iter,params,split0_test_score,split1_test_score,split2_test_score,split3_test_score,split4_test_score,mean_test_score,std_test_score,rank_test_score,split0_train_score,split1_train_score,split2_train_score,split3_train_score,split4_train_score,mean_train_score,std_train_score
0.003124523162841797,0.006249046325683594,0.0031241416931152345,0.006248283386230469,1,{'SVM__max_iter': 1},0.61875,0.5875,0.5875,0.6,0.590625,0.596875,0.011858541225631427,12,0.61171875,0.628125,0.634375,0.60390625,0.62265625,0.62015625,0.011019779801565932
0.0031241416931152345,0.006248283386230469,0.0,0.0,2,{'SVM__max_iter': 2},0.709375,0.68125,0.6875,0.71875,0.69375,0.698125,0.013919410907075045,11,0.73125,0.73515625,0.7375,0.71875,0.734375,0.73140625,0.006636487681748535
0.009373188018798828,0.007653175971722617,0.0,0.0,4,{'SVM__max_iter': 4},0.80625,0.80625,0.78125,0.8375,0.828125,0.811875,0.019605483926697656,10,0.84140625,0.83125,0.83828125,0.82734375,0.84296875,0.83625,0.0060029289725932865
0.01249709129333496,0.006248545760153351,0.0031241893768310545,0.006248378753662109,8,{'SVM__max_iter': 8},0.85,0.834375,0.821875,0.865625,0.85,0.844375,0.014973935688388661,9,0.8734375,0.86484375,0.8796875,0.8734375,0.8828125,0.8748437500000001,0.006179287479151609
0.015622425079345702,1.401609273595721e-06,0.0,0.0,16,{'SVM__max_iter': 16},0.85,0.840625,0.821875,0.865625,0.85,0.845625,0.01433418117647463,1,0.87421875,0.86484375,0.8796875,0.8734375,0.88359375,0.8751562500000001,0.0063545935648945855
0.021870136260986328,0.012498617173605604,0.0,0.0,32,{'SVM__max_iter': 32},0.85,0.840625,0.821875,0.865625,0.85,0.845625,0.01433418117647463,1,0.87421875,0.86484375,0.8796875,0.8734375,0.88359375,0.8751562500000001,0.0063545935648945855
0.01874566078186035,0.006248950958251953,0.0,0.0,64,{'SVM__max_iter': 64},0.85,0.840625,0.821875,0.865625,0.85,0.845625,0.01433418117647463,1,0.87421875,0.86484375,0.8796875,0.8734375,0.88359375,0.8751562500000001,0.0063545935648945855
0.01562185287475586,3.308439018001872e-06,0.003123617172241211,0.006247234344482422,128,{'SVM__max_iter': 128},0.85,0.840625,0.821875,0.865625,0.85,0.845625,0.01433418117647463,1,0.87421875,0.86484375,0.8796875,0.8734375,0.88359375,0.8751562500000001,0.0063545935648945855
0.015621757507324219,7.629394531249999e-07,0.0,0.0,256,{'SVM__max_iter': 256},0.85,0.840625,0.821875,0.865625,0.85,0.845625,0.01433418117647463,1,0.87421875,0.86484375,0.8796875,0.8734375,0.88359375,0.8751562500000001,0.0063545935648945855
0.015621042251586914,1.0182455303222e-06,0.0,0.0,512,{'SVM__max_iter': 512},0.85,0.840625,0.821875,0.865625,0.85,0.845625,0.01433418117647463,1,0.87421875,0.86484375,0.8796875,0.8734375,0.88359375,0.8751562500000001,0.0063545935648945855
0.015621662139892578,1.2342623811287674e-06,0.0,0.0,1024,{'SVM__max_iter': 1024},0.85,0.840625,0.821875,0.865625,0.85,0.845625,0.01433418117647463,1,0.87421875,0.86484375,0.8796875,0.8734375,0.88359375,0.8751562500000001,0.0063545935648945855
0.015622329711914063,3.5040231839893024e-07,0.0,0.0,2048,{'SVM__max_iter': 2048},0.85,0.840625,0.821875,0.865625,0.85,0.845625,0.01433418117647463,1,0.87421875,0.86484375,0.8796875,0.8734375,0.88359375,0.8751562500000001,0.0063545935648945855
