iterations,fitness,time,fevals
0,0.0302095645094,0.00664968500132,568
10,0.0444550486588,0.0127593200014,1053
20,0.0465375037038,0.0189898430017,1539
30,0.0498791453462,0.0247889590009,2010
40,0.0531470868995,0.0330564220003,2495
50,0.0535819323705,0.0403492670011,2971
60,0.0558333520779,0.0470451740002,3455
70,0.0607896836606,0.0563089840016,3941
80,0.0634448123906,0.0630372860014,4423
90,0.0633331403955,0.0685432660011,4915
100,0.0629199182052,0.074221492001,5411
110,0.0664786052432,0.0797665830014,5900
120,0.0689103307683,0.0854803660022,6375
130,0.0698037610319,0.0909266910021,6850
140,0.0676119182713,0.096566596003,7340
150,0.0742651677859,0.102217563004,7821
160,0.0778180795964,0.107695888004,8301
170,0.0806498705611,0.113248090003,8778
180,0.0780224974233,0.118673082003,9264
190,0.0818638318861,0.125426668003,9739
200,0.0791625326327,0.130809388003,10214
210,0.0800857293561,0.136251368003,10701
220,0.0846308720086,0.141649891002,11186
230,0.0834547976971,0.149364662004,11663
240,0.0810799256554,0.158102249005,12144
250,0.0821067772408,0.166758058005,12624
260,0.0837090643421,0.171909272005,13099
270,0.0857300155363,0.179271649005,13592
280,0.0926706323527,0.187683704005,14066
290,0.0934796091117,0.195138130006,14549
300,0.0912841401827,0.202982482006,15029
310,0.0856876402037,0.210708315006,15507
320,0.083678329701,0.215917998004,16007
330,0.0917903343369,0.221461508005,16510
340,0.0806278200662,0.226658944004,16986
350,0.0766628089816,0.232061418004,17476
360,0.0746930697825,0.238572436005,17955
370,0.0728394418451,0.243763946006,18423
380,0.0731474908589,0.249219358006,18902
390,0.0781222903662,0.254463807005,19388
400,0.0723837114646,0.259907367004,19871
410,0.0814027413533,0.265263618005,20360
420,0.0784356888753,0.271714586004,20836
430,0.0831249144793,0.277194096005,21320
440,0.0784964325658,0.283148471006,21813
450,0.0781357272277,0.291460576005,22296
460,0.0762597896811,0.296816432005,22787
470,0.0822555152618,0.302468980004,23262
480,0.0769570769591,0.309723899005,23747
490,0.0902953586926,0.316978423005,24231
500,0.0870702831779,0.322861292005,24715
510,0.0837027044302,0.331663669005,25188
520,0.0861860841255,0.337042438005,25680
530,0.0818305220681,0.342092516004,26163
540,0.0824464983379,0.348681756004,26645
550,0.0823588433538,0.354118995005,27136
560,0.0848932755692,0.359288777005,27623
570,0.0940857162876,0.367909031005,28099
580,0.0957379991968,0.375461827005,28580
590,0.100254754344,0.380707461005,29059
600,0.0981303961697,0.385759515004,29528
610,0.0988954818513,0.390819470003,30019
620,0.0925928809165,0.396103820003,30508
630,0.0928023174067,0.401184713004,30983
640,0.0880974784259,0.406685557004,31460
650,0.0986658863239,0.413012475003,31947
660,0.0971520447684,0.418115491002,32423
670,0.0956167856373,0.423230755003,32903
680,0.0970086737502,0.428399351002,33379
690,0.0965651884637,0.434270368001,33870
700,0.0998833571587,0.439357187002,34358
710,0.0961761131822,0.447900008001,34848
720,0.0871813563161,0.455618335001,35315
730,0.0862670449959,0.460961550001,35790
740,0.0814166404726,0.467859728002,36275
750,0.0805764437555,0.473350300002,36755
760,0.0759290068948,0.482549714003,37241
770,0.0737685207632,0.488260731003,37736
780,0.0798234483936,0.493368488002,38208
790,0.095922292291,0.498453727003,38686
800,0.0992304482522,0.504041484002,39169
810,0.0925461225756,0.512597342002,39660
820,0.0964943792416,0.517923174,40145
830,0.0862281319124,0.522995769999,40627
840,0.0875268891469,0.529318342999,41106
850,0.0897132086852,0.536956472997,41591
860,0.0994099542443,0.542375143998,42076
870,0.0964820135965,0.550795891997,42555
880,0.0979294483821,0.558357773996,43023
890,0.0985619538153,0.563279851996,43505
900,0.0909369106052,0.569295856998,43989
910,0.0988182639825,0.574553342998,44469
920,0.101188768784,0.579524803999,44939
930,0.0993098208932,0.584679574,45432
940,0.0950412293454,0.589662885999,45916
950,0.0983194044671,0.597639188998,46383
960,0.0959913201393,0.605573219997,46859
970,0.0981485308729,0.610648977996,47339
980,0.0953542082729,0.616943500996,47811
990,0.0918924310183,0.623334418997,48288
1000,0.097827844933,0.628311410996,48777
1010,0.0908264909321,0.633344500995,49255
1020,0.0896565590724,0.638629245996,49737
1030,0.0964924801378,0.643833792996,50226
1040,0.0833885865569,0.649158043996,50702
1050,0.0779591702756,0.655260172996,51196
1060,0.0877956453796,0.663164573996,51681
1070,0.0941911124603,0.669018207996,52171
1080,0.088687560399,0.674010606997,52654
1090,0.0878633227713,0.679222660998,53135
1100,0.0818545645235,0.684731010999,53623
1110,0.0873438346779,0.691572299998,54100
1120,0.0994690462384,0.696874426998,54590
1130,0.109067395188,0.705954927997,55076
1140,0.108778405131,0.710857647997,55553
1150,0.106973356688,0.716365997998,56034
1160,0.101140452318,0.721508520997,56519
1170,0.100955778229,0.726746252996,57012
1180,0.101095727043,0.733326010995,57479
1190,0.0967301713048,0.738253224994,57962
1200,0.0917626982202,0.743775401996,58452
1210,0.0957989523183,0.748720787997,58942
1220,0.0818188046316,0.755300545996,59429
1230,0.0813317363233,0.760467167996,59900
1240,0.0811015931218,0.765620357997,60374
1250,0.0865652988574,0.771275670997,60856
1260,0.0860978682049,0.776570687996,61357
1270,0.0877182740639,0.781765752996,61845
1280,0.0812893270764,0.787246843996,62333
1290,0.0844023739055,0.792419390997,62806
1300,0.0823083012286,0.797949469996,63277
1310,0.0856898498852,0.806282513997,63755
1320,0.0894017611628,0.814026914997,64240
1330,0.0959370538299,0.820102178997,64726
1340,0.0866279562639,0.826675615997,65200
1350,0.0886062218919,0.832034631998,65686
1360,0.0800719122563,0.837475820997,66169
1370,0.0755531072504,0.842621503996,66669
1380,0.0731727219211,0.848119186996,67144
1390,0.0721339756571,0.853740128996,67637
1400,0.0773251133138,0.859726108996,68113
1410,0.0807161474052,0.865286606995,68592
1420,0.0813676579754,0.870624290994,69074
1430,0.0872610482327,0.876948444993,69547
1440,0.0801192056446,0.882710423992,70028
1450,0.0836038008274,0.891529393992,70510
1460,0.0883619778172,0.899490288992,71007
1470,0.0848719180331,0.908756074992,71487
1480,0.0874988501573,0.915363882992,71969
1490,0.0872352297322,0.920816529991,72444
1500,0.0858663598577,0.926505027992,72933
1510,0.090032569494,0.932210513993,73428
1520,0.0874859465258,0.940357877993,73901
1530,0.09214300439,0.945987511994,74382
1540,0.0845527143006,0.951098034995,74866
1550,0.0881137453,0.957707817994,75360
1560,0.0881137453,0.964044217993,75827
1570,0.090666715574,0.969980814994,76306
1580,0.0926147747564,0.975089361993,76798
1590,0.0957208601692,0.981046502993,77265
1600,0.0944921469716,0.986098556994,77743
1610,0.0944921469716,0.991581227994,78234
1620,0.0890615560886,1.00027417299,78721
1630,0.0890428412217,1.005946868,79208
1640,0.0920830759098,1.01285531799,79686
1650,0.102580565181,1.02015290399,80169
1660,0.1012779858,1.02519033999,80654
1670,0.107286679337,1.03008555299,81130
1680,0.105826335134,1.03711094099,81623
1690,0.104916480377,1.04194491999,82111
1700,0.106000359575,1.04781988799,82599
1710,0.102796783267,1.05360952199,83072
1720,0.100411016052,1.05886700799,83559
1730,0.106249394999,1.06438365399,84055
1740,0.102003238826,1.07298336399,84542
1750,0.0964100961915,1.08009487599,85018
1760,0.0905688512152,1.08556016399,85499
1770,0.092082954099,1.09090614399,85990
1780,0.092768325733,1.09600402399,86476
1790,0.0840687876775,1.10463652499,86951
1800,0.0921165381575,1.11003978899,87427
1810,0.0923323454246,1.11600601599,87899
1820,0.0926664651586,1.12121293399,88380
1830,0.0892420433502,1.12694844499,88868
1840,0.0905334176106,1.13320978299,89350
1850,0.103067500335,1.13878766399,89832
1860,0.0941738811438,1.14546223799,90311
1870,0.0986106138326,1.15063794599,90802
1880,0.100032176047,1.15624229599,91287
1890,0.100869892194,1.16113237399,91765
1900,0.0975447369089,1.16641553899,92257
1910,0.095647824819,1.17265751899,92743
1920,0.092726623366,1.18054888399,93234
1930,0.10200126556,1.18566098699,93716
1940,0.0893426974236,1.19135778199,94192
1950,0.0899751267404,1.19732993399,94675
1960,0.0993094547912,1.20266129599,95173
1970,0.0910569007278,1.20841102899,95657
1980,0.100346485303,1.21341804499,96125
1990,0.0957260486458,1.21880471599,96600
2000,0.0973574618073,1.22388521399,97078
