iterations,fitness,time,fevals
0,24.0,0.001944891,688
10,30.0,0.003841189,1246
20,30.0,0.00545580799999,1818
30,31.0,0.00709491999999,2403
40,30.0,0.010313095,2980
50,30.0,0.011918627,3547
60,31.0,0.013575913,4127
70,31.0,0.015365544,4694
80,32.0,0.017039817,5271
90,33.0,0.019177893,5845
100,33.0,0.020903919,6433
110,34.0,0.022539081,7007
120,35.0,0.025627676,7577
130,36.0,0.027314196,8172
140,37.0,0.028942642,8751
150,36.0,0.030941261,9326
160,38.0,0.032544818,9893
170,38.0,0.034789561,10477
180,38.0,0.036418402,11057
190,39.0,0.038087934,11634
200,40.0,0.04112201,12203
210,39.0,0.043011196,12794
220,38.0,0.044678753,13359
230,39.0,0.046322606,13933
240,38.0,0.047935249,14507
250,41.0,0.049560139,15090
260,43.0,0.051489622,15674
270,45.0,0.053635994,16252
280,44.0,0.056855354,16827
290,43.0,0.058430071,17392
300,47.0,0.060104344,17969
310,46.0,0.061909382,18552
320,46.0,0.063490421,19120
330,45.0,0.065138225,19689
340,45.0,0.066712942,20250
350,46.0,0.06826277,20822
360,46.0,0.072101982,21410
370,46.0,0.074121934,21972
380,47.0,0.07590801,22560
390,46.0,0.077690135,23137
400,46.0,0.079345049,23705
410,45.0,0.080956902,24286
420,46.0,0.082555719,24865
430,44.0,0.084168757,25439
440,45.0,0.087209155,26016
450,45.0,0.088809947,26591
460,45.0,0.090422985,27175
470,45.0,0.092056567,27774
480,45.0,0.09366842,28364
490,46.0,0.095804126,28937
500,46.0,0.097605214,29512
510,46.0,0.09917519,30068
520,46.0,0.101864773,30651
530,46.0,0.10343791,31213
540,46.0,0.105730455,31772
550,45.0,0.10764137,32348
560,46.0,0.109484334,32908
570,46.0,0.111069718,33476
580,45.0,0.113039102,34044
590,46.0,0.11468177,34630
600,46.0,0.117618266,35196
610,47.0,0.11936602,35768
620,45.0,0.121080194,36348
630,46.0,0.122698763,36926
640,46.0,0.124710814,37508
650,46.0,0.126325433,38089
660,46.0,0.128043558,38678
670,47.0,0.129615114,39256
680,46.0,0.132296005,39825
690,47.0,0.134403266,40390
700,47.0,0.13601749,40973
710,45.0,0.137617886,41557
720,46.0,0.139577789,42132
730,45.0,0.141192802,42716
740,45.0,0.142797939,43303
750,45.0,0.145572854,43883
760,45.0,0.147162189,44457
770,45.0,0.149437746,45038
780,45.0,0.151093451,45609
790,46.0,0.15270807,46191
800,47.0,0.154326244,46772
810,46.0,0.155990245,47345
820,46.0,0.15786758,47919
830,46.0,0.161098002,48497
840,46.0,0.162774645,49088
850,45.0,0.164424424,49673
860,47.0,0.166003487,50245
870,48.0,0.167855933,50830
880,48.0,0.169854552,51417
890,49.0,0.171641023,51992
900,49.0,0.173237074,52571
910,48.0,0.176165669,53149
920,47.0,0.177788584,53739
930,46.0,0.179404782,54314
940,48.0,0.181008339,54886
950,49.0,0.182575551,55447
960,48.0,0.184147503,56011
970,47.0,0.188207161,56576
980,48.0,0.189762125,57162
990,49.0,0.192902473,57732
1000,48.0,0.194476005,58300
1010,48.0,0.196072451,58875
1020,48.0,0.197717489,59453
1030,48.0,0.199305243,60020
1040,48.0,0.201824948,60590
1050,47.0,0.203481443,61169
1060,49.0,0.205067222,61756
1070,48.0,0.209109102,62330
1080,49.0,0.210747424,62917
1090,49.0,0.212450931,63499
1100,49.0,0.214185648,64079
1110,49.0,0.215878094,64655
1120,49.0,0.2176057,65231
1130,50.0,0.219210837,65799
1140,49.0,0.221279382,66380
1150,50.0,0.225141509,66948
1160,49.0,0.226885313,67530
1170,49.0,0.228578154,68121
1180,50.0,0.230252032,68693
1190,49.0,0.231840576,69262
1200,49.0,0.233451639,69832
1210,49.0,0.235967789,70406
1220,49.0,0.238197914,70984
1230,49.0,0.241041175,71557
1240,50.0,0.24269135,72138
1250,50.0,0.244424092,72706
1260,49.0,0.246247698,73282
1270,51.0,0.247875354,73852
1280,49.0,0.249512886,74429
1290,49.0,0.251153974,75017
1300,50.0,0.252772543,75592
1310,48.0,0.255539953,76154
1320,47.0,0.257716745,76733
1330,48.0,0.259410376,77317
1340,49.0,0.260958624,77878
1350,49.0,0.262555465,78462
1360,48.0,0.264120306,79025
1370,51.0,0.266193196,79600
1380,52.0,0.267985987,80158
1390,52.0,0.271102236,80718
1400,53.0,0.272691571,81287
1410,54.0,0.274299473,81859
1420,54.0,0.27606224,82439
1430,53.0,0.2778736,83001
1440,54.0,0.279447132,83575
1450,53.0,0.281037652,84177
1460,55.0,0.282769604,84769
1470,53.0,0.28560852,85361
1480,54.0,0.287588175,85958
1490,54.0,0.289141954,86548
1500,54.0,0.290693758,87119
1510,54.0,0.292409512,87683
1520,54.0,0.29398976,88265
1530,56.0,0.295549465,88832
1540,56.0,0.297505417,89403
1550,55.0,0.300175641,89954
1560,55.0,0.302182161,90528
1570,56.0,0.30373436,91092
1580,56.0,0.305317374,91671
1590,55.0,0.30688024,92242
1600,56.0,0.308445871,92812
1610,55.0,0.310029279,93395
1620,55.0,0.312469577,93988
1630,56.0,0.315162715,94561
1640,54.0,0.316737432,95147
1650,54.0,0.319557385,95723
1660,53.0,0.321147114,96295
1670,52.0,0.322738424,96857
1680,54.0,0.324334474,97420
1690,54.0,0.325979117,98009
1700,53.0,0.32825981,98583
1710,54.0,0.331001541,99161
1720,54.0,0.332646579,99750
1730,55.0,0.334348111,100329
1740,54.0,0.336070581,100916
1750,54.0,0.337995718,101488
1760,55.0,0.339564509,102065
1770,55.0,0.341259325,102654
1780,55.0,0.34317024,103227
1790,55.0,0.346106736,103799
1800,55.0,0.347797601,104370
1810,55.0,0.349393256,104948
1820,55.0,0.350999578,105523
1830,56.0,0.352659234,106100
1840,56.0,0.354226445,106679
1850,56.0,0.3557901,107247
1860,55.0,0.357362447,107819
1870,55.0,0.360490943,108388
1880,56.0,0.362230402,108960
1890,56.0,0.363799193,109523
1900,56.0,0.365359688,110101
1910,55.0,0.366951788,110684
1920,56.0,0.369063394,111261
1930,55.0,0.370680383,111850
1940,57.0,0.372300532,112426
1950,56.0,0.375294312,113009
1960,56.0,0.376903399,113583
1970,56.0,0.378544882,114173
1980,57.0,0.38016029,114759
1990,58.0,0.381785575,115346
2000,58.0,0.383486317,115917
2010,57.0,0.385812837,116503
2020,57.0,0.387651456,117080
2030,57.0,0.390377384,117667
2040,57.0,0.39238588,118241
2050,57.0,0.394293635,118808
2060,56.0,0.396212452,119381
2070,57.0,0.398262034,119961
2080,56.0,0.400249986,120530
2090,57.0,0.402238729,121096
2100,57.0,0.404139767,121666
2110,57.0,0.407354387,122238
2120,56.0,0.409280314,122820
2130,57.0,0.411228365,123394
2140,57.0,0.413341552,123978
2150,56.0,0.415297109,124544
2160,57.0,0.417261752,125118
2170,56.0,0.419269457,125698
2180,58.0,0.420934643,126278
2190,57.0,0.423729707,126868
2200,58.0,0.425307585,127450
2210,58.0,0.426855833,128036
2220,58.0,0.429020378,128618
2230,58.0,0.430693466,129196
2240,57.0,0.432296233,129769
2250,59.0,0.433878457,130343
2260,59.0,0.435467792,130910
2270,59.0,0.438223745,131476
2280,58.0,0.439807944,132054
2290,59.0,0.441390168,132631
2300,59.0,0.443361133,133197
2310,59.0,0.444897134,133766
2320,59.0,0.446458419,134322
2330,59.0,0.44837605,134897
2340,58.0,0.450114718,135467
2350,58.0,0.452942177,136048
2360,58.0,0.454593931,136622
2370,59.0,0.456172994,137216
2380,59.0,0.458013984,137802
2390,59.0,0.459668108,138373
2400,59.0,0.461333294,138935
2410,59.0,0.462918677,139516
2420,59.0,0.464558975,140098
2430,58.0,0.467289249,140666
2440,59.0,0.468992757,141249
2450,60.0,0.470595523,141830
2460,58.0,0.472175771,142402
2470,58.0,0.475005205,142975
2480,57.0,0.476778638,143561
2490,59.0,0.478325701,144137
2500,57.0,0.479919776,144711
2510,58.0,0.483129655,145292
2520,58.0,0.484685014,145864
2530,57.0,0.486265262,146442
2540,59.0,0.487931634,147014
2550,58.0,0.489467635,147591
2560,57.0,0.491159291,148167
2570,59.0,0.49335149,148746
2580,58.0,0.494895787,149323
2590,58.0,0.498067345,149901
2600,58.0,0.499646013,150480
2610,58.0,0.501433669,151066
2620,58.0,0.502996139,151634
2630,59.0,0.504611943,152221
2640,59.0,0.506200883,152800
2650,59.0,0.507792193,153390
2660,59.0,0.509549824,153967
2670,58.0,0.51245353,154558
2680,60.0,0.514037729,155125
2690,58.0,0.516162768,155697
2700,59.0,0.517771856,156276
2710,57.0,0.519396746,156875
2720,61.0,0.521039019,157462
2730,61.0,0.522972058,158043
2740,60.0,0.525007418,158607
2750,60.0,0.528419569,159187
2760,58.0,0.53052999,159765
2770,61.0,0.532549547,160347
2780,58.0,0.534546585,160913
2790,60.0,0.536316858,161486
2800,60.0,0.537857995,162055
2810,60.0,0.539505009,162619
2820,60.0,0.541082097,163202
2830,60.0,0.543829753,163785
2840,60.0,0.545806248,164361
2850,58.0,0.547708471,164942
2860,59.0,0.549411584,165518
2870,60.0,0.551037659,166102
2880,60.0,0.552606846,166679
2890,61.0,0.554275983,167251
2900,60.0,0.555840033,167838
2910,60.0,0.559207938,168418
2920,62.0,0.560788976,168993
2930,60.0,0.562368039,169573
2940,60.0,0.564382855,170160
2950,60.0,0.565964289,170736
2960,60.0,0.5676595,171296
2970,63.0,0.569193921,171851
2980,61.0,0.570751255,172425
2990,60.0,0.573452689,173000
3000,60.0,0.576018617,173576
3010,61.0,0.577725681,174160
3020,61.0,0.579294078,174750
3030,59.0,0.58083008,175319
3040,59.0,0.582464846,175898
3050,59.0,0.584189291,176474
3060,59.0,0.585799564,177051
3070,61.0,0.588554727,177625
3080,62.0,0.590736655,178190
3090,62.0,0.592277002,178761
3100,64.0,0.593875818,179332
3110,64.0,0.595623967,179924
3120,64.0,0.597154437,180501
3130,65.0,0.598686882,181068
3140,65.0,0.600250537,181642
3150,63.0,0.602236119,182221
3160,64.0,0.603811232,182799
3170,65.0,0.605464567,183381
3180,64.0,0.60700926,183955
3190,64.0,0.608627434,184529
3200,64.0,0.610273263,185105
3210,65.0,0.611785561,185687
3220,65.0,0.614523735,186264
3230,65.0,0.616058551,186827
3240,66.0,0.61808838,187397
3250,65.0,0.61961727,187963
3260,64.0,0.621202654,188547
3270,64.0,0.622776976,189137
3280,65.0,0.624890163,189708
3290,63.0,0.626449078,190290
3300,63.0,0.629159599,190859
3310,63.0,0.630708242,191431
3320,64.0,0.632282169,192018
3330,64.0,0.633838318,192599
3340,64.0,0.63537511,193174
3350,64.0,0.637290371,193745
3360,63.0,0.639188249,194329
3370,64.0,0.64103872,194912
3380,63.0,0.644014327,195481
3390,62.0,0.645642377,196058
3400,62.0,0.647245539,196634
3410,63.0,0.649236257,197203
3420,63.0,0.650933443,197776
3430,63.0,0.652512506,198352
3440,62.0,0.654077742,198928
3450,63.0,0.655800212,199510
3460,62.0,0.659186683,200085
3470,63.0,0.660738882,200658
3480,64.0,0.662295426,201232
3490,65.0,0.663829452,201809
3500,64.0,0.665408911,202389
3510,66.0,0.666975727,202967
3520,66.0,0.668960914,203542
3530,66.0,0.670490594,204119
3540,66.0,0.673216127,204709
3550,65.0,0.674745017,205277
3560,67.0,0.676294845,205841
3570,66.0,0.677931587,206413
3580,67.0,0.679468773,206989
3590,66.0,0.681026502,207582
3600,68.0,0.682581466,208169
3610,68.0,0.684128134,208754
3620,69.0,0.687983939,209340
3630,71.0,0.689610409,209929
3640,71.0,0.691256633,210517
3650,70.0,0.692780387,211097
3660,70.0,0.694301771,211676
3670,70.0,0.695938908,212247
3680,70.0,0.697562218,212811
3690,70.0,0.699073331,213389
3700,69.0,0.701760543,213981
3710,69.0,0.703299704,214563
3720,70.0,0.705378521,215140
3730,70.0,0.707124696,215726
3740,68.0,0.708640944,216288
3750,69.0,0.710329044,216871
3760,68.0,0.711859514,217440
3770,68.0,0.713847861,218017
3780,65.0,0.716527962,218590
3790,68.0,0.718075815,219162
3800,68.0,0.719905348,219744
3810,68.0,0.721534978,220325
3820,70.0,0.723190683,220918
3830,70.0,0.724697054,221487
3840,68.0,0.726316018,222055
3850,69.0,0.729056958,222638
3860,68.0,0.731759183,223219
3870,69.0,0.733373011,223804
3880,69.0,0.734928765,224384
3890,69.0,0.736473063,224966
3900,69.0,0.738611929,225542
3910,72.0,0.740127387,226105
3920,72.0,0.74167287,226686
3930,72.0,0.743326599,227240
3940,70.0,0.746168281,227826
3950,69.0,0.747680184,228404
3960,70.0,0.749674852,228996
3970,70.0,0.751195446,229571
3980,70.0,0.752765818,230148
3990,70.0,0.754295893,230734
4000,71.0,0.755820043,231315
4010,70.0,0.757338267,231890
4020,71.0,0.760459258,232467
4030,72.0,0.762141432,233058
4040,71.0,0.7636561,233649
4050,71.0,0.765164052,234227
4060,71.0,0.766674769,234808
4070,70.0,0.768457684,235386
4080,71.0,0.770346475,235973
4090,71.0,0.771880106,236552
4100,71.0,0.774564553,237138
4110,70.0,0.776071714,237718
4120,70.0,0.777584012,238300
4130,71.0,0.780270829,238890
4140,72.0,0.781912707,239455
4150,70.0,0.783437647,240047
4160,70.0,0.784938092,240618
4170,69.0,0.786461846,241191
4180,69.0,0.789668565,241780
4190,70.0,0.791214837,242359
4200,69.0,0.792757949,242942
4210,70.0,0.794952914,243529
4220,69.0,0.796488125,244115
4230,69.0,0.798068373,244668
4240,69.0,0.79961188,245237
4250,68.0,0.801154202,245818
4260,70.0,0.80381771,246403
4270,68.0,0.80537702,246987
4280,69.0,0.806863639,247558
4290,68.0,0.808792727,248132
4300,68.0,0.811289519,248720
4310,69.0,0.812835397,249287
4320,69.0,0.814517966,249856
4330,68.0,0.816055152,250433
4340,70.0,0.818672043,251024
4350,67.0,0.820196588,251601
4360,67.0,0.821845577,252183
4370,68.0,0.823410418,252773
4380,68.0,0.825415358,253352
4390,72.0,0.826933581,253932
4400,71.0,0.82858178,254510
4410,71.0,0.830114621,255088
4420,67.0,0.833349784,255647
4430,74.0,0.834908304,256219
4440,73.0,0.836721639,256800
4450,73.0,0.838280948,257377
4460,74.0,0.839814579,257956
4470,73.0,0.841829791,258534
4480,73.0,0.843376458,259120
4490,76.0,0.844919175,259711
4500,72.0,0.847564511,260287
4510,74.0,0.849073253,260870
4520,72.0,0.850593847,261444
4530,72.0,0.853051923,262019
4540,73.0,0.854570147,262596
4550,71.0,0.856107729,263166
4560,70.0,0.857633854,263749
4570,71.0,0.85916867,264333
4580,72.0,0.862081068,264901
4590,73.0,0.863602057,265464
4600,71.0,0.865142404,266056
4610,69.0,0.866685911,266639
4620,70.0,0.868219542,267218
4630,71.0,0.869785568,267809
4640,70.0,0.871713075,268396
4650,70.0,0.87435367,268987
4660,70.0,0.877038512,269558
4670,71.0,0.878571748,270135
4680,71.0,0.880112885,270713
4690,71.0,0.881634664,271306
4700,72.0,0.883149332,271878
4710,73.0,0.884674666,272453
4720,74.0,0.886599803,273017
4730,76.0,0.888309236,273598
4740,74.0,0.890870818,274173
4750,73.0,0.892434474,274768
4760,74.0,0.893984302,275361
4770,74.0,0.895615908,275942
4780,71.0,0.897144008,276516
4790,73.0,0.89868712,277097
4800,72.0,0.900217985,277674
4810,72.0,0.902940357,278252
4820,72.0,0.90575873,278809
4830,73.0,0.907278533,279382
4840,72.0,0.908794386,279967
4850,73.0,0.910285745,280541
4860,73.0,0.911786585,281124
4870,73.0,0.913311525,281693
4880,70.0,0.915101946,282264
4890,72.0,0.916600811,282827
4900,71.0,0.9192659,283419
4910,72.0,0.921342346,283988
4920,71.0,0.922858199,284562
4930,72.0,0.924707485,285136
4940,72.0,0.926898104,285723
4950,71.0,0.928539587,286305
4960,72.0,0.930957366,286879
4970,71.0,0.932555392,287456
4980,71.0,0.935333863,288016
4990,70.0,0.936843395,288591
5000,71.0,0.938465915,289172
