k,Pen Digits Data sse (left)
2,2277.31402459889
3,1320.5192669096014
4,863.2564350499229
5,645.298279283229
6,510.80239529381237
7,437.23744657603345
8,381.879311977293
9,330.48304046285614
10,282.1227765354897
15,180.16070263121338
20,129.78456464067904
25,98.76365642886165
30,80.31352922547671
35,68.06483800779105
40,57.22966524351314
