param_SVM__max_iter,train acc,test acc
1,0.6250761285142762,0.6019360913926199
2,0.6260401797559622,0.6165222953594587
4,0.7369765756660002,0.7337239664176274
8,0.8914296771339377,0.8775027113303655
16,0.9691985006404482,0.9646434623262142
32,0.9930360034123008,0.9901694985409465
64,0.9924792853740622,0.9884953632347596
128,0.996427090449404,0.9928621754618339
256,0.9965364996397761,0.9928621754618339
512,0.9965364996397761,0.9928621754618339
1024,0.9965364996397761,0.9928621754618339
2048,0.9965364996397761,0.9928621754618339
