,0,1,2,3,4,5,6,7,8,9
2,0.91187997038297,0.9005865076160966,0.9006883302531553,0.8975041271479874,0.905177121163306,0.8964000507286409,0.9029791326656231,0.9043023559178773,0.9083861352702775,0.9021527615031681
3,0.840019457565758,0.8514703748014992,0.8510071163358492,0.8460964706337324,0.8424817800571993,0.8450967897601731,0.8445885267232214,0.8572939695959318,0.8504049466583078,0.8535500400545364
4,0.8007518016191228,0.7990164931936284,0.8148404738806434,0.8039824395729611,0.8065363230146031,0.7948448919176754,0.7984240639840645,0.8133108597635496,0.8179442955136785,0.7808688118265334
5,0.7339343395345067,0.7518341125924611,0.7408325562048577,0.7411299564269657,0.7398781007346821,0.7508853335689524,0.7569252622467528,0.7607514155931294,0.764135411946471,0.7356259683120429
6,0.7028093648126359,0.6991922384322126,0.690065522266556,0.6854202273569909,0.6904406895843218,0.7062152924521998,0.7114313171848099,0.693856930450634,0.6904068050985286,0.7113136970691719
7,0.6526617674457542,0.6448847690686983,0.6448494714110102,0.6431323918923393,0.6558551849663785,0.6488763959825532,0.6616515359083267,0.6509822862600122,0.6587953733856108,0.6638060821111383
8,0.5946041067614273,0.6047015497844094,0.5949602729227507,0.5836926450620672,0.5750327847750056,0.5997451351636193,0.5890855360573971,0.606764284759841,0.5927028007635757,0.5987552506821596
9,0.5520396435296174,0.5494236477951978,0.5420290529504225,0.5488428420319473,0.5519592847990032,0.5478463511683999,0.5245094225254551,0.5399884201314693,0.5698603067798192,0.544964917353282
10,0.4968615407322537,0.4884381570957091,0.4977618954185551,0.4906027792654916,0.501633860967744,0.49829232964863857,0.4956265700793436,0.5015811202746688,0.5074856251659815,0.5190615739422885
15,0.2617653874502795,0.2533670857508712,0.25340772624223956,0.25089211084125573,0.26382290567749817,0.25359216353342123,0.26436091178281457,0.2617271630915791,0.24011600318456452,0.24305264122610795
20,2.0330466124333865e-29,8.796647874521278e-30,1.9826605929304674e-27,1.5537364603092725e-29,1.2759113928867655e-29,9.796403947352024e-30,2.1162836872388296e-29,5.617824049661622e-29,9.589598042194755e-30,0.05039835997056957
25,5.1154759904592756e-30,4.387390097171068e-30,5.590780424216721e-30,3.175157919438052e-30,4.064699827495881e-30,1.8445116208491173e-30,4.901106511110027e-30,6.017921786887024e-30,3.0485161554912603e-30,6.601245762550291e-30
30,4.837349988205588e-30,2.3192708606289215e-30,4.6090586643141725e-30,1.0522913259196171e-29,8.212590460612588e-30,1.7199351082289614e-30,3.932657685452427e-30,3.368967305595478e-30,9.229123077644211e-30,4.4618744958949e-30
35,5.076212396277493e-30,2.2391812447737105e-30,2.0864695727834915e-30,2.132880983248833e-30,3.770726462569933e-30,4.830148466748059e-30,2.200165692553309e-30,7.848115329799614e-30,2.8571264760750136e-30,4.523670044648344e-30
40,7.141959889756825e-30,1.6672248777173816e-30,2.9512016681568314e-30,2.7364267782108577e-30,5.435904016754162e-30,2.2434614445036554e-30,2.2854070993449032e-30,2.6827344150830343e-30,8.041491835725277e-30,2.1280215248367175e-30
45,3.5782978424446205e-30,5.517177197935894e-30,3.129393848581095e-30,5.082108848179268e-30,1.2728586433002982e-30,2.122983118716364e-30,1.5485675944841862e-30,1.644816494163546e-30,1.6275872251591224e-30,4.2273309157775916e-30
50,3.209098408227043e-30,3.5288336626421134e-30,1.7533788925131002e-30,1.9553766115871334e-30,4.554632782349033e-30,7.894740030221175e-30,1.76476089796527e-30,1.7764800959501624e-30,1.959193118334271e-30,1.125764277834352e-29
55,2.8645915776883332e-30,1.863177657285402e-30,2.2625132730657622e-30,2.204504885121748e-30,1.7712381334517057e-30,1.5755904537594049e-30,2.6103563227828086e-30,6.045690303046751e-30,1.882101961524212e-30,1.419386302072198e-30
60,5.7722666285083636e-30,4.72934963360354e-30,1.7569017376011492e-30,5.455727317311561e-30,1.6333523434784666e-30,3.328249154834132e-30,1.9955064824377684e-30,2.73679431988847e-30,1.5047016879374468e-30,1.2680023612473039e-30
