k,Mobile Price Data log-likelihood
2,-17.161999873751782
3,-18.659543404039038
4,-18.58154716324505
5,-18.338945469252746
6,-13.376953071867455
7,-13.350431188654282
8,-12.399090944654178
9,-12.279807460980123
10,-12.747691222589518
15,-10.183371093772498
20,-6.106039392923792
25,-3.4510869412502974
30,-4.098662698869317
35,-2.4714974599493544
40,-2.4186130667909578
