iterations,fitness,time,fevals
0,0.0359790019759,0.0102566000005,793
10,0.0411706944983,0.0195085579999,1507
20,0.0466280631551,0.0325143950013,2207
30,0.0522342673645,0.0474840860006,2887
40,0.0536734612691,0.0601114540004,3579
50,0.0578295831902,0.0701748690008,4276
60,0.0641547817007,0.079962531001,4977
70,0.0675354367497,0.0883947350012,5676
80,0.0659693778314,0.0997061510006,6358
90,0.0707969403141,0.108397516002,7038
100,0.0678157072514,0.117379647001,7751
110,0.0681222364909,0.126171358002,8440
120,0.0751675012668,0.134450673002,9122
130,0.07722045285,0.143989446002,9820
140,0.0804382398154,0.157406938,10514
150,0.0799677088838,0.168538996,11209
160,0.0849066346459,0.177048633001,11913
170,0.0956375062745,0.186958764001,12607
180,0.102879494112,0.194724894001,13300
190,0.0925392320067,0.202704357001,14005
200,0.0876353083875,0.212890242003,14702
210,0.0876835556676,0.220833755002,15381
220,0.0907973004458,0.229600971003,16083
230,0.0862860088501,0.238025670002,16797
240,0.0919582417665,0.245996836002,17504
250,0.0888416331681,0.254527015002,18192
260,0.0918676594669,0.267076951002,18904
270,0.0924230655587,0.276989058002,19595
280,0.0882704235469,0.286927238003,20297
290,0.0924821353184,0.300345916005,20992
300,0.0854817076498,0.308328934005,21690
310,0.0892712266074,0.321304352006,22385
320,0.0857894686551,0.329136062006,23103
330,0.0903115662975,0.337077599006,23786
340,0.0862441509607,0.349994547007,24480
350,0.0924295032805,0.358345764007,25187
360,0.0979977887609,0.367188042006,25878
370,0.0964205229444,0.374911505007,26578
380,0.0992785094207,0.382403461008,27274
390,0.0931901317085,0.393763075008,27964
400,0.0971264914606,0.401562785008,28657
410,0.0940831544864,0.409075680007,29360
420,0.103753030065,0.418843984007,30059
430,0.102314205508,0.428240535008,30772
440,0.108132935059,0.435714319008,31472
450,0.107344989272,0.443719857009,32176
460,0.105776050002,0.452266235008,32875
470,0.106969432444,0.464788122008,33555
480,0.107564501436,0.47251632501,34243
490,0.112957446317,0.481694011009,34940
500,0.111086506302,0.489274066009,35643
510,0.111321539104,0.497378368009,36351
520,0.1063517005,0.506108844009,37038
530,0.103704018756,0.514487715009,37741
540,0.107464080584,0.52680140401,38433
550,0.102589507459,0.535913115011,39139
560,0.10572894882,0.54407865201,39840
570,0.0974235608925,0.55314453601,40540
580,0.103147977226,0.560817431011,41230
590,0.101261509989,0.56997734001,41925
600,0.0899280669134,0.58010712601,42632
610,0.0888936190154,0.58826239201,43322
620,0.089643666332,0.60009687101,44009
630,0.0971510125789,0.61344009101,44697
640,0.091760370009,0.626775015011,45395
650,0.103395542113,0.636372652012,46091
660,0.0922547089079,0.644350535013,46784
670,0.0964570005588,0.653324765013,47466
680,0.0961563492498,0.665242207013,48167
690,0.0948002024871,0.673403004013,48856
700,0.0890651011726,0.681835603013,49555
710,0.0948447969369,0.689476498013,50241
720,0.0957524352582,0.698071863013,50935
730,0.092032696094,0.706093992014,51642
740,0.0977772834526,0.715959482013,52338
750,0.103071951536,0.724884724013,53037
760,0.103153520116,0.733034459014,53730
770,0.0963414560556,0.741851059014,54424
780,0.100838272193,0.749927312016,55126
790,0.0949969206906,0.758491072016,55837
800,0.094778310794,0.766843474017,56517
810,0.101284050478,0.774406542016,57223
820,0.101578988449,0.782365857016,57916
830,0.0997171170973,0.789882702016,58617
840,0.0980611204975,0.801457230016,59316
850,0.0945861230881,0.809625137017,60017
860,0.102161930115,0.817566674017,60712
870,0.0902683286783,0.827982485016,61397
880,0.0902841572231,0.836450640016,62104
890,0.0982823190744,0.844336473016,62799
900,0.0903113585729,0.852798702015,63485
910,0.0833830354505,0.860673868016,64191
920,0.0894487836348,0.869129380017,64901
930,0.0951503516352,0.878595462018,65597
940,0.0988555212625,0.886797740019,66290
950,0.0946921370529,0.894717548017,66977
960,0.0966669907965,0.903092073017,67676
970,0.0979893672313,0.910781166018,68373
980,0.10687240526,0.919113815016,69083
990,0.101137442022,0.926627500017,69775
1000,0.100051305431,0.938850324017,70466
1010,0.102215940617,0.946936849017,71146
1020,0.0955097031934,0.954375868017,71846
1030,0.106533731027,0.964496567018,72558
1040,0.0948492222451,0.973077710018,73256
1050,0.100466944457,0.980430605017,73947
1060,0.100265803608,0.989624094016,74639
1070,0.0975547115874,1.00286617902,75321
1080,0.0990623322578,1.01038658002,76017
1090,0.0934423698049,1.01977009402,76717
1100,0.0973957180871,1.02875182902,77431
1110,0.0907161399323,1.03647094602,78138
1120,0.0999571011344,1.04999984602,78832
1130,0.093841440568,1.05777585202,79528
1140,0.0964235693242,1.06610850102,80212
1150,0.0953351075054,1.07441428502,80898
1160,0.0971854037238,1.08211997002,81600
1170,0.0964726763834,1.09014091502,82309
1180,0.0963378145716,1.10251465302,83019
1190,0.0929671371564,1.11259229002,83725
1200,0.0980660420359,1.12022488902,84441
1210,0.103012803527,1.13306361502,85143
1220,0.104775528423,1.14147922602,85836
1230,0.0995404399047,1.14932318302,86537
1240,0.0973871632629,1.16063538902,87240
1250,0.100380171744,1.16832250602,87939
1260,0.0997514312494,1.17905910802,88623
1270,0.100700906872,1.19116736402,89318
1280,0.0997943804577,1.19841043102,90022
1290,0.0960186079952,1.20646693101,90715
1300,0.0943397286836,1.21640590201,91401
1310,0.094113333767,1.22493766201,92089
1320,0.0943433828072,1.23343900202,92768
1330,0.0953202496364,1.24096730401,93465
1340,0.0994657664814,1.24874133502,94169
1350,0.0960459547651,1.25639961302,94887
1360,0.0962054697122,1.26494045902,95602
1370,0.0998006301643,1.27756624702,96298
1380,0.0955797272273,1.28688418002,96980
1390,0.0939665215141,1.29439549502,97675
1400,0.0894902455944,1.30605417101,98370
1410,0.10352387191,1.31509437602,99068
1420,0.102181969165,1.32259344302,99754
1430,0.0906856240594,1.33064283202,100462
1440,0.0911822859685,1.34036056802,101155
1450,0.0942891445745,1.34888837702,101864
1460,0.0966101266777,1.36108868302,102564
1470,0.0966151895613,1.36960977602,103260
1480,0.0930109804218,1.37817116602,103954
1490,0.0907937384931,1.38602381402,104649
1500,0.0930418538933,1.39636851402,105362
1510,0.0986256447977,1.40449928602,106064
1520,0.0896787787732,1.41183400802,106765
1530,0.0904589511926,1.42460438802,107476
1540,0.0862911333471,1.43368804902,108179
1550,0.095852995322,1.44143284502,108874
1560,0.0900791493535,1.45287937302,109578
1570,0.0995120713267,1.46065972502,110256
1580,0.0892826621257,1.46852343502,110962
1590,0.0895455469211,1.47692284902,111664
1600,0.0923294396888,1.49001441402,112374
1610,0.0848743569046,1.49776355602,113086
1620,0.0885386153136,1.50702460002,113776
1630,0.0905275043976,1.51503922402,114471
1640,0.0930917390489,1.52301513102,115170
1650,0.0970064570791,1.53112377902,115885
1660,0.0942585222535,1.53931499502,116576
1670,0.0965509373656,1.54696300102,117266
1680,0.0970056520409,1.55731007102,117947
1690,0.0916924410931,1.56780568402,118637
1700,0.0909008931646,1.57604904902,119341
1710,0.0929848167129,1.58966249202,120040
1720,0.0895057665755,1.59710980702,120742
1730,0.0895975358414,1.60803564302,121442
1740,0.0893534074233,1.61669698302,122144
1750,0.0937588230915,1.62449432202,122835
1760,0.0925213097296,1.63471971302,123527
1770,0.092620871492,1.64412337402,124217
1780,0.0867517709032,1.65206570102,124918
1790,0.0939806984725,1.66122007902,125588
1800,0.083838096091,1.66918650502,126291
1810,0.0901501162444,1.67717149902,126987
1820,0.0908949330709,1.68483609802,127692
1830,0.0937804218287,1.69257891902,128376
1840,0.0966336232542,1.70055008602,129073
1850,0.0906408054627,1.70824629002,129757
1860,0.0930046774168,1.71622851802,130467
1870,0.0927161188038,1.72431583302,131166
1880,0.0942840608754,1.73325727202,131864
1890,0.0940934837602,1.74287150203,132559
1900,0.0955011664797,1.75079407603,133272
1910,0.100517895901,1.75884702102,133950
1920,0.0942880274567,1.76699754602,134648
1930,0.101727831043,1.77481977403,135350
1940,0.0991351316659,1.78322748403,136072
1950,0.106278737982,1.79140250303,136768
1960,0.108592207854,1.80120438703,137490
1970,0.0978574427534,1.80966582603,138175
1980,0.103566722687,1.81832677103,138858
1990,0.116275513625,1.82560895003,139554
2000,0.115523833745,1.83288204203,140250
