,0,1,2,3,4
0.001,0.688129413701252,0.6973301114228742,0.6824247083795799,0.6946056286050363,0.6720171892947826
0.101,0.7805780251445782,0.821237127944703,0.7863402352608921,0.7923627170519257,0.7943314859666888
0.201,0.7861827505392025,0.8230889712782204,0.7972500496089022,0.8107166420638384,0.8070672637310321
0.30100000000000005,0.7936262862155249,0.8267121596840176,0.8009265201971375,0.8143534385090352,0.8124372534535397
0.401,0.7972364415695026,0.8303619891810338,0.8027381144000361,0.8125152032149175,0.8124769275965782
0.501,0.7971061729266123,0.8322002244751515,0.8064276180400908,0.8179902349542321,0.8143151628906959
0.6010000000000001,0.7970291864661603,0.8340384597692692,0.8082658533342085,0.8198284702483497,0.8143548370337343
0.7010000000000001,0.7988407806690588,0.8321735833839323,0.8101040886283262,0.8180299090972705,0.8143548370337343
0.801,0.7988674217602779,0.83401181867805,0.8101040886283262,0.8234652666935465,0.8125166017396166
0.901,0.8007056570543956,0.8358234128809485,0.8137539181253423,0.8234652666935465,0.8143548370337345
1.001,0.8007056570543956,0.8358234128809485,0.8137539181253423,0.8234652666935465,0.8143548370337345
1.101,0.8007056570543956,0.8376616481750662,0.8137539181253423,0.8216667055424673,0.8124017120337343
1.201,0.8007056570543956,0.8376616481750662,0.8137539181253423,0.8252638278446256,0.8143548370337343
1.301,0.8007056570543956,0.8376616481750662,0.8137539181253423,0.8252638278446256,0.8124017120337343
1.401,0.8007056570543956,0.8376616481750662,0.8137539181253423,0.8232953239076177,0.8106031508826552
1.501,0.7989070959033163,0.8376616481750662,0.8137539181253423,0.823425592550508,0.8142796214708904
1.601,0.7989070959033163,0.8376616481750662,0.8136876028910847,0.8216270313994288,0.8142796214708904
1.701,0.7989070959033163,0.8376616481750662,0.8136876028910847,0.819658527462421,0.8142796214708904
1.801,0.7989070959033163,0.8376616481750662,0.8137272770341232,0.8216270313994288,0.8142796214708904
1.901,0.7989070959033163,0.8376616481750662,0.8137272770341232,0.823425592550508,0.8142796214708904
2.001,0.7989070959033163,0.8358500539721675,0.8155258381852023,0.8216270313994288,0.8142796214708904
2.101,0.7989070959033163,0.8358500539721675,0.8155258381852023,0.823425592550508,0.8142796214708904
2.201,0.7989070959033163,0.8358500539721675,0.8155258381852023,0.8216270313994288,0.8086897000256938
2.301,0.7989070959033163,0.8358500539721675,0.8155258381852023,0.8216270313994288,0.8086897000256938
2.4010000000000002,0.7989070959033163,0.8358500539721675,0.8137272770341232,0.8198284702483496,0.8086897000256938
