,0,1,2,3,4,5,6,7,8,9
2,0.2834794211082338,0.23148167615434298,0.2723798217785278,0.2779213335356868,0.28519041153080593,0.35011476372565414,0.25603038322810423,0.2446461302219353,0.27815670776659923,0.20773640846377928
3,0.38028422957188746,0.2673801213018095,0.3300277975502377,0.360619274359216,0.39193595858264196,0.32356833024180737,0.31726045236141853,0.3030278670812513,0.34141627772668914,0.28800896874922505
4,0.39356643131266644,0.3330958624073497,0.3705240974090334,0.3818030806398473,0.3726280394867075,0.337949302593295,0.38101647899280333,0.34380114821119173,0.3564037499703945,0.33994438209010464
5,0.5004770359759243,0.40759304407450814,0.4418642022156375,0.4230427889413712,0.4158249011044592,0.39610560771077197,0.4024350281387847,0.3839908610047338,0.4193078920164666,0.4054481302569101
6,0.45739722713882164,0.39568356530850424,0.48090209180480337,0.46053556817227354,0.4555247104501697,0.4145889659791005,0.4388386488253869,0.4412263359219529,0.4760571895454245,0.36943198445017955
7,0.5013134245573214,0.42710376350424045,0.501442277495001,0.4900805512456668,0.48949842556109385,0.46611110128808325,0.46355978740254666,0.4582537768189947,0.48629516768369635,0.45365314713916166
8,0.5253581483151373,0.43094695713596926,0.5433386030606121,0.5279304509215494,0.5367577032142344,0.4990942597104779,0.49806703129200264,0.4472294136943165,0.5486769463243663,0.46966943331282346
9,0.5048931119955559,0.4959269445213466,0.5769905141913153,0.5135052146462229,0.5378034884217301,0.5631285798975897,0.5449226852625044,0.5461077490807559,0.5329914008728969,0.488847557728127
10,0.5424100699571837,0.5401170039227365,0.5916887745031741,0.5530850847577372,0.525660918493243,0.5300641085309528,0.5443951127072986,0.49270259934794225,0.5704144597940725,0.4743219521949619
15,0.5607829271661031,0.5478384849796709,0.6549926448491981,0.6510730696687133,0.615463902982161,0.6243079449209994,0.64468195339204,0.620779110880313,0.6426691206807873,0.6360437376096088
20,0.7088113945677479,0.6231923369172367,0.6979575556367914,0.6815057803391742,0.7066929181553726,0.7017043691784737,0.6506925921142398,0.6629858484382929,0.6912330321792183,0.6772008059743666
25,0.6953058396646601,0.7157083714008924,0.7143539850775178,0.7026908203721681,0.7505432259599791,0.7179907726402021,0.7023651240091127,0.7024165369388001,0.6968123469094891,0.6897201641912106
30,0.7496680107825199,0.7479438799068744,0.7395063330135645,0.7672448526152523,0.7293964579828571,0.7410592096889461,0.7639975152933755,0.7406376167915638,0.7494361777518578,0.781334825850415
35,0.7491702001267314,0.7680748515501402,0.8113202073372624,0.7872351079632782,0.7576382089553644,0.7648598267864125,0.7860023909095635,0.761408463903265,0.7865824710805782,0.7710956004229479
40,0.7875550040152698,0.7564035747601563,0.804846802066982,0.804977555800961,0.8030689531550561,0.804186950729976,0.7594581559375315,0.7676535939139352,0.7941348922552312,0.8167840214450369
45,0.8105986018522806,0.7893342593682834,0.8032666094152848,0.8134853937166933,0.7892947656006919,0.8163657427215442,0.8311883739787699,0.8001999819457325,0.7832441028166838,0.7885293007202975
50,0.8331001297264701,0.7869281922521458,0.8023338954048032,0.8344718585707297,0.8130573534959494,0.8211473129593316,0.8326611632393905,0.8191159612210471,0.8424891153702745,0.8265082598358844
55,0.8383415835204029,0.8118279159166097,0.8495697730799653,0.849477809872436,0.8217879001873987,0.8611586615927943,0.8497191360847853,0.8192234413444195,0.8253433600570983,0.8686662850827698
60,0.8481048074502885,0.8200236527039823,0.8667251289161534,0.8273202729417617,0.8377734269107827,0.8515904424819302,0.8377813124392585,0.8277819816035322,0.8664031602589294,0.844032049008005
