2,1.0236364683183474
3,0.9948086737870696
4,0.9645948587792907
5,1.1848806908223923
6,1.24440258465819
7,1.6939322758860218
8,1.6280887450987187
9,1.662934379996559
10,1.9754718073623594
15,3.6068578530286444
20,3.71030141081774
25,3.71030141081774
30,3.71030141081774
35,3.71030141081774
40,3.71030141081774
45,3.71030141081774
50,3.71030141081774
55,3.71030141081774
60,3.71030141081774
