iterations,fitness,time,fevals
0,24.0,0.002000594,740
10,27.0,0.00417541,1369
20,29.0,0.006356153,2001
30,30.0,0.008516748,2642
40,30.0,0.010334824,3273
50,30.0,0.012037541,3892
60,30.0,0.013906579,4526
70,29.0,0.016789742,5161
80,31.0,0.01849404,5788
90,30.0,0.020187671,6420
100,32.0,0.021906191,7050
110,33.0,0.023643279,7676
120,34.0,0.02546333,8313
130,33.0,0.027681999,8943
140,33.0,0.029410395,9585
150,32.0,0.031091384,10204
160,32.0,0.032788966,10838
170,33.0,0.034524079,11460
180,34.0,0.03621929,12086
190,34.0,0.037957563,12740
200,34.0,0.039656725,13359
210,34.0,0.041798752,13975
220,34.0,0.044679544,14601
230,35.0,0.046539891,15232
240,35.0,0.049233819,15865
250,36.0,0.051511747,16503
260,36.0,0.053422267,17120
270,36.0,0.055290121,17749
280,36.0,0.057155209,18385
290,35.0,0.058862667,19030
300,36.0,0.061893978,19656
310,37.0,0.06369072,20278
320,37.0,0.065464548,20902
330,36.0,0.067201636,21542
340,35.0,0.068919761,22177
350,36.0,0.070607466,22802
360,36.0,0.072313344,23434
370,36.0,0.073978135,24058
380,37.0,0.076795322,24694
390,38.0,0.079389299,25314
400,37.0,0.081088461,25946
410,37.0,0.082789203,26569
420,37.0,0.084759773,27191
430,38.0,0.086483034,27827
440,38.0,0.08893795,28453
450,38.0,0.090607482,29083
460,38.0,0.093564126,29719
470,38.0,0.095324918,30351
480,39.0,0.097043833,30983
490,42.0,0.098746945,31618
500,39.0,0.100738848,32255
510,39.0,0.102421417,32878
520,41.0,0.104902802,33506
530,43.0,0.106622507,34124
540,44.0,0.109776683,34754
550,48.0,0.111528388,35382
560,49.0,0.113210957,36007
570,49.0,0.114902218,36647
580,49.0,0.116991306,37281
590,51.0,0.118657283,37903
600,51.0,0.120339852,38540
610,51.0,0.12198726,39159
620,51.0,0.124786669,39777
630,51.0,0.127224201,40414
640,53.0,0.128895708,41056
650,54.0,0.130536795,41680
660,52.0,0.132312203,42310
670,52.0,0.133973834,42939
680,51.0,0.135836551,43572
690,52.0,0.137508848,44210
700,54.0,0.140286924,44832
710,51.0,0.142353099,45464
720,51.0,0.144038038,46097
730,51.0,0.145874681,46729
740,50.0,0.147545793,47357
750,51.0,0.149235078,47986
760,50.0,0.151452957,48615
770,50.0,0.154632021,49251
780,50.0,0.156488813,49885
790,50.0,0.15818758,50500
800,50.0,0.16006689,51129
810,52.0,0.162131485,51761
820,52.0,0.163809314,52392
830,52.0,0.165576426,53023
840,53.0,0.167321415,53651
850,54.0,0.170661664,54276
860,53.0,0.17235569,54901
870,54.0,0.174706309,55533
880,53.0,0.176701372,56161
890,53.0,0.178626509,56792
900,53.0,0.180970017,57417
910,53.0,0.182632043,58048
920,53.0,0.184275501,58673
930,57.0,0.187018417,59300
940,57.0,0.1886599,59938
950,62.0,0.190413186,60562
960,62.0,0.19206731,61204
970,57.0,0.193698521,61842
980,56.0,0.195287461,62464
990,55.0,0.196909191,63101
1000,57.0,0.198533291,63740
1010,57.0,0.202306924,64380
1020,58.0,0.203939321,65009
1030,58.0,0.205597001,65645
1040,57.0,0.207284311,66288
1050,58.0,0.208912361,66902
1060,58.0,0.211641055,67540
1070,58.0,0.213424365,68167
1080,58.0,0.215180021,68796
1090,58.0,0.21829232,69431
1100,61.0,0.22007326,70071
1110,61.0,0.221749508,70689
1120,61.0,0.223593658,71333
1130,60.0,0.225256475,71964
1140,58.0,0.226924822,72598
1150,57.0,0.228648083,73226
1160,56.0,0.230397022,73857
1170,58.0,0.233413321,74486
1180,57.0,0.235418261,75118
1190,58.0,0.237061324,75753
1200,58.0,0.238714659,76382
1210,58.0,0.240434364,77028
1220,56.0,0.24206676,77665
1230,58.0,0.243718515,78311
1240,58.0,0.245338664,78932
1250,57.0,0.248181135,79552
1260,58.0,0.250108248,80171
1270,59.0,0.251720101,80795
1280,59.0,0.253358818,81423
1290,59.0,0.254960794,82053
1300,59.0,0.256541438,82679
1310,58.0,0.258153292,83313
1320,60.0,0.260043664,83948
1330,60.0,0.263700358,84581
1340,62.0,0.265323273,85210
1350,60.0,0.266933545,85838
1360,60.0,0.268552904,86465
1370,61.0,0.270552313,87097
1380,61.0,0.274356366,87730
1390,61.0,0.276076861,88355
1400,60.0,0.278856913,88986
1410,59.0,0.281038841,89621
1420,60.0,0.282765657,90254
1430,60.0,0.284499584,90887
1440,59.0,0.286255635,91517
1450,60.0,0.287915686,92148
1460,60.0,0.289730206,92787
1470,60.0,0.291481516,93411
1480,60.0,0.294413271,94036
1490,61.0,0.296502754,94657
1500,59.0,0.298169916,95296
1510,59.0,0.299750164,95911
1520,61.0,0.301554017,96539
1530,61.0,0.303148882,97153
1540,61.0,0.304730315,97788
1550,62.0,0.306826909,98414
1560,62.0,0.309546121,99029
1570,63.0,0.311388295,99672
1580,63.0,0.313406272,100303
1590,64.0,0.31498336,100916
1600,63.0,0.31664183,101549
1610,63.0,0.318235906,102179
1620,62.0,0.319817734,102803
1630,62.0,0.321898131,103430
1640,62.0,0.324716504,104059
1650,63.0,0.326584357,104692
1660,64.0,0.328560852,105323
1670,64.0,0.330344162,105954
1680,66.0,0.331972608,106586
1690,66.0,0.333701004,107213
1700,64.0,0.335311277,107847
1710,64.0,0.337020315,108479
1720,64.0,0.3398537,109116
1730,63.0,0.341636219,109742
1740,63.0,0.343232665,110369
1750,63.0,0.344808567,111008
1760,63.0,0.346704865,111634
1770,63.0,0.348686101,112265
1780,64.0,0.350296374,112892
1790,64.0,0.351903486,113520
1800,64.0,0.355425464,114161
1810,64.0,0.357363638,114797
1820,64.0,0.359238998,115421
1830,66.0,0.361193765,116054
1840,64.0,0.36285342,116690
1850,65.0,0.364477915,117314
1860,65.0,0.366098854,117935
1870,65.0,0.36782488,118574
1880,66.0,0.370533426,119221
1890,65.0,0.372794761,119846
1900,65.0,0.374495108,120488
1910,65.0,0.37609985,121118
1920,67.0,0.37848879,121755
1930,67.0,0.381222619,122386
1940,67.0,0.382918621,123017
1950,67.0,0.385775315,123648
1960,66.0,0.387373342,124275
1970,66.0,0.388963072,124902
1980,66.0,0.390685937,125537
1990,66.0,0.392294235,126165
2000,68.0,0.393891076,126794
2010,68.0,0.395928411,127427
2020,66.0,0.3975134,128046
2030,67.0,0.400398143,128683
2040,70.0,0.402006441,129305
2050,69.0,0.403633701,129938
2060,65.0,0.405286246,130565
2070,66.0,0.407815433,131187
2080,66.0,0.409857114,131822
2090,67.0,0.411585115,132459
2100,67.0,0.413204079,133088
2110,67.0,0.415986896,133707
2120,67.0,0.41753949,134335
2130,68.0,0.419504528,134966
2140,68.0,0.421435987,135592
2150,68.0,0.423038359,136222
2160,68.0,0.425070163,136855
2170,69.0,0.426846362,137485
2180,67.0,0.428486659,138104
2190,68.0,0.431491896,138742
2200,68.0,0.433179601,139363
2210,68.0,0.434789479,139988
2220,67.0,0.436632049,140613
2230,72.0,0.438500692,141244
2240,71.0,0.440255557,141881
2250,69.0,0.441971706,142526
2260,69.0,0.443714325,143155
2270,69.0,0.446429981,143791
2280,69.0,0.448039859,144424
2290,69.0,0.449981984,145041
2300,72.0,0.451728948,145671
2310,71.0,0.45333843,146317
2320,73.0,0.455020209,146955
2330,71.0,0.45693231,147592
2340,71.0,0.458885892,148231
2350,72.0,0.462475426,148874
2360,69.0,0.464079377,149518
2370,68.0,0.46572244,150150
2380,71.0,0.468152862,150778
2390,71.0,0.469933802,151408
2400,71.0,0.471579236,152030
2410,67.0,0.473215188,152659
2420,68.0,0.474891831,153302
2430,69.0,0.478113562,153922
2440,70.0,0.479749118,154562
2450,69.0,0.481331737,155195
2460,69.0,0.482896973,155823
2470,69.0,0.484745074,156451
2480,70.0,0.486379446,157090
2490,70.0,0.48809283,157721
2500,68.0,0.489688485,158348
2510,69.0,0.492664487,158979
2520,69.0,0.494319401,159604
2530,70.0,0.495892538,160246
2540,69.0,0.497632391,160878
2550,69.0,0.499219355,161510
2560,70.0,0.500771949,162137
2570,69.0,0.502841284,162777
2580,70.0,0.505618175,163409
2590,70.0,0.507264794,164038
2600,69.0,0.50930766,164660
2610,69.0,0.511338279,165292
2620,69.0,0.513112898,165931
2630,70.0,0.51469038,166556
2640,69.0,0.516262727,167185
2650,70.0,0.518303617,167822
2660,70.0,0.521555373,168454
2670,70.0,0.523185398,169093
2680,70.0,0.524805942,169717
2690,70.0,0.526510239,170350
2700,70.0,0.52839429,170973
2710,70.0,0.530010094,171614
2720,70.0,0.531593897,172238
2730,70.0,0.53333138,172877
2740,70.0,0.536683481,173495
2750,70.0,0.538925063,174125
2760,70.0,0.540712719,174764
2770,71.0,0.542319436,175393
2780,70.0,0.544049018,176010
2790,70.0,0.545815735,176631
2800,73.0,0.547403489,177256
2810,72.0,0.549007441,177887
2820,75.0,0.551827789,178533
2830,70.0,0.553623741,179163
2840,69.0,0.555769323,179804
2850,70.0,0.557391843,180425
2860,70.0,0.559488437,181059
2870,71.0,0.561255945,181692
2880,72.0,0.562902564,182314
2890,71.0,0.564529825,182940
2900,71.0,0.567317778,183571
2910,70.0,0.56905289,184188
2920,69.0,0.570884792,184821
2930,70.0,0.57255946,185442
2940,70.0,0.574234523,186082
2950,69.0,0.575883512,186720
2960,69.0,0.577519464,187354
2970,69.0,0.579700206,187994
2980,70.0,0.582615764,188628
2990,70.0,0.584326383,189263
3000,69.0,0.586011718,189894
3010,69.0,0.587677695,190520
3020,68.0,0.58990861,191164
3030,68.0,0.59226713,191786
3040,69.0,0.593889255,192428
3050,68.0,0.595486886,193062
3060,68.0,0.59840758,193702
3070,68.0,0.599983088,194320
3080,68.0,0.601602448,194954
3090,67.0,0.603193362,195569
3100,67.0,0.604769265,196172
3110,68.0,0.606372032,196802
3120,67.0,0.608431096,197432
3130,68.0,0.610133023,198056
3140,67.0,0.612905963,198697
3150,67.0,0.614532434,199331
3160,68.0,0.616901621,199969
3170,68.0,0.618618166,200597
3180,68.0,0.620227648,201228
3190,69.0,0.621819748,201860
3200,69.0,0.623836539,202494
3210,70.0,0.626564443,203126
3220,70.0,0.628185778,203764
3230,70.0,0.629850964,204404
3240,70.0,0.631667064,205043
3250,69.0,0.63374035,205687
3260,69.0,0.635333636,206318
3270,69.0,0.636932452,206949
3280,69.0,0.638528897,207581
3290,69.0,0.641561393,208202
3300,70.0,0.643192604,208847
3310,68.0,0.644848309,209480
3320,68.0,0.646414334,210096
3330,68.0,0.648029348,210735
3340,68.0,0.649676757,211380
3350,68.0,0.651814042,212005
3360,68.0,0.653685846,212639
3370,68.0,0.656377798,213260
3380,67.0,0.657975824,213889
3390,69.0,0.659580566,214518
3400,67.0,0.66113632,215149
3410,67.0,0.662742247,215784
3420,67.0,0.664378594,216416
3430,67.0,0.665957262,217037
3440,67.0,0.667550547,217667
3450,67.0,0.670447142,218311
3460,67.0,0.67250581,218950
3470,67.0,0.674155984,219573
3480,67.0,0.67610206,220211
3490,67.0,0.677704432,220843
3500,68.0,0.679298112,221475
3510,67.0,0.680988582,222104
3520,68.0,0.682565275,222732
3530,68.0,0.685465426,223369
3540,68.0,0.68705081,223993
3550,68.0,0.688618811,224614
3560,68.0,0.690202615,225243
3570,67.0,0.691784443,225857
3580,67.0,0.693754222,226488
3590,67.0,0.69577378,227128
3600,67.0,0.697375362,227746
3610,67.0,0.700360451,228378
3620,67.0,0.702381588,229013
3630,67.0,0.704092602,229642
3640,67.0,0.705683122,230266
3650,67.0,0.707387815,230901
3660,67.0,0.70920431,231525
3670,68.0,0.710832756,232171
3680,69.0,0.712461597,232809
3690,68.0,0.715125501,233426
3700,69.0,0.716738144,234055
3710,68.0,0.71855701,234687
3720,67.0,0.7202779,235320
3730,68.0,0.721925309,235952
3740,67.0,0.723552569,236580
3750,67.0,0.725194052,237218
3760,67.0,0.727962252,237850
3770,68.0,0.730711094,238481
3780,69.0,0.732345465,239111
3790,68.0,0.733966404,239739
3800,69.0,0.735569961,240365
3810,68.0,0.737170753,240986
3820,68.0,0.739393767,241614
3830,67.0,0.74100167,242236
3840,67.0,0.74373945,242865
3850,68.0,0.745365131,243498
3860,68.0,0.746977379,244130
3870,69.0,0.748864195,244772
3880,69.0,0.751205332,245403
3890,68.0,0.753380149,246040
3900,67.0,0.754969484,246651
3910,68.0,0.756584102,247274
3920,67.0,0.760353784,247898
3930,67.0,0.762660551,248534
3940,67.0,0.764299268,249160
3950,69.0,0.765889788,249775
3960,67.0,0.767498085,250402
3970,68.0,0.769698976,251024
3980,67.0,0.772911226,251665
3990,68.0,0.77452703,252285
4000,68.0,0.777564267,252928
4010,68.0,0.779667577,253554
4020,68.0,0.781241109,254166
4030,70.0,0.783255136,254789
4040,70.0,0.784908866,255420
4050,70.0,0.786525065,256043
4060,68.0,0.788302845,256680
4070,67.0,0.789898896,257299
4080,68.0,0.792547392,257918
4090,69.0,0.794237072,258552
4100,69.0,0.795812579,259183
4110,69.0,0.797896926,259817
4120,69.0,0.799485866,260437
4130,69.0,0.801086657,261057
4140,69.0,0.802770017,261685
4150,69.0,0.804347895,262305
4160,69.0,0.806995206,262930
4170,69.0,0.808611009,263567
4180,69.0,0.810419208,264192
4190,68.0,0.812185925,264818
4200,68.0,0.81418968,265457
4210,67.0,0.815809434,266090
4220,67.0,0.817469485,266730
4230,68.0,0.819114128,267365
4240,68.0,0.822619514,268000
4250,68.0,0.824318676,268636
4260,68.0,0.82593843,269273
4270,69.0,0.827683023,269901
4280,68.0,0.829283024,270533
4290,68.0,0.83126189,271162
4300,67.0,0.833193743,271790
4310,67.0,0.835124411,272421
4320,67.0,0.838290044,273052
4330,68.0,0.840322243,273670
4340,70.0,0.842251331,274297
4350,68.0,0.844453012,274917
4360,68.0,0.846397903,275547
4370,68.0,0.848307633,276168
4380,69.0,0.85023435,276787
4390,69.0,0.853354945,277406
4400,67.0,0.8565028,278044
4410,73.0,0.85847495,278672
4420,73.0,0.860420631,279307
4430,69.0,0.862344188,279929
4440,69.0,0.864433672,280565
4450,69.0,0.866367501,281197
4460,69.0,0.8680477,281831
4470,69.0,0.870885825,282458
4480,69.0,0.872499258,283081
4490,69.0,0.875072693,283714
4500,69.0,0.876749732,284346
4510,70.0,0.878371857,284972
4520,70.0,0.881117538,285597
4530,69.0,0.883704009,286225
4540,69.0,0.885421344,286864
4550,69.0,0.888246037,287480
4560,69.0,0.890068853,288118
4570,71.0,0.891702434,288754
4580,70.0,0.893313102,289387
4590,70.0,0.894968017,290020
4600,70.0,0.896581845,290656
4610,70.0,0.89820397,291287
4620,71.0,0.899831625,291912
4630,70.0,0.902612072,292547
4640,69.0,0.904226296,293173
4650,69.0,0.905936124,293806
4660,71.0,0.908357855,294430
4670,70.0,0.909975634,295056
4680,70.0,0.911588672,295675
4690,70.0,0.913205266,296306
4700,70.0,0.914836872,296940
4710,70.0,0.917748479,297564
4720,69.0,0.91934927,298192
4730,69.0,0.920941765,298824
4740,69.0,0.922995297,299454
4750,69.0,0.924563693,300059
4760,69.0,0.926141176,300678
4770,69.0,0.927732486,301304
4780,70.0,0.92935382,301945
4790,70.0,0.932692094,302560
4800,71.0,0.934282614,303199
4810,71.0,0.93591738,303827
4820,71.0,0.938012394,304467
4830,68.0,0.939804,305095
4840,68.0,0.941447458,305727
4850,68.0,0.943105138,306369
4860,68.0,0.944735954,307003
4870,68.0,0.947747512,307637
4880,69.0,0.94957507,308252
4890,69.0,0.9511968,308881
4900,68.0,0.95278969,309510
4910,69.0,0.954411814,310135
4920,69.0,0.956049741,310773
4930,68.0,0.95795236,311417
4940,69.0,0.96005093,312050
4950,69.0,0.961724808,312692
4960,69.0,0.963371821,313326
4970,69.0,0.965209649,313958
4980,68.0,0.966957404,314580
4990,68.0,0.968601257,315203
5000,68.0,0.970236024,315833
