digraph Tree {
node [shape=box] ;
0 [label="X[7] <= 0.06\nentropy = 2.0\nsamples = 676\nvalue = [169.0, 169.0, 169.0, 169.0]"] ;
1 [label="X[5] <= -0.229\nentropy = 1.537\nsamples = 302\nvalue = [64.103, 116.312, 116.249, 0.0]"] ;
0 -> 1 [labeldistance=2.5, labelangle=45, headlabel="True"] ;
2 [label="X[0] <= 0.372\nentropy = 0.97\nsamples = 83\nvalue = [63.132, 6.959, 10.746, 0.0]"] ;
1 -> 2 ;
3 [label="X[4] <= 0.753\nentropy = 1.473\nsamples = 37\nvalue = [18.454, 6.959, 10.746, 0.0]"] ;
2 -> 3 ;
4 [label="X[1] <= 0.519\nentropy = 1.337\nsamples = 20\nvalue = [1.943, 6.959, 10.746, 0.0]"] ;
3 -> 4 ;
5 [label="X[0] <= -0.544\nentropy = 0.98\nsamples = 17\nvalue = [0.0, 6.959, 9.769, 0.0]"] ;
4 -> 5 ;
6 [label="entropy = 0.0\nsamples = 3\nvalue = [0.0, 2.982, 0.0, 0.0]"] ;
5 -> 6 ;
7 [label="X[13] <= -0.049\nentropy = 0.868\nsamples = 14\nvalue = [0.0, 3.976, 9.769, 0.0]"] ;
5 -> 7 ;
8 [label="X[16] <= 1.238\nentropy = 0.656\nsamples = 12\nvalue = [0.0, 1.988, 9.769, 0.0]"] ;
7 -> 8 ;
9 [label="entropy = 0.0\nsamples = 10\nvalue = [0.0, 0.0, 9.769, 0.0]"] ;
8 -> 9 ;
10 [label="entropy = 0.0\nsamples = 2\nvalue = [0.0, 1.988, 0.0, 0.0]"] ;
8 -> 10 ;
11 [label="entropy = 0.0\nsamples = 2\nvalue = [0.0, 1.988, 0.0, 0.0]"] ;
7 -> 11 ;
12 [label="X[15] <= -0.745\nentropy = 0.92\nsamples = 3\nvalue = [1.943, 0.0, 0.977, 0.0]"] ;
4 -> 12 ;
13 [label="entropy = 0.0\nsamples = 1\nvalue = [0.0, 0.0, 0.977, 0.0]"] ;
12 -> 13 ;
14 [label="entropy = -0.0\nsamples = 2\nvalue = [1.943, 0.0, 0.0, 0.0]"] ;
12 -> 14 ;
15 [label="entropy = -0.0\nsamples = 17\nvalue = [16.511, 0.0, 0.0, 0.0]"] ;
3 -> 15 ;
16 [label="entropy = 0.0\nsamples = 46\nvalue = [44.678, 0.0, 0.0, 0.0]"] ;
2 -> 16 ;
17 [label="X[1] <= 1.579\nentropy = 1.037\nsamples = 219\nvalue = [0.971, 109.353, 105.503, 0.0]"] ;
1 -> 17 ;
18 [label="X[0] <= 1.959\nentropy = 0.984\nsamples = 180\nvalue = [0.0, 75.553, 101.595, 0.0]"] ;
17 -> 18 ;
19 [label="X[12] <= 1.113\nentropy = 0.995\nsamples = 168\nvalue = [0.0, 75.553, 89.873, 0.0]"] ;
18 -> 19 ;
20 [label="X[4] <= -0.532\nentropy = 0.998\nsamples = 119\nvalue = [0.0, 61.635, 55.682, 0.0]"] ;
19 -> 20 ;
21 [label="entropy = 0.0\nsamples = 12\nvalue = [0.0, 11.929, 0.0, 0.0]"] ;
20 -> 21 ;
22 [label="X[15] <= 2.36\nentropy = 0.998\nsamples = 107\nvalue = [0.0, 49.706, 55.682, 0.0]"] ;
20 -> 22 ;
23 [label="X[4] <= 0.624\nentropy = 1.0\nsamples = 100\nvalue = [0.0, 49.706, 48.844, 0.0]"] ;
22 -> 23 ;
24 [label="entropy = 0.995\nsamples = 86\nvalue = [0.0, 38.771, 45.913, 0.0]"] ;
23 -> 24 ;
25 [label="entropy = 0.744\nsamples = 14\nvalue = [0.0, 10.935, 2.931, 0.0]"] ;
23 -> 25 ;
26 [label="entropy = 0.0\nsamples = 7\nvalue = [0.0, 0.0, 6.838, 0.0]"] ;
22 -> 26 ;
27 [label="X[0] <= 1.105\nentropy = 0.868\nsamples = 49\nvalue = [0.0, 13.918, 34.191, 0.0]"] ;
19 -> 27 ;
28 [label="X[6] <= 1.19\nentropy = 0.975\nsamples = 17\nvalue = [0.0, 9.941, 6.838, 0.0]"] ;
27 -> 28 ;
29 [label="X[5] <= 0.217\nentropy = 0.982\nsamples = 12\nvalue = [0.0, 4.971, 6.838, 0.0]"] ;
28 -> 29 ;
30 [label="entropy = 0.644\nsamples = 6\nvalue = [0.0, 4.971, 0.977, 0.0]"] ;
29 -> 30 ;
31 [label="entropy = 0.0\nsamples = 6\nvalue = [0.0, 0.0, 5.861, 0.0]"] ;
29 -> 31 ;
32 [label="entropy = 0.0\nsamples = 5\nvalue = [0.0, 4.971, 0.0, 0.0]"] ;
28 -> 32 ;
33 [label="X[12] <= 1.311\nentropy = 0.549\nsamples = 32\nvalue = [0.0, 3.976, 27.353, 0.0]"] ;
27 -> 33 ;
34 [label="X[0] <= 1.593\nentropy = 0.792\nsamples = 17\nvalue = [0.0, 3.976, 12.699, 0.0]"] ;
33 -> 34 ;
35 [label="entropy = 0.0\nsamples = 3\nvalue = [0.0, 2.982, 0.0, 0.0]"] ;
34 -> 35 ;
36 [label="entropy = 0.376\nsamples = 14\nvalue = [0.0, 0.994, 12.699, 0.0]"] ;
34 -> 36 ;
37 [label="entropy = 0.0\nsamples = 15\nvalue = [0.0, 0.0, 14.653, 0.0]"] ;
33 -> 37 ;
38 [label="entropy = 0.0\nsamples = 12\nvalue = [0.0, 0.0, 11.723, 0.0]"] ;
18 -> 38 ;
39 [label="X[0] <= 1.593\nentropy = 0.638\nsamples = 39\nvalue = [0.971, 33.8, 3.908, 0.0]"] ;
17 -> 39 ;
40 [label="X[5] <= 0.217\nentropy = 0.189\nsamples = 34\nvalue = [0.0, 32.806, 0.977, 0.0]"] ;
39 -> 40 ;
41 [label="X[12] <= 1.831\nentropy = 1.0\nsamples = 2\nvalue = [0.0, 0.994, 0.977, 0.0]"] ;
40 -> 41 ;
42 [label="entropy = 0.0\nsamples = 1\nvalue = [0.0, 0.0, 0.977, 0.0]"] ;
41 -> 42 ;
43 [label="entropy = 0.0\nsamples = 1\nvalue = [0.0, 0.994, 0.0, 0.0]"] ;
41 -> 43 ;
44 [label="entropy = 0.0\nsamples = 32\nvalue = [0.0, 31.812, 0.0, 0.0]"] ;
40 -> 44 ;
45 [label="X[2] <= 1.441\nentropy = 1.373\nsamples = 5\nvalue = [0.971, 0.994, 2.931, 0.0]"] ;
39 -> 45 ;
46 [label="entropy = -0.0\nsamples = 3\nvalue = [0.0, 0.0, 2.931, 0.0]"] ;
45 -> 46 ;
47 [label="X[12] <= 1.449\nentropy = 1.0\nsamples = 2\nvalue = [0.971, 0.994, 0.0, 0.0]"] ;
45 -> 47 ;
48 [label="entropy = 0.0\nsamples = 1\nvalue = [0.0, 0.994, 0.0, 0.0]"] ;
47 -> 48 ;
49 [label="entropy = 0.0\nsamples = 1\nvalue = [0.971, 0.0, 0.0, 0.0]"] ;
47 -> 49 ;
50 [label="X[5] <= -0.006\nentropy = 1.824\nsamples = 374\nvalue = [104.897, 52.688, 52.751, 169.0]"] ;
0 -> 50 [labeldistance=2.5, labelangle=-45, headlabel="False"] ;
51 [label="X[11] <= -0.749\nentropy = 1.936\nsamples = 281\nvalue = [101.011, 50.7, 50.798, 78.654]"] ;
50 -> 51 ;
52 [label="X[9] <= -1.136\nentropy = 1.451\nsamples = 127\nvalue = [0.971, 26.841, 27.353, 75.465]"] ;
51 -> 52 ;
53 [label="X[8] <= -1.182\nentropy = 1.584\nsamples = 62\nvalue = [0.0, 19.882, 21.491, 21.258]"] ;
52 -> 53 ;
54 [label="X[7] <= 2.241\nentropy = 1.267\nsamples = 25\nvalue = [0.0, 4.971, 3.908, 17.006]"] ;
53 -> 54 ;
55 [label="X[16] <= -1.696\nentropy = 0.851\nsamples = 20\nvalue = [0.0, 2.982, 0.977, 17.006]"] ;
54 -> 55 ;
56 [label="entropy = 0.0\nsamples = 2\nvalue = [0.0, 1.988, 0.0, 0.0]"] ;
55 -> 56 ;
57 [label="X[14] <= 2.069\nentropy = 0.585\nsamples = 18\nvalue = [0.0, 0.994, 0.977, 17.006]"] ;
55 -> 57 ;
58 [label="entropy = 0.304\nsamples = 17\nvalue = [0.0, 0.0, 0.977, 17.006]"] ;
57 -> 58 ;
59 [label="entropy = -0.0\nsamples = 1\nvalue = [0.0, 0.994, 0.0, 0.0]"] ;
57 -> 59 ;
60 [label="X[15] <= 0.158\nentropy = 0.973\nsamples = 5\nvalue = [0.0, 1.988, 2.931, 0.0]"] ;
54 -> 60 ;
61 [label="entropy = 0.0\nsamples = 2\nvalue = [0.0, 1.988, 0.0, 0.0]"] ;
60 -> 61 ;
62 [label="entropy = -0.0\nsamples = 3\nvalue = [0.0, 0.0, 2.931, 0.0]"] ;
60 -> 62 ;
63 [label="X[9] <= -1.344\nentropy = 1.397\nsamples = 37\nvalue = [0.0, 14.912, 17.584, 4.252]"] ;
53 -> 63 ;
64 [label="X[4] <= -0.789\nentropy = 1.0\nsamples = 26\nvalue = [0.0, 12.924, 12.699, 0.0]"] ;
63 -> 64 ;
65 [label="X[9] <= -1.414\nentropy = 0.549\nsamples = 8\nvalue = [0.0, 0.994, 6.838, 0.0]"] ;
64 -> 65 ;
66 [label="entropy = 0.0\nsamples = 7\nvalue = [0.0, 0.0, 6.838, 0.0]"] ;
65 -> 66 ;
67 [label="entropy = 0.0\nsamples = 1\nvalue = [0.0, 0.994, 0.0, 0.0]"] ;
65 -> 67 ;
68 [label="X[9] <= -1.553\nentropy = 0.914\nsamples = 18\nvalue = [0.0, 11.929, 5.861, 0.0]"] ;
64 -> 68 ;
69 [label="entropy = 0.992\nsamples = 9\nvalue = [0.0, 3.976, 4.884, 0.0]"] ;
68 -> 69 ;
70 [label="entropy = 0.498\nsamples = 9\nvalue = [0.0, 7.953, 0.977, 0.0]"] ;
68 -> 70 ;
71 [label="X[17] <= -0.221\nentropy = 1.496\nsamples = 11\nvalue = [0.0, 1.988, 4.884, 4.252]"] ;
63 -> 71 ;
72 [label="X[1] <= -1.029\nentropy = 0.922\nsamples = 6\nvalue = [0.0, 1.988, 3.908, 0.0]"] ;
71 -> 72 ;
73 [label="entropy = 0.0\nsamples = 4\nvalue = [0.0, 0.0, 3.908, 0.0]"] ;
72 -> 73 ;
74 [label="entropy = 0.0\nsamples = 2\nvalue = [0.0, 1.988, 0.0, 0.0]"] ;
72 -> 74 ;
75 [label="X[15] <= 1.513\nentropy = 0.695\nsamples = 5\nvalue = [0.0, 0.0, 0.977, 4.252]"] ;
71 -> 75 ;
76 [label="entropy = 0.0\nsamples = 4\nvalue = [0.0, 0.0, 0.0, 4.252]"] ;
75 -> 76 ;
77 [label="entropy = -0.0\nsamples = 1\nvalue = [0.0, 0.0, 0.977, 0.0]"] ;
75 -> 77 ;
78 [label="X[0] <= -0.361\nentropy = 0.99\nsamples = 65\nvalue = [0.971, 6.959, 5.861, 54.208]"] ;
52 -> 78 ;
79 [label="X[2] <= -1.116\nentropy = 1.284\nsamples = 37\nvalue = [0.971, 6.959, 3.908, 26.572]"] ;
78 -> 79 ;
80 [label="entropy = 0.0\nsamples = 12\nvalue = [0.0, 0.0, 0.0, 12.755]"] ;
79 -> 80 ;
81 [label="X[3] <= -0.621\nentropy = 1.584\nsamples = 25\nvalue = [0.971, 6.959, 3.908, 13.818]"] ;
79 -> 81 ;
82 [label="X[3] <= -0.803\nentropy = 1.499\nsamples = 16\nvalue = [0.0, 6.959, 2.931, 6.377]"] ;
81 -> 82 ;
83 [label="entropy = 1.412\nsamples = 11\nvalue = [0.0, 1.988, 2.931, 6.377]"] ;
82 -> 83 ;
84 [label="entropy = 0.0\nsamples = 5\nvalue = [0.0, 4.971, 0.0, 0.0]"] ;
82 -> 84 ;
85 [label="X[2] <= -0.349\nentropy = 0.944\nsamples = 9\nvalue = [0.971, 0.0, 0.977, 7.44]"] ;
81 -> 85 ;
86 [label="entropy = 0.516\nsamples = 8\nvalue = [0.971, 0.0, 0.0, 7.44]"] ;
85 -> 86 ;
87 [label="entropy = 0.0\nsamples = 1\nvalue = [0.0, 0.0, 0.977, 0.0]"] ;
85 -> 87 ;
88 [label="X[13] <= -1.214\nentropy = 0.351\nsamples = 28\nvalue = [0.0, 0.0, 1.954, 27.635]"] ;
78 -> 88 ;
89 [label="X[2] <= -0.572\nentropy = 0.899\nsamples = 6\nvalue = [0.0, 0.0, 1.954, 4.252]"] ;
88 -> 89 ;
90 [label="entropy = 0.0\nsamples = 2\nvalue = [0.0, 0.0, 1.954, 0.0]"] ;
89 -> 90 ;
91 [label="entropy = 0.0\nsamples = 4\nvalue = [0.0, 0.0, 0.0, 4.252]"] ;
89 -> 91 ;
92 [label="entropy = 0.0\nsamples = 22\nvalue = [0.0, 0.0, 0.0, 23.384]"] ;
88 -> 92 ;
93 [label="X[2] <= -0.349\nentropy = 1.349\nsamples = 154\nvalue = [100.04, 23.859, 23.445, 3.189]"] ;
51 -> 93 ;
94 [label="X[14] <= 0.842\nentropy = 1.011\nsamples = 131\nvalue = [100.04, 11.929, 14.653, 1.063]"] ;
93 -> 94 ;
95 [label="X[9] <= -0.65\nentropy = 0.608\nsamples = 113\nvalue = [98.098, 1.988, 8.792, 1.063]"] ;
94 -> 95 ;
96 [label="X[4] <= 0.11\nentropy = 1.222\nsamples = 29\nvalue = [17.483, 1.988, 8.792, 0.0]"] ;
95 -> 96 ;
97 [label="X[16] <= 1.238\nentropy = 1.16\nsamples = 10\nvalue = [0.971, 1.988, 6.838, 0.0]"] ;
96 -> 97 ;
98 [label="entropy = 0.542\nsamples = 8\nvalue = [0.971, 0.0, 6.838, 0.0]"] ;
97 -> 98 ;
99 [label="entropy = 0.0\nsamples = 2\nvalue = [0.0, 1.988, 0.0, 0.0]"] ;
97 -> 99 ;
100 [label="X[10] <= -0.258\nentropy = 0.487\nsamples = 19\nvalue = [16.511, 0.0, 1.954, 0.0]"] ;
96 -> 100 ;
101 [label="entropy = -0.0\nsamples = 15\nvalue = [14.569, 0.0, 0.0, 0.0]"] ;
100 -> 101 ;
102 [label="entropy = 1.0\nsamples = 4\nvalue = [1.943, 0.0, 1.954, 0.0]"] ;
100 -> 102 ;
103 [label="X[11] <= -0.735\nentropy = 0.1\nsamples = 84\nvalue = [80.615, 0.0, 0.0, 1.063]"] ;
95 -> 103 ;
104 [label="X[15] <= -0.915\nentropy = 0.999\nsamples = 2\nvalue = [0.971, 0.0, 0.0, 1.063]"] ;
103 -> 104 ;
105 [label="entropy = 0.0\nsamples = 1\nvalue = [0.0, 0.0, 0.0, 1.063]"] ;
104 -> 105 ;
106 [label="entropy = 0.0\nsamples = 1\nvalue = [0.971, 0.0, 0.0, 0.0]"] ;
104 -> 106 ;
107 [label="entropy = 0.0\nsamples = 82\nvalue = [79.644, 0.0, 0.0, 0.0]"] ;
103 -> 107 ;
108 [label="X[4] <= 0.175\nentropy = 1.346\nsamples = 18\nvalue = [1.943, 9.941, 5.861, 0.0]"] ;
94 -> 108 ;
109 [label="X[2] <= -0.604\nentropy = 0.951\nsamples = 16\nvalue = [0.0, 9.941, 5.861, 0.0]"] ;
108 -> 109 ;
110 [label="X[4] <= -0.596\nentropy = 0.957\nsamples = 8\nvalue = [0.0, 2.982, 4.884, 0.0]"] ;
109 -> 110 ;
111 [label="entropy = 0.806\nsamples = 4\nvalue = [0.0, 2.982, 0.977, 0.0]"] ;
110 -> 111 ;
112 [label="entropy = 0.0\nsamples = 4\nvalue = [0.0, 0.0, 3.908, 0.0]"] ;
110 -> 112 ;
113 [label="X[2] <= -0.412\nentropy = 0.538\nsamples = 8\nvalue = [0.0, 6.959, 0.977, 0.0]"] ;
109 -> 113 ;
114 [label="entropy = 0.0\nsamples = 7\nvalue = [0.0, 6.959, 0.0, 0.0]"] ;
113 -> 114 ;
115 [label="entropy = -0.0\nsamples = 1\nvalue = [0.0, 0.0, 0.977, 0.0]"] ;
113 -> 115 ;
116 [label="entropy = 0.0\nsamples = 2\nvalue = [1.943, 0.0, 0.0, 0.0]"] ;
108 -> 116 ;
117 [label="X[4] <= 0.11\nentropy = 1.338\nsamples = 23\nvalue = [0.0, 11.929, 8.792, 2.126]"] ;
93 -> 117 ;
118 [label="X[9] <= -0.164\nentropy = 0.983\nsamples = 21\nvalue = [0.0, 11.929, 8.792, 0.0]"] ;
117 -> 118 ;
119 [label="X[6] <= -0.449\nentropy = 0.914\nsamples = 18\nvalue = [0.0, 11.929, 5.861, 0.0]"] ;
118 -> 119 ;
120 [label="X[3] <= -0.848\nentropy = 0.983\nsamples = 14\nvalue = [0.0, 7.953, 5.861, 0.0]"] ;
119 -> 120 ;
121 [label="entropy = 0.0\nsamples = 3\nvalue = [0.0, 2.982, 0.0, 0.0]"] ;
120 -> 121 ;
122 [label="entropy = 0.995\nsamples = 11\nvalue = [0.0, 4.971, 5.861, 0.0]"] ;
120 -> 122 ;
123 [label="entropy = -0.0\nsamples = 4\nvalue = [0.0, 3.976, 0.0, 0.0]"] ;
119 -> 123 ;
124 [label="entropy = 0.0\nsamples = 3\nvalue = [0.0, 0.0, 2.931, 0.0]"] ;
118 -> 124 ;
125 [label="entropy = 0.0\nsamples = 2\nvalue = [0.0, 0.0, 0.0, 2.126]"] ;
117 -> 125 ;
126 [label="X[17] <= -0.827\nentropy = 0.521\nsamples = 93\nvalue = [3.885, 1.988, 1.954, 90.346]"] ;
50 -> 126 ;
127 [label="X[6] <= -0.705\nentropy = 0.818\nsamples = 4\nvalue = [2.914, 0.994, 0.0, 0.0]"] ;
126 -> 127 ;
128 [label="entropy = 0.0\nsamples = 1\nvalue = [0.0, 0.994, 0.0, 0.0]"] ;
127 -> 128 ;
129 [label="entropy = 0.0\nsamples = 3\nvalue = [2.914, 0.0, 0.0, 0.0]"] ;
127 -> 129 ;
130 [label="X[13] <= -1.214\nentropy = 0.312\nsamples = 89\nvalue = [0.971, 0.994, 1.954, 90.346]"] ;
126 -> 130 ;
131 [label="X[16] <= 1.564\nentropy = 0.936\nsamples = 3\nvalue = [0.0, 0.0, 1.954, 1.063]"] ;
130 -> 131 ;
132 [label="entropy = 0.0\nsamples = 2\nvalue = [0.0, 0.0, 1.954, 0.0]"] ;
131 -> 132 ;
133 [label="entropy = 0.0\nsamples = 1\nvalue = [0.0, 0.0, 0.0, 1.063]"] ;
131 -> 133 ;
134 [label="X[10] <= -1.199\nentropy = 0.172\nsamples = 86\nvalue = [0.971, 0.994, 0.0, 89.283]"] ;
130 -> 134 ;
135 [label="entropy = 0.0\nsamples = 1\nvalue = [0.0, 0.994, 0.0, 0.0]"] ;
134 -> 135 ;
136 [label="X[2] <= -0.956\nentropy = 0.086\nsamples = 85\nvalue = [0.971, 0.0, 0.0, 89.283]"] ;
134 -> 136 ;
137 [label="X[11] <= -0.785\nentropy = 0.621\nsamples = 6\nvalue = [0.971, 0.0, 0.0, 5.314]"] ;
136 -> 137 ;
138 [label="entropy = 0.0\nsamples = 5\nvalue = [0.0, 0.0, 0.0, 5.314]"] ;
137 -> 138 ;
139 [label="entropy = 0.0\nsamples = 1\nvalue = [0.971, 0.0, 0.0, 0.0]"] ;
137 -> 139 ;
140 [label="entropy = 0.0\nsamples = 79\nvalue = [0.0, 0.0, 0.0, 83.969]"] ;
136 -> 140 ;
}