iterations,fitness,time,fevals
0,22.0,0.002087113,745
10,23.0,0.004067559,1377
20,26.0,0.00604484500001,2013
30,29.0,0.00817778500001,2645
40,28.0,0.0103447,3273
50,31.0,0.012510035,3898
60,32.0,0.015550038,4536
70,31.0,0.017363768,5169
80,33.0,0.01954056,5800
90,34.0,0.021406043,6437
100,34.0,0.023239526,7069
110,34.0,0.024968318,7703
120,35.0,0.02666511,8321
130,36.0,0.028388371,8955
140,38.0,0.031381361,9592
150,38.0,0.033106202,10218
160,39.0,0.034788376,10861
170,39.0,0.036934748,11489
180,40.0,0.038844872,12122
190,40.0,0.040629763,12760
200,40.0,0.042490505,13384
210,41.0,0.044226408,14026
220,42.0,0.047168435,14649
230,41.0,0.048875103,15286
240,42.0,0.05060745,15920
250,43.0,0.05277239,16545
260,42.0,0.054611009,17167
270,43.0,0.05633822,17797
280,44.0,0.058048444,18420
290,44.0,0.059774075,19052
300,45.0,0.062699905,19687
310,44.0,0.064437783,20330
320,44.0,0.066123118,20954
330,44.0,0.068135959,21596
340,44.0,0.070364109,22223
350,45.0,0.07208579,22852
360,46.0,0.07377152,23480
370,46.0,0.075459225,24106
380,45.0,0.078648955,24730
390,48.0,0.080351673,25354
400,48.0,0.082010143,25969
410,47.0,0.083671379,26604
420,48.0,0.085332615,27236
430,49.0,0.087000172,27865
440,53.0,0.090441162,28499
450,51.0,0.092089361,29134
460,54.0,0.095354153,29773
470,54.0,0.096991685,30380
480,54.0,0.098810946,31011
490,52.0,0.100454799,31629
500,52.0,0.102104183,32257
510,54.0,0.10377174,32891
520,54.0,0.105426259,33511
530,53.0,0.10871673,34143
540,54.0,0.110376386,34761
550,54.0,0.112032881,35394
560,54.0,0.113747845,36023
570,55.0,0.115765822,36657
580,52.0,0.117607996,37293
590,53.0,0.119292145,37934
600,54.0,0.120930072,38566
610,53.0,0.123756741,39195
620,54.0,0.125573631,39823
630,53.0,0.127193781,40449
640,54.0,0.128826572,41075
650,53.0,0.131079611,41705
660,57.0,0.132734131,42336
670,57.0,0.134437639,42966
680,55.0,0.136659073,43607
690,56.0,0.140056211,44240
700,57.0,0.142014929,44867
710,55.0,0.14399814,45498
720,55.0,0.146050487,46119
730,55.0,0.148263625,46737
740,57.0,0.150382738,47376
750,56.0,0.152470641,48016
760,56.0,0.154474001,48635
770,56.0,0.158013756,49268
780,56.0,0.160035683,49903
790,57.0,0.162027191,50528
800,59.0,0.163848822,51155
810,58.0,0.165566947,51776
820,57.0,0.167206454,52403
830,57.0,0.169207838,53033
840,56.0,0.170826012,53662
850,57.0,0.174421077,54279
860,57.0,0.17606256,54906
870,56.0,0.17787945,55527
880,56.0,0.179817624,56166
890,56.0,0.181589477,56782
900,56.0,0.183235305,57406
910,57.0,0.184875207,58037
920,56.0,0.186691308,58678
930,56.0,0.190181681,59306
940,56.0,0.191851608,59947
950,56.0,0.193667314,60586
960,54.0,0.195422575,61210
970,55.0,0.197567367,61839
980,55.0,0.199233739,62474
990,53.0,0.200913148,63103
1000,55.0,0.202726483,63731
1010,54.0,0.205651127,64350
1020,54.0,0.207473549,64975
1030,54.0,0.20910239,65593
1040,54.0,0.210741108,66216
1050,55.0,0.212951086,66837
1060,54.0,0.214579137,67465
1070,55.0,0.216294891,68084
1080,55.0,0.217973904,68705
1090,53.0,0.221043141,69344
1100,54.0,0.222865167,69969
1110,54.0,0.224752774,70603
1120,55.0,0.226759294,71229
1130,54.0,0.228495987,71864
1140,55.0,0.230226359,72484
1150,55.0,0.231971348,73110
1160,55.0,0.23478577,73750
1170,56.0,0.23644029,74388
1180,56.0,0.2380636,75015
1190,55.0,0.239738268,75637
1200,56.0,0.24140859,76272
1210,55.0,0.24312869,76900
1220,55.0,0.244794272,77522
1230,55.0,0.246456693,78146
1240,55.0,0.249723461,78775
1250,55.0,0.251407611,79411
1260,56.0,0.253433884,80041
1270,56.0,0.255230232,80667
1280,56.0,0.256989838,81298
1290,57.0,0.25866174,81946
1300,57.0,0.260311914,82587
1310,56.0,0.261932458,83215
1320,56.0,0.264672608,83858
1330,56.0,0.266261943,84486
1340,56.0,0.269581254,85107
1350,56.0,0.271381947,85740
1360,56.0,0.273098096,86381
1370,56.0,0.274702443,87007
1380,56.0,0.27656279,87634
1390,56.0,0.278301458,88265
1400,57.0,0.28140072,88900
1410,58.0,0.283621759,89531
1420,59.0,0.285250204,90158
1430,57.0,0.287004675,90790
1440,59.0,0.288627195,91422
1450,59.0,0.290228777,92056
1460,58.0,0.292441125,92675
1470,58.0,0.294073521,93319
1480,58.0,0.296941671,93956
1490,59.0,0.298596191,94608
1500,58.0,0.300462465,95232
1510,58.0,0.302152935,95863
1520,58.0,0.303800344,96491
1530,57.0,0.305450914,97116
1540,58.0,0.30743373,97741
1550,58.0,0.309086669,98364
1560,58.0,0.312835412,98988
1570,58.0,0.314459907,99612
1580,59.0,0.316108501,100244
1590,59.0,0.317753144,100877
1600,59.0,0.319464948,101510
1610,60.0,0.321722333,102134
1620,59.0,0.323385149,102768
1630,59.0,0.325039274,103387
1640,59.0,0.32787503,104011
1650,60.0,0.329814389,104638
1660,60.0,0.332214786,105260
1670,60.0,0.334102393,105895
1680,60.0,0.335720962,106521
1690,60.0,0.337362445,107162
1700,60.0,0.339175385,107787
1710,59.0,0.342151783,108422
1720,60.0,0.344380723,109052
1730,59.0,0.346312971,109671
1740,59.0,0.348044528,110299
1750,59.0,0.349875641,110934
1760,61.0,0.351590211,111549
1770,60.0,0.35374567,112189
1780,59.0,0.356605919,112798
1790,59.0,0.359608391,113431
1800,58.0,0.361750023,114063
1810,58.0,0.363453531,114690
1820,58.0,0.365149532,115317
1830,59.0,0.366932842,115938
1840,58.0,0.368579065,116565
1850,60.0,0.371105092,117195
1860,57.0,0.372740648,117827
1870,60.0,0.375574033,118468
1880,59.0,0.377181936,119091
1890,59.0,0.378887419,119722
1900,58.0,0.380547469,120348
1910,58.0,0.382185001,120966
1920,60.0,0.383819768,121591
1930,61.0,0.385522881,122238
1940,61.0,0.387177796,122873
1950,61.0,0.390902045,123497
1960,59.0,0.392657305,124126
1970,60.0,0.394282195,124750
1980,60.0,0.395901555,125372
1990,61.0,0.397602692,126002
2000,60.0,0.399409706,126642
2010,60.0,0.401072127,127270
2020,59.0,0.402934055,127888
2030,60.0,0.40579391,128511
2040,60.0,0.407388775,129130
2050,60.0,0.409026703,129756
2060,59.0,0.410774458,130392
2070,60.0,0.412980485,131012
2080,60.0,0.414657918,131642
2090,61.0,0.416425031,132269
2100,61.0,0.418202416,132894
2110,61.0,0.421050023,133541
2120,61.0,0.422683209,134172
2130,61.0,0.424308494,134797
2140,61.0,0.426057433,135440
2150,60.0,0.428125583,136059
2160,60.0,0.429780103,136692
2170,60.0,0.431431067,137332
2180,60.0,0.433070575,137956
2190,60.0,0.436312059,138590
2200,60.0,0.437931418,139223
2210,60.0,0.439686679,139847
2220,61.0,0.441458927,140482
2230,61.0,0.443116212,141127
2240,61.0,0.44597093,141757
2250,60.0,0.447633351,142384
2260,60.0,0.449289846,143016
2270,60.0,0.452072663,143644
2280,61.0,0.453757602,144283
2290,61.0,0.455424369,144917
2300,61.0,0.457385852,145555
2310,61.0,0.459043927,146179
2320,62.0,0.460670792,146802
2330,62.0,0.4623103,147436
2340,61.0,0.465179636,148070
2350,62.0,0.466819539,148706
2360,63.0,0.468491442,149336
2370,61.0,0.470161369,149964
2380,61.0,0.472530556,150597
2390,62.0,0.474170459,151231
2400,61.0,0.475807202,151863
2410,61.0,0.477423006,152489
2420,62.0,0.480263107,153122
2430,61.0,0.482271207,153747
2440,61.0,0.485684148,154388
2450,62.0,0.488446817,155017
2460,62.0,0.490178769,155656
2470,61.0,0.491992499,156284
2480,62.0,0.493733932,156916
2490,61.0,0.495458773,157548
2500,61.0,0.499076356,158180
2510,61.0,0.50072653,158809
2520,61.0,0.502348654,159438
2530,61.0,0.503985001,160082
2540,61.0,0.505576311,160697
2550,61.0,0.507183424,161334
2560,61.0,0.508777499,161965
2570,62.0,0.510903723,162603
2580,65.0,0.513726836,163236
2590,64.0,0.515341455,163861
2600,64.0,0.516966346,164489
2610,62.0,0.518598347,165136
2620,68.0,0.52040062,165769
2630,69.0,0.522025905,166402
2640,69.0,0.523663042,167043
2650,70.0,0.525279636,167673
2660,69.0,0.528121712,168298
2670,70.0,0.530400825,168920
2680,68.0,0.532037962,169567
2690,68.0,0.533613469,170190
2700,69.0,0.535187396,170822
2710,69.0,0.536752632,171446
2720,69.0,0.538727547,172066
2730,69.0,0.540585919,172696
2740,68.0,0.544167947,173329
2750,69.0,0.545945727,173965
2760,70.0,0.54787679,174584
2770,68.0,0.549447952,175208
2780,68.0,0.552417238,175838
2790,68.0,0.554168943,176480
2800,68.0,0.555925784,177104
2810,68.0,0.557533291,177732
2820,68.0,0.560281738,178356
2830,67.0,0.562051221,178979
2840,67.0,0.563719568,179603
2850,67.0,0.565339323,180238
2860,67.0,0.566993843,180867
2870,68.0,0.568616363,181497
2880,67.0,0.570612611,182138
2890,69.0,0.572385649,182784
2900,68.0,0.574103379,183415
2910,68.0,0.575783578,184049
2920,67.0,0.577396221,184676
2930,67.0,0.579161358,185299
2940,67.0,0.580753063,185935
2950,66.0,0.582381114,186573
2960,68.0,0.583986647,187198
2970,71.0,0.587070501,187839
2980,69.0,0.588666157,188473
2990,70.0,0.590295392,189117
3000,69.0,0.592742406,189754
3010,69.0,0.594576679,190404
3020,71.0,0.59671752,191033
3030,72.0,0.598551793,191666
3040,73.0,0.600186955,192308
3050,73.0,0.603202069,192943
3060,74.0,0.604900836,193576
3070,73.0,0.606599208,194205
3080,74.0,0.608334321,194838
3090,74.0,0.610082865,195477
3100,75.0,0.611731854,196111
3110,75.0,0.613422324,196747
3120,76.0,0.615131758,197378
3130,75.0,0.61806707,198003
3140,75.0,0.619670627,198632
3150,76.0,0.621557048,199267
3160,75.0,0.623251864,199889
3170,75.0,0.62481631,200509
3180,75.0,0.626746978,201129
3190,74.0,0.6283213,201760
3200,75.0,0.629966338,202388
3210,76.0,0.632950636,203017
3220,74.0,0.634552613,203652
3230,75.0,0.636150244,204271
3240,74.0,0.637780665,204901
3250,76.0,0.63937079,205529
3260,76.0,0.641260766,206157
3270,77.0,0.642908175,206801
3280,77.0,0.645074695,207436
3290,76.0,0.648103635,208066
3300,75.0,0.650381958,208695
3310,76.0,0.651963391,209329
3320,76.0,0.653746701,209960
3330,77.0,0.655418603,210586
3340,78.0,0.657133172,211213
3350,78.0,0.658836285,211842
3360,78.0,0.660520829,212467
3370,78.0,0.663420189,213082
3380,77.0,0.665094066,213715
3390,77.0,0.666651401,214336
3400,77.0,0.669045477,214965
3410,77.0,0.671027503,215601
3420,77.0,0.672857825,216226
3430,77.0,0.67442306,216849
3440,77.0,0.675997777,217479
3450,77.0,0.679220693,218109
3460,77.0,0.680816743,218750
3470,76.0,0.682672744,219361
3480,76.0,0.68426998,219993
3490,77.0,0.685825735,220612
3500,77.0,0.687430082,221241
3510,79.0,0.689098034,221867
3520,79.0,0.691852802,222484
3530,79.0,0.693787026,223119
3540,77.0,0.695326583,223738
3550,77.0,0.697083424,224373
3560,77.0,0.698836315,225005
3570,77.0,0.700426045,225632
3580,80.0,0.701992466,226258
3590,79.0,0.703570739,226887
3600,80.0,0.706342495,227515
3610,79.0,0.70981272,228135
3620,78.0,0.711381907,228752
3630,78.0,0.713064476,229381
3640,79.0,0.714764823,230014
3650,78.0,0.716341516,230644
3660,80.0,0.71799011,231264
3670,79.0,0.720069322,231883
3680,79.0,0.722984485,232515
3690,79.0,0.724538264,233149
3700,78.0,0.726297475,233776
3710,79.0,0.727882068,234400
3720,79.0,0.729433872,235023
3730,78.0,0.731020441,235662
3740,77.0,0.732607801,236291
3750,77.0,0.73419753,236917
3760,76.0,0.738170275,237543
3770,76.0,0.73972761,238163
3780,76.0,0.741314969,238806
3790,76.0,0.742895613,239427
3800,76.0,0.744468356,240045
3810,76.0,0.746808309,240683
3820,75.0,0.74837631,241306
3830,76.0,0.749974336,241944
3840,76.0,0.75277019,242572
3850,76.0,0.754349253,243202
3860,77.0,0.756757156,243835
3870,76.0,0.758327132,244470
3880,77.0,0.759924763,245107
3890,78.0,0.76172269,245733
3900,78.0,0.763566444,246374
3910,78.0,0.765183038,247017
3920,77.0,0.768125065,247654
3930,76.0,0.770095239,248277
3940,76.0,0.771668376,248908
3950,77.0,0.773607736,249538
3960,76.0,0.775215243,250165
3970,77.0,0.776827886,250797
3980,76.0,0.779052481,251420
3990,77.0,0.781527939,252047
4000,76.0,0.785202411,252671
4010,79.0,0.786805968,253298
4020,79.0,0.788398068,253935
4030,79.0,0.789977526,254563
4040,78.0,0.791549083,255178
4050,79.0,0.793136442,255806
4060,78.0,0.795765975,256433
4070,76.0,0.797388099,257067
4080,76.0,0.800159855,257694
4090,76.0,0.801790276,258313
4100,78.0,0.803531314,258943
4110,77.0,0.805241933,259582
4120,77.0,0.806844305,260205
4130,78.0,0.808434825,260824
4140,78.0,0.810066036,261463
4150,78.0,0.812897841,262103
4160,79.0,0.814901991,262734
4170,80.0,0.816492511,263375
4180,80.0,0.818085401,264005
4190,78.0,0.819686983,264636
4200,78.0,0.821301206,265264
4210,77.0,0.823376862,265899
4220,78.0,0.82530832,266527
4230,78.0,0.828147236,267168
4240,78.0,0.829759484,267803
4250,80.0,0.831364621,268433
4260,80.0,0.833761463,269055
4270,80.0,0.835849761,269698
4280,79.0,0.837453317,270330
4290,79.0,0.839358702,270964
4300,80.0,0.84106537,271586
4310,80.0,0.843814212,272205
4320,80.0,0.84539288,272834
4330,79.0,0.846959301,273464
4340,79.0,0.84914834,274096
4350,80.0,0.850730168,274732
4360,80.0,0.852307651,275358
4370,81.0,0.854123356,275993
4380,80.0,0.855692543,276619
4390,80.0,0.858674866,277236
4400,79.0,0.860263015,277867
4410,80.0,0.861836152,278498
4420,80.0,0.863837932,279116
4430,80.0,0.865392502,279744
4440,80.0,0.866988553,280375
4450,80.0,0.868548258,280988
4460,80.0,0.870109543,281612
4470,80.0,0.873001003,282243
4480,80.0,0.874601399,282873
4490,79.0,0.876191918,283509
4500,80.0,0.879474093,284132
4510,80.0,0.881061452,284777
4520,80.0,0.882670539,285421
4530,78.0,0.884436862,286055
4540,79.0,0.886023826,286686
4550,79.0,0.889049606,287308
4560,80.0,0.890711632,287930
4570,79.0,0.892314004,288561
4580,79.0,0.894428376,289205
4590,79.0,0.896482699,289838
4600,79.0,0.898061762,290460
4610,79.0,0.899645961,291092
4620,79.0,0.901236086,291713
4630,79.0,0.904464137,292352
4640,79.0,0.906044385,292982
4650,80.0,0.907671645,293627
4660,80.0,0.90926256,294257
4670,78.0,0.910839253,294884
4680,79.0,0.912415945,295519
4690,81.0,0.914509379,296153
4700,81.0,0.917335258,296792
4710,80.0,0.919020592,297406
4720,80.0,0.920569235,298041
4730,81.0,0.922139212,298666
4740,82.0,0.92372262,299305
4750,81.0,0.925308399,299930
4760,83.0,0.926890623,300565
4770,83.0,0.929048847,301199
4780,83.0,0.931829689,301830
4790,82.0,0.933407172,302456
4800,83.0,0.934956605,303072
4810,83.0,0.936551076,303709
4820,84.0,0.938953449,304344
4830,81.0,0.940885697,304980
4840,81.0,0.942586439,305611
4850,81.0,0.944419132,306238
4860,82.0,0.948078197,306865
4870,81.0,0.949989112,307494
4880,81.0,0.951568965,308123
4890,82.0,0.953189114,308746
4900,84.0,0.954761856,309372
4910,84.0,0.956708721,309997
4920,84.0,0.959542501,310633
4930,84.0,0.961329366,311260
4940,84.0,0.964148529,311893
4950,84.0,0.965722851,312534
4960,83.0,0.967330358,313157
4970,83.0,0.969257866,313781
4980,82.0,0.970825867,314414
4990,83.0,0.97240414,315048
5000,82.0,0.973970166,315679
