iterations,fitness,time,fevals
0,27.0,0.001807014,645
10,29.0,0.005553783,1198
20,31.0,0.007181439,1753
30,31.0,0.00873719400001,2292
40,31.0,0.010315072,2841
50,32.0,0.011859369,3385
60,32.0,0.013833889,3935
70,33.0,0.015645249,4475
80,34.0,0.017198633,5021
90,35.0,0.020030833,5571
100,34.0,0.021584612,6113
110,34.0,0.023122194,6662
120,34.0,0.024989258,7203
130,35.0,0.02649563,7747
140,35.0,0.028024915,8292
150,36.0,0.029546299,8841
160,36.0,0.031075189,9397
170,35.0,0.033782549,9936
180,35.0,0.035298797,10489
190,35.0,0.036959242,11034
200,36.0,0.038466008,11583
210,37.0,0.039994503,12128
220,35.0,0.041520627,12674
230,35.0,0.043569024,13211
240,35.0,0.047124977,13767
250,35.0,0.048856139,14312
260,35.0,0.051925376,14858
270,35.0,0.053774662,15397
280,35.0,0.055441824,15943
290,36.0,0.057239752,16497
300,36.0,0.058745334,17045
310,36.0,0.060874323,17603
320,35.0,0.063695856,18142
330,36.0,0.065248055,18685
340,37.0,0.067018328,19228
350,35.0,0.068517984,19776
360,36.0,0.070036207,20326
370,36.0,0.071665837,20877
380,36.0,0.073156406,21419
390,37.0,0.074646185,21959
400,37.0,0.078662386,22509
410,37.0,0.08014703,23059
420,37.0,0.0818023400001,23606
430,37.0,0.0833012050001,24152
440,37.0,0.0848095520001,24700
450,37.0,0.0864699970001,25246
460,37.0,0.0879787390001,25789
470,37.0,0.0894866910001,26344
480,37.0,0.0927009160001,26890
490,37.0,0.0942013610001,27434
500,37.0,0.0956848190001,27982
510,38.0,0.0974416600001,28538
520,38.0,0.0989346,29090
530,37.0,0.100440577,29639
540,37.0,0.102282356,30180
550,37.0,0.103744481,30726
560,38.0,0.106572335,31282
570,37.0,0.10819683,31822
580,37.0,0.109685424,32369
590,37.0,0.11124829,32918
600,38.0,0.11300118,33466
610,38.0,0.114496095,34014
620,38.0,0.116076739,34561
630,39.0,0.117542419,35101
640,38.0,0.121075064,35649
650,39.0,0.122587361,36205
660,37.0,0.124060547,36752
670,38.0,0.125557436,37296
680,38.0,0.127337586,37844
690,38.0,0.128964056,38394
700,39.0,0.130441588,38938
710,38.0,0.131936898,39492
720,38.0,0.134644653,40039
730,38.0,0.136130876,40591
740,38.0,0.137610384,41145
750,39.0,0.139434385,41690
760,40.0,0.140945497,42238
770,38.0,0.142444757,42777
780,38.0,0.143963375,43329
790,38.0,0.14545908,43878
800,39.0,0.149024514,44429
810,40.0,0.15052654,44971
820,39.0,0.152026985,45517
830,39.0,0.153529801,46070
840,39.0,0.154995086,46610
850,39.0,0.15664684,47159
860,39.0,0.158176915,47705
870,39.0,0.161418794,48253
880,38.0,0.162927536,48799
890,38.0,0.164429562,49344
900,39.0,0.166140971,49888
910,39.0,0.167823145,50430
920,40.0,0.170187196,50971
930,39.0,0.171761913,51514
940,39.0,0.174577521,52059
950,39.0,0.177312536,52613
960,40.0,0.178790464,53159
970,39.0,0.180289725,53708
980,41.0,0.18178148,54263
990,43.0,0.18324084,54798
1000,43.0,0.184814767,55349
1010,43.0,0.186272941,55890
1020,44.0,0.187756794,56435
1030,44.0,0.190552253,56985
1040,44.0,0.193300305,57530
1050,44.0,0.194778232,58089
1060,45.0,0.196557197,58636
1070,43.0,0.198053297,59182
1080,44.0,0.199678977,59736
1090,44.0,0.20116046,60280
1100,44.0,0.202749005,60836
1110,44.0,0.205477699,61383
1120,44.0,0.20739533,61926
1130,44.0,0.208897356,62483
1140,45.0,0.210399382,63030
1150,45.0,0.211887186,63565
1160,46.0,0.213389607,64107
1170,45.0,0.214885707,64655
1180,45.0,0.216388918,65218
1190,46.0,0.22006655,65762
1200,44.0,0.221558699,66311
1210,45.0,0.22306033,66856
1220,44.0,0.224545368,67400
1230,45.0,0.226041862,67950
1240,45.0,0.228031394,68492
1250,45.0,0.229840383,69043
1260,45.0,0.231315545,69587
1270,46.0,0.234000386,70130
1280,46.0,0.235527301,70680
1290,45.0,0.237628241,71229
1300,46.0,0.239112095,71773
1310,45.0,0.240614516,72322
1320,47.0,0.242319209,72868
1330,47.0,0.243934222,73409
1340,48.0,0.245427952,73959
1350,48.0,0.248138472,74511
1360,49.0,0.249655115,75058
1370,49.0,0.251154376,75619
1380,50.0,0.252889488,76166
1390,50.0,0.25455428,76716
1400,49.0,0.256150725,77262
1410,49.0,0.257628258,77819
1420,48.0,0.260212359,78366
1430,48.0,0.261730187,78914
1440,50.0,0.263264213,79462
1450,48.0,0.264997746,80008
1460,48.0,0.26651597,80567
1470,48.0,0.268132169,81105
1480,48.0,0.26963222,81653
1490,48.0,0.271120419,82199
1500,47.0,0.274398248,82743
1510,48.0,0.275894348,83294
1520,48.0,0.277393213,83847
1530,48.0,0.279258695,84394
1540,48.0,0.280772178,84947
1550,48.0,0.282256427,85495
1560,48.0,0.283938996,86042
1570,49.0,0.285420479,86587
1580,49.0,0.288897815,87129
1590,49.0,0.290631348,87683
1600,49.0,0.292095448,88231
1610,49.0,0.293692289,88781
1620,50.0,0.295178513,89329
1630,51.0,0.296665527,89879
1640,50.0,0.298781084,90426
1650,50.0,0.300288641,90969
1660,50.0,0.303035507,91528
1670,51.0,0.304860299,92072
1680,51.0,0.306368646,92623
1690,50.0,0.307992746,93175
1700,51.0,0.309795019,93729
1710,51.0,0.311316007,94270
1720,51.0,0.312786822,94814
1730,51.0,0.315369737,95362
1740,51.0,0.318116209,95916
1750,51.0,0.31959137,96461
1760,50.0,0.321269989,97011
1770,50.0,0.322937151,97559
1780,50.0,0.324512658,98108
1790,51.0,0.325995326,98654
1800,51.0,0.32748471,99205
1810,51.0,0.328976069,99749
1820,51.0,0.331925997,100307
1830,52.0,0.333642542,100857
1840,52.0,0.335143778,101402
1850,52.0,0.336646989,101952
1860,52.0,0.338120175,102494
1870,52.0,0.339607979,103049
1880,52.0,0.341105264,103593
1890,52.0,0.343331043,104137
1900,52.0,0.346068032,104685
1910,52.0,0.347537268,105229
1920,52.0,0.349768579,105781
1930,52.0,0.351510408,106327
1940,53.0,0.353090261,106871
1950,52.0,0.354600188,107423
1960,52.0,0.356235745,107969
1970,52.0,0.357807302,108521
1980,51.0,0.360767502,109069
1990,52.0,0.362252145,109619
2000,52.0,0.363833578,110166
2010,51.0,0.365289776,110714
2020,52.0,0.366767308,111262
2030,52.0,0.3682401,111809
2040,52.0,0.369979558,112357
2050,52.0,0.372625683,112897
2060,51.0,0.374440993,113445
2070,51.0,0.375928402,113996
2080,52.0,0.377432008,114553
2090,53.0,0.378904009,115093
2100,51.0,0.380692849,115635
2110,52.0,0.38228969,116182
2120,51.0,0.384307272,116722
2130,52.0,0.387048607,117275
2140,52.0,0.388527719,117826
2150,52.0,0.39019251,118377
2160,52.0,0.391768017,118930
2170,52.0,0.393260167,119480
2180,52.0,0.39569928,120024
2190,52.0,0.397193009,120567
2200,52.0,0.398685949,121119
2210,53.0,0.401406347,121667
2220,53.0,0.402858595,122212
2230,53.0,0.404665214,122761
2240,53.0,0.406488821,123306
2250,53.0,0.40794897,123854
2260,53.0,0.40941702,124397
2270,53.0,0.410885071,124949
2280,53.0,0.412351146,125488
2290,53.0,0.415628581,126032
2300,53.0,0.417417817,126584
2310,53.0,0.418891794,127131
2320,53.0,0.420381573,127681
2330,53.0,0.42186108,128234
2340,53.0,0.423341772,128785
2350,53.0,0.426173577,129335
2360,53.0,0.427650319,129889
2370,53.0,0.430278272,130433
2380,53.0,0.431752644,130982
2390,54.0,0.433220299,131532
2400,54.0,0.434692695,132082
2410,54.0,0.436430177,132623
2420,54.0,0.437888746,133174
2430,54.0,0.439359167,133726
2440,54.0,0.440835119,134275
2450,54.0,0.443537343,134824
2460,54.0,0.445469196,135380
2470,54.0,0.446965295,135926
2480,53.0,0.448435321,136472
2490,53.0,0.449904952,137020
2500,53.0,0.451374188,137561
2510,54.0,0.452850535,138109
2520,53.0,0.454349006,138655
2530,53.0,0.458209947,139199
2540,54.0,0.459712763,139745
2550,52.0,0.461217554,140293
2560,53.0,0.462725111,140845
2570,53.0,0.464209359,141395
2580,52.0,0.466224176,141940
2590,52.0,0.467731337,142493
2600,53.0,0.46921598,143043
2610,52.0,0.470973216,143594
2620,53.0,0.472488279,144144
2630,53.0,0.474253811,144689
2640,53.0,0.4760948,145235
2650,53.0,0.47769164,145788
2660,54.0,0.479204333,146334
2670,53.0,0.480706359,146887
2680,53.0,0.483368287,147427
2690,53.0,0.485053227,147984
2700,52.0,0.486552487,148533
2710,53.0,0.488002365,149082
2720,52.0,0.489503996,149637
2730,52.0,0.490982713,150185
2740,53.0,0.492474862,150732
2750,52.0,0.494377086,151278
2760,52.0,0.497165829,151830
2770,53.0,0.49866509,152383
2780,53.0,0.500619462,152927
2790,54.0,0.502119908,153480
2800,53.0,0.503603761,154027
2810,54.0,0.505084453,154581
2820,54.0,0.506557244,155129
2830,54.0,0.508048603,155680
2840,54.0,0.511819076,156229
2850,56.0,0.513300559,156774
2860,54.0,0.514827078,157330
2870,55.0,0.51630619,157875
2880,54.0,0.517795969,158428
2890,54.0,0.519479329,158978
2900,53.0,0.521074984,159527
2910,53.0,0.52290017,160074
2920,54.0,0.527476569,160627
2930,54.0,0.528968323,161178
2940,54.0,0.530501558,161730
2950,55.0,0.53201346,162274
2960,54.0,0.533553411,162822
2970,54.0,0.535056228,163374
2980,54.0,0.537123192,163922
2990,55.0,0.538762304,164473
3000,54.0,0.541593714,165021
3010,54.0,0.543116678,165564
3020,54.0,0.544648333,166109
3030,55.0,0.5461231,166651
3040,55.0,0.547791842,167200
3050,55.0,0.54934009,167744
3060,55.0,0.550915992,168289
3070,56.0,0.552384833,168830
3080,55.0,0.555124193,169381
3090,56.0,0.556911058,169932
3100,55.0,0.558381479,170476
3110,55.0,0.559956986,171031
3120,56.0,0.561873432,171573
3130,55.0,0.563762618,172115
3140,55.0,0.565819311,172662
3150,56.0,0.567426028,173208
3160,56.0,0.570624845,173758
3170,57.0,0.572155711,174302
3180,58.0,0.573646676,174846
3190,58.0,0.575596307,175397
3200,58.0,0.577798778,175944
3210,58.0,0.579416163,176494
3220,54.0,0.581385942,177042
3230,57.0,0.584521945,177585
3240,54.0,0.58602318,178129
3250,54.0,0.587509404,178674
3260,56.0,0.589083331,179218
3270,57.0,0.590597209,179777
3280,56.0,0.592302692,180319
3290,58.0,0.593759285,180866
3300,58.0,0.595210743,181414
3310,58.0,0.597945757,181961
3320,60.0,0.599402351,182498
3330,60.0,0.601160377,183047
3340,60.0,0.603232478,183598
3350,60.0,0.604700529,184147
3360,60.0,0.606534802,184702
3370,61.0,0.608195643,185259
3380,61.0,0.609673966,185809
3390,61.0,0.612380141,186359
3400,60.0,0.613845426,186910
3410,60.0,0.615370365,187460
3420,60.0,0.618350318,188007
3430,60.0,0.62008306,188560
3440,61.0,0.621662123,189107
3450,61.0,0.623112001,189650
3460,61.0,0.624563064,190193
3470,61.0,0.627593585,190740
3480,60.0,0.629608401,191284
3490,62.0,0.631072501,191829
3500,60.0,0.632696997,192383
3510,60.0,0.634134233,192933
3520,61.0,0.635674975,193484
3530,61.0,0.637177396,194024
3540,61.0,0.638914879,194569
3550,61.0,0.642345993,195129
3560,61.0,0.643818389,195674
3570,62.0,0.645293551,196222
3580,62.0,0.646758836,196774
3590,61.0,0.648203578,197312
3600,62.0,0.649928814,197858
3610,61.0,0.651417407,198399
3620,61.0,0.652879927,198944
3630,61.0,0.655665904,199502
3640,61.0,0.657246942,200049
3650,61.0,0.65901998,200596
3660,62.0,0.660834499,201142
3670,61.0,0.662468081,201691
3680,61.0,0.663939687,202232
3690,61.0,0.665406157,202777
3700,61.0,0.666871047,203322
3710,61.0,0.669524679,203863
3720,61.0,0.671327742,204405
3730,61.0,0.672793817,204949
3740,61.0,0.674261078,205500
3750,61.0,0.675740191,206049
3760,61.0,0.677217723,206597
3770,61.0,0.678690909,207150
3780,61.0,0.68026049,207703
3790,61.0,0.683300492,208250
3800,61.0,0.685055358,208800
3810,61.0,0.686802717,209348
3820,61.0,0.689551164,209895
3830,61.0,0.691361733,210447
3840,61.0,0.693525487,210989
3850,61.0,0.695156303,211544
3860,62.0,0.69812796,212101
3870,61.0,0.700158579,212640
3880,62.0,0.701703667,213182
3890,61.0,0.703301298,213722
3900,61.0,0.704898534,214272
3910,61.0,0.706463375,214813
3920,61.0,0.708015969,215362
3930,61.0,0.709539723,215905
3940,61.0,0.712244317,216458
3950,61.0,0.713697355,216998
3960,61.0,0.715163035,217541
3970,61.0,0.718076617,218084
3980,61.0,0.719521359,218629
3990,61.0,0.720986249,219182
4000,61.0,0.722420324,219726
4010,61.0,0.723899831,220272
4020,62.0,0.727948427,220828
4030,61.0,0.729407786,221364
4040,61.0,0.730868331,221911
4050,61.0,0.732320183,222452
4060,61.0,0.733820233,223005
4070,62.0,0.736298853,223557
4080,62.0,0.737784681,224107
4090,62.0,0.739240484,224653
4100,62.0,0.741939153,225204
4110,62.0,0.74341629,225750
4120,62.0,0.745780342,226304
4130,62.0,0.747290269,226854
4140,61.0,0.748814418,227402
4150,61.0,0.750389925,227960
4160,61.0,0.751961876,228505
4170,61.0,0.753665778,229063
4180,61.0,0.758555066,229620
4190,62.0,0.760503907,230159
4200,60.0,0.762333835,230708
4210,60.0,0.763982824,231259
4220,61.0,0.766303813,231809
4230,61.0,0.769016704,232355
4240,60.0,0.770921299,232908
4250,60.0,0.77239014,233451
4260,60.0,0.775094735,233998
4270,60.0,0.776805749,234546
4280,60.0,0.778657405,235091
4290,60.0,0.780870542,235632
4300,60.0,0.78235479,236183
4310,61.0,0.784196569,236739
4320,61.0,0.786153707,237296
4330,60.0,0.787617807,237838
4340,61.0,0.790358353,238382
4350,61.0,0.79215312,238928
4360,62.0,0.794013862,239470
4370,61.0,0.796409123,240015
4380,61.0,0.798339791,240561
4390,61.0,0.801049521,241107
4400,61.0,0.802851795,241663
4410,61.0,0.804319056,242208
4420,61.0,0.806425132,242757
4430,60.0,0.808119553,243309
4440,61.0,0.80994948,243859
4450,61.0,0.811411605,244408
4460,62.0,0.813136841,244959
4470,61.0,0.81472341,245509
4480,61.0,0.816900992,246051
4490,62.0,0.819989192,246606
4500,62.0,0.822019416,247161
4510,62.0,0.823787714,247708
4520,62.0,0.825520851,248256
4530,62.0,0.827542779,248804
4540,62.0,0.82926683,249347
4550,62.0,0.831540412,249893
4560,61.0,0.833397203,250440
4570,62.0,0.836406391,250994
4580,61.0,0.837963725,251542
4590,61.0,0.840462887,252090
4600,62.0,0.84207632,252654
4610,62.0,0.843560173,253197
4620,62.0,0.845153854,253736
4630,63.0,0.846642448,254290
4640,62.0,0.84811682,254839
4650,62.0,0.85156018,255386
4660,62.0,0.853078008,255930
4670,62.0,0.854550799,256473
4680,63.0,0.856020825,257015
4690,62.0,0.857500728,257570
4700,62.0,0.858973124,258117
4710,62.0,0.86053757,258665
4720,62.0,0.863180535,259210
4730,62.0,0.866387253,259748
4740,62.0,0.86805244,260302
4750,63.0,0.869537873,260852
4760,63.0,0.871010664,261403
4770,63.0,0.872603554,261949
4780,63.0,0.874065283,262494
4790,63.0,0.875777087,263037
4800,64.0,0.877239606,263587
4810,64.0,0.880786868,264132
4820,63.0,0.882249783,264676
4830,63.0,0.883835958,265222
4840,63.0,0.885614527,265770
4850,64.0,0.887087713,266320
4860,65.0,0.88875606,266862
4870,63.0,0.890357246,267412
4880,63.0,0.891801987,267959
4890,64.0,0.894932064,268509
4900,63.0,0.89675093,269065
4910,62.0,0.898197252,269615
4920,63.0,0.899664907,270152
4930,62.0,0.901117155,270697
4940,63.0,0.902557157,271233
4950,62.0,0.904034294,271779
4960,63.0,0.905579382,272320
4970,62.0,0.908377212,272867
4980,62.0,0.910288917,273416
4990,63.0,0.911754598,273958
5000,63.0,0.913637068,274494
