iterations,fitness,time,fevals
0,25.0,0.002235261,803
10,26.0,0.004562176,1490
20,28.0,0.006623609,2199
30,28.0,0.008554277,2905
40,29.0,0.012410083,3598
50,28.0,0.014646924,4278
60,28.0,0.016637246,4966
70,29.0,0.018532753,5669
80,33.0,0.0204571,6371
90,30.0,0.022319818,7069
100,34.0,0.024330684,7782
110,36.0,0.026292957,8478
120,40.0,0.02946886,9184
130,37.0,0.031812368,9877
140,39.0,0.033831925,10576
150,41.0,0.035713605,11290
160,42.0,0.037565656,11985
170,42.0,0.039449707,12694
180,44.0,0.04131756,13383
190,45.0,0.044472525,14086
200,50.0,0.04699381,14779
210,45.0,0.048883392,15477
220,46.0,0.050957072,16180
230,48.0,0.052842308,16880
240,43.0,0.054710162,17585
250,45.0,0.056865225,18274
260,46.0,0.058688436,18965
270,46.0,0.063642514,19679
280,46.0,0.065577133,20378
290,48.0,0.067729431,21066
300,48.0,0.069583852,21763
310,48.0,0.071425631,22461
320,50.0,0.073478373,23146
330,48.0,0.07533793,23835
340,48.0,0.077548697,24531
350,50.0,0.08075186,25226
360,50.0,0.082665541,25936
370,50.0,0.08495137,26635
380,50.0,0.086822779,27343
390,50.0,0.088782682,28049
400,51.0,0.090657647,28759
410,51.0,0.092802834,29462
420,50.0,0.095256564,30145
430,50.0,0.09886111,30852
440,52.0,0.100703679,31552
450,52.0,0.1029101,32258
460,53.0,0.104771632,32979
470,52.0,0.106652127,33675
480,52.0,0.108674845,34356
490,59.0,0.110558896,35048
500,51.0,0.112425959,35755
510,52.0,0.115780826,36439
520,53.0,0.117833569,37135
530,54.0,0.119692336,37832
540,55.0,0.121716239,38528
550,57.0,0.124512488,39216
560,59.0,0.126332144,39922
570,59.0,0.128113479,40614
580,58.0,0.129912592,41314
590,58.0,0.133567706,42009
600,59.0,0.135406325,42701
610,58.0,0.137350425,43382
620,58.0,0.139333637,44066
630,58.0,0.141222034,44746
640,59.0,0.142994282,45441
650,58.0,0.144770877,46136
660,59.0,0.147387373,46841
670,58.0,0.15051745,47556
680,59.0,0.152369501,48257
690,59.0,0.154201799,48956
700,59.0,0.156063332,49629
710,59.0,0.158091975,50323
720,59.0,0.159930594,51028
730,59.0,0.16171825,51723
740,60.0,0.163577017,52422
750,59.0,0.167022353,53121
760,59.0,0.169060873,53845
770,60.0,0.171223048,54541
780,60.0,0.173212185,55237
790,61.0,0.175001026,55935
800,61.0,0.176780386,56645
810,61.0,0.178989968,57340
820,61.0,0.182056835,58045
830,64.0,0.184169232,58742
840,64.0,0.185956492,59434
850,64.0,0.188114321,60117
860,67.0,0.189920544,60814
870,65.0,0.191663163,61500
880,66.0,0.193578029,62186
890,65.0,0.195350673,62887
900,68.0,0.198429787,63581
910,68.0,0.200247863,64278
920,70.0,0.202850927,64975
930,70.0,0.204638978,65674
940,69.0,0.206562535,66383
950,68.0,0.208821105,67074
960,68.0,0.210751378,67772
970,69.0,0.212561947,68465
980,69.0,0.215613011,69162
990,68.0,0.217330346,69863
1000,69.0,0.220381805,70563
1010,69.0,0.222153658,71280
1020,69.0,0.223913265,71979
1030,73.0,0.22566813,72680
1040,70.0,0.227376378,73361
1050,69.0,0.229769664,74059
1060,68.0,0.233405025,74750
1070,73.0,0.23576157,75456
1080,72.0,0.238060831,76158
1090,73.0,0.241180242,76874
1100,72.0,0.242992391,77580
1110,69.0,0.244868936,78285
1120,71.0,0.246622222,78976
1130,72.0,0.249041187,79686
1140,71.0,0.253057783,80386
1150,72.0,0.254860451,81074
1160,72.0,0.256578971,81772
1170,71.0,0.258319615,82464
1180,72.0,0.260083567,83164
1190,71.0,0.262005543,83872
1200,72.0,0.263775026,84583
1210,71.0,0.265511324,85272
1220,72.0,0.268996166,85978
1230,71.0,0.272024317,86665
1240,71.0,0.273759035,87367
1250,71.0,0.275527333,88059
1260,75.0,0.277294051,88756
1270,72.0,0.279032719,89448
1280,72.0,0.280750448,90138
1290,71.0,0.282751437,90819
1300,71.0,0.285770501,91514
1310,71.0,0.287841811,92201
1320,71.0,0.289586405,92894
1330,71.0,0.291453074,93592
1340,71.0,0.293168828,94290
1350,70.0,0.294922903,94993
1360,72.0,0.297463943,95690
1370,74.0,0.299218414,96384
1380,71.0,0.301253773,97074
1390,72.0,0.302995602,97770
1400,73.0,0.304731505,98457
1410,72.0,0.306715507,99153
1420,72.0,0.308481829,99852
1430,72.0,0.310571708,100541
1440,75.0,0.312377142,101231
1450,73.0,0.315735564,101928
1460,74.0,0.317713245,102626
1470,72.0,0.31949932,103330
1480,75.0,0.321225346,104014
1490,76.0,0.323104657,104717
1500,75.0,0.324832264,105408
1510,75.0,0.326554735,106104
1520,76.0,0.328569551,106798
1530,75.0,0.331609553,107505
1540,73.0,0.333379036,108205
1550,75.0,0.335075433,108899
1560,76.0,0.337012423,109587
1570,74.0,0.338726597,110273
1580,74.0,0.340418648,110946
1590,75.0,0.342557514,111650
1600,75.0,0.344429713,112345
1610,79.0,0.347737172,113031
1620,83.0,0.349626754,113738
1630,80.0,0.351349619,114432
1640,82.0,0.3534952,115121
1650,82.0,0.355201473,115818
1660,79.0,0.356917623,116497
1670,80.0,0.358632982,117187
1680,80.0,0.360347156,117877
1690,80.0,0.363361875,118582
1700,80.0,0.365081975,119283
1710,81.0,0.366781532,119970
1720,81.0,0.368623311,120668
1730,79.0,0.370329189,121366
1740,79.0,0.372537191,122073
1750,79.0,0.374242278,122754
1760,80.0,0.375964748,123460
1770,78.0,0.379299862,124157
1780,78.0,0.381096999,124843
1790,78.0,0.382792605,125547
1800,80.0,0.384466878,126242
1810,81.0,0.386141547,126949
1820,83.0,0.387909055,127649
1830,81.0,0.390068464,128348
1840,81.0,0.392182441,129036
1850,81.0,0.395225209,129739
1860,81.0,0.396931877,130434
1870,83.0,0.398843978,131136
1880,82.0,0.400506399,131830
1890,78.0,0.402207536,132507
1900,79.0,0.404222747,133200
1910,78.0,0.405945612,133899
1920,79.0,0.408654552,134606
1930,78.0,0.41147727,135294
1940,77.0,0.41319816,135990
1950,78.0,0.41504073,136694
1960,78.0,0.417455349,137390
1970,78.0,0.419292783,138069
1980,78.0,0.421012093,138763
1990,75.0,0.422726662,139454
2000,78.0,0.427910666,140163
2010,75.0,0.430565878,140866
2020,78.0,0.432551064,141549
2030,78.0,0.434633041,142254
2040,78.0,0.436707117,142951
2050,83.0,0.438823464,143652
2060,83.0,0.440818132,144360
2070,86.0,0.442777244,145049
2080,84.0,0.446079172,145733
2090,85.0,0.44842347,146438
2100,84.0,0.450247077,147128
2110,82.0,0.451971522,147831
2120,82.0,0.453688067,148542
2130,82.0,0.455389599,149246
2140,80.0,0.457564021,149938
2150,81.0,0.45924422,150629
2160,82.0,0.462319778,151335
2170,84.0,0.464002742,152027
2180,83.0,0.465690842,152725
2190,84.0,0.467455979,153426
2200,84.0,0.46915435,154135
2210,83.0,0.470821512,154834
2220,84.0,0.472951687,155535
2230,86.0,0.474623589,156234
2240,86.0,0.47765174,156936
2250,87.0,0.479315742,157628
2260,85.0,0.481220336,158324
2270,84.0,0.483044733,159023
2280,84.0,0.484757327,159714
2290,84.0,0.486453328,160416
2300,84.0,0.488994762,161110
2310,83.0,0.491289283,161809
2320,83.0,0.494428841,162514
2330,82.0,0.496282472,163201
2340,84.0,0.497969782,163897
2350,84.0,0.49977324,164587
2360,84.0,0.501660846,165287
2370,84.0,0.503434675,165988
2380,82.0,0.50515675,166683
2390,82.0,0.506819171,167366
2400,82.0,0.509845347,168069
2410,87.0,0.51155241,168773
2420,81.0,0.513231819,169475
2430,82.0,0.515035277,170165
2440,83.0,0.517481106,170858
2450,85.0,0.51919449,171549
2460,83.0,0.52087943,172254
2470,83.0,0.522581753,172961
2480,82.0,0.525827187,173649
2490,82.0,0.527524374,174343
2500,82.0,0.529222351,175039
2510,81.0,0.530915982,175727
2520,81.0,0.532617515,176429
2530,81.0,0.535026208,177124
2540,81.0,0.536990852,177816
2550,83.0,0.538698705,178519
2560,83.0,0.5418193,179212
2570,81.0,0.543510955,179920
2580,81.0,0.545206166,180619
2590,82.0,0.546902957,181321
2600,81.0,0.548572489,182014
2610,84.0,0.55090375,182713
2620,80.0,0.552870764,183415
2630,80.0,0.555777631,184100
2640,81.0,0.557445582,184815
2650,80.0,0.559076399,185500
2660,81.0,0.561386327,186190
2670,81.0,0.56309497,186882
2680,81.0,0.56480875,187577
2690,81.0,0.566527665,188270
2700,84.0,0.568235914,188964
2710,84.0,0.571713645,189654
2720,84.0,0.573386733,190345
2730,84.0,0.575225352,191035
2740,84.0,0.577061995,191732
2750,86.0,0.578757997,192433
2760,83.0,0.580711183,193124
2770,82.0,0.582368864,193822
2780,82.0,0.584870397,194517
2790,82.0,0.588668523,195209
2800,79.0,0.590353462,195907
2810,80.0,0.592034451,196596
2820,80.0,0.593719785,197284
2830,80.0,0.595650058,197989
2840,79.0,0.597321961,198677
2850,81.0,0.599115542,199386
2860,80.0,0.601235445,200069
2870,82.0,0.60429125,200768
2880,81.0,0.606003054,201473
2890,82.0,0.607928981,202168
2900,82.0,0.609692933,202866
2910,82.0,0.611518515,203574
2920,82.0,0.613207405,204256
2930,83.0,0.614897085,204936
2940,82.0,0.617109827,205633
2950,79.0,0.620081484,206328
2960,80.0,0.621923263,207045
2970,81.0,0.623580943,207733
2980,80.0,0.625615117,208443
2990,81.0,0.6272886,209138
3000,81.0,0.628945096,209830
3010,81.0,0.630808999,210532
3020,82.0,0.632492359,211224
3030,81.0,0.636429548,211909
3040,83.0,0.638142932,212609
3050,81.0,0.639830242,213298
3060,82.0,0.641575231,214000
3070,81.0,0.643285059,214699
3080,81.0,0.64498027,215389
3090,81.0,0.646695629,216081
3100,81.0,0.648418494,216788
3110,81.0,0.651743336,217484
3120,81.0,0.653800819,218171
3130,83.0,0.655520129,218879
3140,81.0,0.657511242,219582
3150,82.0,0.659286651,220286
3160,82.0,0.661002801,220982
3170,81.0,0.662709469,221675
3180,80.0,0.665624632,222352
3190,84.0,0.667604287,223047
3200,85.0,0.670399746,223733
3210,85.0,0.67217476,224438
3220,85.0,0.673950169,225138
3230,85.0,0.675646171,225847
3240,85.0,0.677619901,226544
3250,84.0,0.67939768,227244
3260,85.0,0.682653781,227946
3270,89.0,0.684448153,228629
3280,92.0,0.686111365,229322
3290,89.0,0.688164897,230018
3300,90.0,0.691737048,230714
3310,90.0,0.693731717,231398
3320,90.0,0.695434435,232102
3330,91.0,0.697298338,232794
3340,90.0,0.700382193,233494
3350,90.0,0.702249652,234196
3360,90.0,0.705159679,234895
3370,90.0,0.707115631,235603
3380,89.0,0.709209064,236304
3390,89.0,0.711015683,236995
3400,88.0,0.71271445,237694
3410,89.0,0.714655785,238404
3420,91.0,0.717689466,239102
3430,91.0,0.719574308,239792
3440,91.0,0.721604136,240493
3450,91.0,0.723305668,241196
3460,87.0,0.725034459,241901
3470,87.0,0.726766016,242592
3480,88.0,0.728746067,243287
3490,94.0,0.730446809,243985
3500,94.0,0.734514763,244681
3510,94.0,0.736194962,245362
3520,94.0,0.73790005,246055
3530,94.0,0.739579458,246759
3540,94.0,0.741376596,247452
3550,94.0,0.743065881,248165
3560,95.0,0.744754771,248877
3570,95.0,0.746406131,249564
3580,95.0,0.749436652,250273
3590,96.0,0.75181374,250956
3600,95.0,0.753721099,251654
3610,98.0,0.755419866,252350
3620,98.0,0.757072805,253041
3630,98.0,0.758875078,253735
3640,98.0,0.760609796,254421
3650,98.0,0.762242588,255106
3660,98.0,0.766058493,255810
3670,98.0,0.76769247,256494
3680,98.0,0.769475385,257172
3690,98.0,0.771123979,257861
3700,97.0,0.772793116,258565
3710,98.0,0.774480425,259282
3720,99.0,0.776301661,259979
3730,99.0,0.777992527,260689
3740,99.0,0.781710455,261382
3750,99.0,0.783409617,262099
3760,98.0,0.785066113,262809
3770,96.0,0.786857324,263507
3780,96.0,0.78851224,264201
3790,98.0,0.79077397,264900
3800,98.0,0.792410712,265596
3810,98.0,0.795282023,266307
3820,99.0,0.796946815,267011
3830,95.0,0.798730915,267706
3840,98.0,0.800626028,268397
3850,98.0,0.802398672,269100
3860,98.0,0.804119563,269804
3870,98.0,0.806478479,270494
3880,98.0,0.808230974,271188
3890,98.0,0.811688952,271880
3900,98.0,0.814021398,272573
3910,98.0,0.815826831,273261
3920,98.0,0.817583277,273954
3930,98.0,0.819244513,274658
3940,98.0,0.821612515,275348
3950,98.0,0.823353553,276051
3960,99.0,0.825123431,276751
3970,98.0,0.827939433,277453
3980,98.0,0.829622793,278157
3990,98.0,0.831460227,278844
4000,98.0,0.833103685,279532
4010,97.0,0.834751884,280228
4020,98.0,0.83638033,280921
4030,98.0,0.838032874,281614
4040,98.0,0.84027011,282324
4050,98.0,0.843380039,283024
4060,97.0,0.845050757,283732
4070,98.0,0.846707252,284433
4080,99.0,0.848370463,285134
4090,98.0,0.850011155,285832
4100,98.0,0.85198765,286528
4110,99.0,0.853625972,287215
4120,99.0,0.855276146,287904
4130,99.0,0.858183013,288607
4140,98.0,0.859833187,289289
4150,95.0,0.862235954,289992
4160,95.0,0.864965438,290688
4170,95.0,0.866590723,291375
4180,99.0,0.868256305,292055
4190,99.0,0.870024208,292751
4200,99.0,0.871873098,293457
4210,95.0,0.874709644,294157
4220,95.0,0.876339275,294860
4230,95.0,0.878733351,295552
4240,96.0,0.881504317,296235
4250,94.0,0.883222836,296929
4260,95.0,0.884964665,297620
4270,94.0,0.886629456,298322
4280,93.0,0.888292667,299020
4290,93.0,0.891237459,299723
4300,93.0,0.893034991,300416
4310,93.0,0.894840029,301120
4320,92.0,0.896512722,301813
4330,91.0,0.898198451,302512
4340,88.0,0.899954897,303203
4350,90.0,0.9021068,303904
4360,91.0,0.904001123,304587
4370,91.0,0.906953422,305286
4380,91.0,0.908642313,305992
4390,91.0,0.910424042,306699
4400,91.0,0.912108981,307402
4410,92.0,0.913780093,308103
4420,91.0,0.915473724,308800
4430,90.0,0.917139305,309488
4440,91.0,0.920350369,310186
4450,90.0,0.922178717,310882
4460,90.0,0.924227904,311593
4470,90.0,0.925949584,312301
4480,90.0,0.927630178,312996
4490,90.0,0.929742574,313697
4500,91.0,0.931475711,314385
4510,92.0,0.933153934,315087
4520,92.0,0.936852505,315794
4530,92.0,0.938525593,316487
4540,92.0,0.940182483,317179
4550,91.0,0.941829497,317874
4560,92.0,0.943502585,318572
4570,92.0,0.945745747,319257
4580,92.0,0.94742081,319970
4590,92.0,0.949082441,320666
4600,92.0,0.953114444,321349
4610,92.0,0.954787137,322044
4620,92.0,0.956404916,322730
4630,93.0,0.95807998,323439
4640,91.0,0.959726599,324139
4650,90.0,0.961790403,324821
4660,90.0,0.96365312,325525
4670,90.0,0.965319887,326221
4680,92.0,0.96944157,326917
4690,92.0,0.971092929,327602
4700,92.0,0.97276088,328300
4710,92.0,0.974881968,329015
4720,91.0,0.976843451,329718
4730,91.0,0.978497971,330420
4740,92.0,0.980158022,331128
4750,92.0,0.982148345,331837
4760,91.0,0.985014915,332537
4770,91.0,0.986700645,333241
4780,93.0,0.98835319,333924
4790,91.0,0.989996648,334607
4800,91.0,0.992243366,335283
4810,91.0,0.993967416,335983
4820,93.0,0.995653146,336682
4830,91.0,0.997510333,337388
4840,93.0,1.00054204,338067
4850,92.0,1.002308758,338761
4860,92.0,1.003981845,339458
4870,90.0,1.005655723,340160
4880,91.0,1.007329995,340865
4890,91.0,1.008997947,341561
4900,91.0,1.011125751,342262
4910,91.0,1.012840715,342972
4920,90.0,1.015806841,343683
4930,92.0,1.017470842,344377
4940,92.0,1.019711634,345076
4950,92.0,1.021530105,345783
4960,92.0,1.02318502,346477
4970,93.0,1.024835195,347173
4980,92.0,1.026497616,347870
4990,92.0,1.030456138,348571
5000,91.0,1.032434609,349280
