iterations,fitness,time,fevals
0,534.0,0.016727717,470
10,538.0,0.058703849,837
20,546.0,0.075659911,1207
30,542.0,0.08838881,1576
40,554.0,0.103902502,1944
50,564.0,0.123436345,2311
60,570.0,0.137052553,2683
70,564.0,0.155231333,3045
80,562.0,0.171219099,3417
90,564.0,0.186460988,3779
100,566.0,0.206667226,4144
110,568.0,0.219530446,4512
120,558.0,0.234233865,4876
130,560.0,0.247394567,5254
140,556.0,0.259365736,5608
150,560.0,0.272963376,5975
160,566.0,0.291276477,6344
170,564.0,0.306648341,6708
180,562.0,0.319846969,7082
190,564.0,0.335271771,7450
200,560.0,0.351640771,7819
210,564.0,0.36573856,8182
220,566.0,0.378965632,8550
230,568.0,0.394081101,8914
240,566.0,0.410994893,9290
250,566.0,0.426028583,9649
260,571.0,0.440095952,10017
270,572.0,0.452221196,10393
280,572.0,0.466877603,10756
290,572.0,0.481236528,11122
300,570.0,0.493257081,11485
310,570.0,0.50470835,11856
320,572.0,0.515431124,12224
330,570.0,0.525488613,12589
340,572.0,0.538400031,12962
350,568.0,0.551465523,13337
360,570.0,0.563031754,13705
370,568.0,0.575495171,14069
380,570.0,0.591726295,14435
390,568.0,0.606618158,14810
400,568.0,0.618801082,15174
410,568.0,0.629977782,15545
420,564.0,0.644626683,15909
430,566.0,0.660758251,16283
440,566.0,0.678176536,16653
450,564.0,0.691652892,17018
460,566.0,0.706392262,17392
470,566.0,0.720049557,17759
480,564.0,0.731948035,18124
490,566.0,0.747614615,18497
500,566.0,0.76668505,18861
510,566.0,0.783530891,19225
520,566.0,0.795694851,19587
530,570.0,0.81062701,19947
540,568.0,0.828559271,20302
550,568.0,0.845402346,20671
560,568.0,0.858079492,21041
570,568.0,0.911734053,21407
580,566.0,0.925773768,21776
590,568.0,0.944654573,22138
600,568.0,0.966564318,22495
610,566.0,0.980044625,22854
620,566.0,0.995491551,23216
630,566.0,1.014096208,23583
640,564.0,1.027333552,23944
650,564.0,1.043642108,24311
660,564.0,1.064907902,24680
670,566.0,1.080476902,25049
680,564.0,1.10105924,25419
690,566.0,1.115916733,25790
700,568.0,1.131622029,26160
710,566.0,1.144730582,26521
720,566.0,1.159744124,26891
730,564.0,1.176250211,27260
740,566.0,1.190715407,27622
750,566.0,1.211544658,27991
760,566.0,1.232423686,28359
770,566.0,1.251684541,28729
780,564.0,1.275353498,29090
790,562.0,1.298460282,29453
800,564.0,1.318463853,29815
810,564.0,1.339799968,30186
820,562.0,1.358916625,30549
830,560.0,1.389930181,30923
840,560.0,1.411393507,31294
850,562.0,1.434540587,31660
860,566.0,1.457022778,32032
870,566.0,1.481046105,32393
880,570.0,1.508118916,32761
890,570.0,1.545229859,33130
900,570.0,1.57561092,33498
910,570.0,1.599144766,33862
920,566.0,1.627791109,34233
930,566.0,1.655268464,34605
940,566.0,1.678019297,34976
950,568.0,1.70417833,35346
960,566.0,1.741217372,35714
970,568.0,1.776113202,36076
980,568.0,1.801361222,36449
990,568.0,1.831605592,36817
1000,566.0,1.858934798,37179
1010,566.0,1.882364742,37541
1020,568.0,1.916447535,37908
1030,564.0,1.94061348,38278
1040,564.0,1.972222394,38646
1050,566.0,2.045273711,39019
1060,566.0,2.05962908,39385
1070,562.0,2.072084991,39752
1080,564.0,2.085295076,40124
1090,564.0,2.100124125,40494
1100,566.0,2.113613518,40867
1110,568.0,2.128284542,41232
1120,566.0,2.141022527,41595
1130,568.0,2.155858292,41955
1140,562.0,2.167863833,42318
1150,562.0,2.188399158,42688
1160,564.0,2.201868404,43059
1170,560.0,2.224945558,43424
1180,562.0,2.237358802,43785
1190,562.0,2.24932049,44154
1200,564.0,2.262967118,44521
1210,562.0,2.276554092,44890
1220,558.0,2.289064917,45256
1230,558.0,2.302395891,45619
1240,558.0,2.319590571,45989
1250,556.0,2.332189494,46358
1260,556.0,2.344753257,46724
1270,558.0,2.356948033,47087
1280,558.0,2.374930072,47454
1290,558.0,2.391357936,47823
1300,558.0,2.406314195,48192
1310,562.0,2.419171884,48564
1320,562.0,2.436797577,48932
1330,562.0,2.454588405,49302
1340,558.0,2.469216762,49665
1350,558.0,2.488577962,50031
1360,558.0,2.501166219,50401
1370,558.0,2.515034081,50769
1380,560.0,2.528614339,51128
1390,556.0,2.54123104,51494
1400,556.0,2.55259658,51858
1410,554.0,2.567124987,52219
1420,554.0,2.584375372,52588
1430,556.0,2.596694591,52953
1440,558.0,2.608877119,53325
1450,558.0,2.627368393,53697
1460,560.0,2.643218677,54068
1470,556.0,2.660126147,54430
1480,556.0,2.672803688,54797
1490,556.0,2.685240241,55164
1500,556.0,2.70379433,55530
1510,552.0,2.719169354,55886
1520,552.0,2.73429865,56260
1530,550.0,2.748090266,56633
1540,554.0,2.761783512,56997
1550,554.0,2.782783429,57362
1560,558.0,2.795000723,57729
1570,560.0,2.807542758,58092
1580,560.0,2.820565978,58459
1590,560.0,2.837660313,58824
1600,558.0,2.850251335,59187
1610,558.0,2.889976008,59546
1620,558.0,2.902653549,59911
1630,558.0,2.915099188,60277
1640,558.0,2.927500186,60642
1650,556.0,2.94112548,61011
1660,556.0,2.957532406,61383
1670,554.0,2.969409946,61743
1680,554.0,2.986482947,62110
1690,552.0,2.998717623,62474
1700,556.0,3.016530576,62843
1710,554.0,3.030447032,63212
1720,554.0,3.04374166,63578
1730,556.0,3.055444582,63943
1740,556.0,3.07240262,64317
1750,554.0,3.091141993,64687
1760,552.0,3.107812821,65055
1770,554.0,3.121733227,65418
1780,554.0,3.138952796,65791
1790,554.0,3.15495913,66158
1800,554.0,3.170233019,66522
1810,554.0,3.185472537,66883
1820,554.0,3.19937714,67247
1830,556.0,3.214295078,67608
1840,556.0,3.230877807,67977
1850,554.0,3.244230904,68353
1860,556.0,3.256404741,68720
1870,556.0,3.271901445,69091
1880,558.0,3.286204666,69453
1890,554.0,3.299830355,69823
1900,554.0,3.312981575,70194
1910,554.0,3.329984255,70566
1920,554.0,3.344511476,70932
1930,556.0,3.36217944,71299
1940,556.0,3.374264388,71668
1950,556.0,3.386991706,72044
1960,554.0,3.400090779,72411
1970,556.0,3.420642696,72776
1980,556.0,3.433419397,73142
1990,556.0,3.445604691,73510
2000,556.0,3.457711763,73883
2010,554.0,3.476694494,74245
2020,558.0,3.491158111,74611
2030,558.0,3.511747955,74973
2040,558.0,3.526665102,75339
2050,560.0,3.542179189,75709
2060,560.0,3.554978014,76079
2070,558.0,3.573580695,76444
2080,558.0,3.613345665,76815
2090,562.0,3.628836443,77176
2100,560.0,3.646294629,77541
2110,562.0,3.659851578,77911
2120,560.0,3.673502551,78277
2130,560.0,3.693188098,78640
2140,562.0,3.708954234,79009
2150,562.0,3.721770047,79374
2160,562.0,3.734072279,79746
2170,564.0,3.745967202,80110
2180,564.0,3.760915165,80475
2190,566.0,3.772148359,80838
2200,564.0,3.786439729,81203
2210,564.0,3.798591442,81573
2220,564.0,3.811257921,81941
2230,562.0,3.831069492,82310
2240,564.0,3.843459823,82679
2250,562.0,3.855407289,83040
2260,562.0,3.867968682,83408
2270,562.0,3.886005634,83775
2280,560.0,3.898395569,84144
2290,558.0,3.910640517,84505
2300,560.0,3.921727538,84878
2310,562.0,3.936771895,85247
2320,562.0,3.951939512,85613
2330,564.0,3.963299916,85981
2340,562.0,3.977488174,86349
2350,566.0,3.988683047,86714
2360,562.0,4.001258662,87072
2370,560.0,4.012701634,87446
2380,562.0,4.029496907,87816
2390,562.0,4.042989065,88180
2400,560.0,4.054661568,88552
2410,562.0,4.073371706,88926
2420,562.0,4.084901987,89285
2430,564.0,4.103388521,89651
2440,562.0,4.114767888,90019
2450,562.0,4.125604045,90386
2460,562.0,4.137656598,90752
2470,562.0,4.15199656,91117
2480,564.0,4.163752816,91489
2490,564.0,4.17969831,91861
2500,564.0,4.191629974,92226
2510,564.0,4.203602724,92598
2520,566.0,4.21956086,92967
2530,560.0,4.236792281,93335
2540,562.0,4.248535105,93698
2550,562.0,4.259733139,94072
2560,565.0,4.310005969,94439
2570,568.0,4.326486772,94803
2580,564.0,4.338648362,95178
2590,566.0,4.352801065,95555
2600,568.0,4.366170359,95920
2610,566.0,4.378590714,96294
2620,568.0,4.396117247,96666
2630,570.0,4.410518444,97033
2640,570.0,4.430438657,97403
2650,568.0,4.442662272,97768
2660,568.0,4.455270282,98135
2670,570.0,4.467889749,98507
2680,572.0,4.483228428,98874
2690,570.0,4.495668142,99237
2700,568.0,4.515221738,99610
2710,566.0,4.527898884,99983
2720,566.0,4.543387686,100350
2730,566.0,4.555243498,100717
2740,564.0,4.56716331,101083
2750,564.0,4.579689147,101449
2760,566.0,4.596828519,101813
2770,564.0,4.608284133,102171
2780,564.0,4.620863303,102531
2790,566.0,4.632857387,102895
2800,564.0,4.649092856,103260
2810,568.0,4.665128029,103636
2820,566.0,4.679563991,104004
2830,570.0,4.692277878,104373
2840,570.0,4.71110535,104745
2850,570.0,4.723275237,105113
2860,570.0,4.73765273,105476
2870,569.0,4.751078519,105841
2880,566.0,4.762257985,106212
2890,566.0,4.774940266,106582
2900,566.0,4.787047338,106953
2910,568.0,4.800137719,107313
2920,570.0,4.813600248,107682
2930,572.0,4.824861887,108050
2940,571.0,4.840911282,108423
2950,570.0,4.852955539,108795
2960,570.0,4.86849728,109152
2970,568.0,4.884596848,109516
2980,572.0,4.899971477,109876
2990,572.0,4.911914993,110240
3000,572.0,4.926511745,110608
