,0,1,2,3,4
64,1.0,1.0,1.0,1.0,1.0
67,1.0,1.0,1.0,1.0,1.0
70,1.0,1.0,1.0,1.0,1.0
73,1.0,1.0,1.0,1.0,1.0
76,1.0,1.0,1.0,1.0,1.0
80,1.0,1.0,1.0,1.0,1.0
83,1.0,1.0,1.0,1.0,1.0
86,1.0,1.0,1.0,1.0,1.0
89,1.0,1.0,1.0,1.0,1.0
92,1.0,1.0,1.0,1.0,1.0
96,1.0,1.0,1.0,1.0,1.0
99,1.0,1.0,1.0,1.0,1.0
102,1.0,1.0,1.0,1.0,1.0
105,1.0,1.0,1.0,1.0,1.0
108,1.0,1.0,1.0,1.0,1.0
112,1.0,1.0,1.0,1.0,1.0
115,1.0,1.0,1.0,1.0,1.0
118,1.0,1.0,1.0,1.0,1.0
121,1.0,1.0,1.0,1.0,1.0
124,1.0,1.0,1.0,1.0,1.0
128,1.0,1.0,1.0,1.0,1.0
188,1.0,1.0,1.0,1.0,1.0
249,1.0,1.0,1.0,1.0,1.0
309,1.0,1.0,1.0,1.0,1.0
370,1.0,1.0,1.0,1.0,1.0
431,1.0,1.0,1.0,1.0,1.0
491,1.0,1.0,1.0,1.0,1.0
552,1.0,1.0,1.0,1.0,1.0
613,1.0,1.0,1.0,1.0,1.0
673,1.0,1.0,1.0,1.0,1.0
734,1.0,1.0,1.0,1.0,1.0
794,1.0,1.0,1.0,1.0,1.0
855,1.0,1.0,1.0,1.0,1.0
916,1.0,1.0,1.0,1.0,1.0
976,1.0,1.0,1.0,1.0,1.0
1037,1.0,1.0,1.0,1.0,1.0
1098,1.0,1.0,1.0,1.0,1.0
1158,1.0,1.0,1.0,1.0,1.0
1219,1.0,1.0,1.0,1.0,1.0
1280,1.0,1.0,1.0,1.0,1.0
