iteration,MSE_trg,MSE_val,MSE_tst,acc_trg,acc_val,acc_tst,f1_trg,f1_val,f1_tst,elapsed
0,0.234998395909,0.233956603813,0.233246732291,0.175860108047,0.166571915861,0.175534333788,0.148626817447,0.130486358244,0.147625763987,0.958747621999
10,0.0385087891529,0.0386450127431,0.0383449169731,0.896076201308,0.895963615691,0.895861755343,0.94519007273,0.945127436282,0.945070760374,10.771065102
20,0.0393984282311,0.0393169642362,0.0394846982354,0.896076201308,0.895963615691,0.895861755343,0.94519007273,0.945127436282,0.945070760374,20.262000007
30,0.038988937816,0.0389858410512,0.0394140318974,0.891526869491,0.890278567368,0.889949977262,0.942635892038,0.941919951851,0.941742898411,30.365557224
40,0.0356762130956,0.0355133969597,0.0353936505771,0.895934034689,0.895963615691,0.895407003183,0.945110977804,0.945127436282,0.944817658349,40.202635217
50,0.0377340165081,0.0378415669579,0.0374962224986,0.896076201308,0.895395110858,0.895861755343,0.945173629341,0.944811037792,0.945044396448,49.789040815
60,0.0343127512308,0.0343431956885,0.0336888890296,0.903895365368,0.902217168846,0.904956798545,0.949081048509,0.94825511432,0.949626416004,59.677579986
70,0.0303297119192,0.0298356729106,0.0301202468728,0.895934034689,0.896532120523,0.895861755343,0.945102744863,0.945410917816,0.945070760374,68.651584114
80,0.0336943367874,0.0337058744239,0.0335686410208,0.896076201308,0.897100625355,0.896316507503,0.945173629341,0.945694569457,0.945297504798,78.36642122
90,0.0349206267592,0.0347587617796,0.0346092170578,0.895081034973,0.896532120523,0.894952251023,0.94462785114,0.945378151261,0.944537815126,88.136058568
100,0.0313557787125,0.0309349267351,0.0313832405735,0.895507534831,0.896532120523,0.893587994543,0.944790805979,0.9453125,0.943722943723,97.636779951
110,0.0308330447091,0.0309759345203,0.0308292656841,0.896076201308,0.895963615691,0.895861755343,0.94519007273,0.945127436282,0.945070760374,107.296724373
120,0.0288909198957,0.0286505616437,0.0287310425983,0.896218367927,0.895963615691,0.895861755343,0.945252737363,0.945127436282,0.945044396448,117.131445033
130,0.0294495429195,0.0296637431631,0.0295254971755,0.898635200455,0.897100625355,0.898135516144,0.946467452511,0.945694569457,0.946205571566,127.157096015
140,0.0295698435886,0.0295051212918,0.0291963987811,0.896360534546,0.896532120523,0.895861755343,0.945331833521,0.945410917816,0.945070760374,136.818471745
150,0.0314251381155,0.0314895524543,0.0310070780625,0.896076201308,0.895963615691,0.895861755343,0.94519007273,0.945127436282,0.945070760374,146.533439222
160,0.030263146274,0.0299554593798,0.0301010109293,0.896076201308,0.895963615691,0.895861755343,0.94519007273,0.945127436282,0.945070760374,156.222912558
170,0.0307121129341,0.0306576202799,0.0306470899655,0.896076201308,0.895963615691,0.895407003183,0.94519007273,0.945127436282,0.944817658349,165.62037381
180,0.0292647827028,0.0292385825075,0.029376863948,0.896076201308,0.895963615691,0.895861755343,0.94519007273,0.945127436282,0.945070760374,175.308535539
190,0.0308595895425,0.0304796344298,0.0306760194492,0.90162069946,0.901648664014,0.899499772624,0.947734138973,0.947781466948,0.946502057613,185.271919212
200,0.0286995161964,0.0285583690323,0.0286239301603,0.896076201308,0.895963615691,0.895861755343,0.94519007273,0.945127436282,0.945070760374,195.060758552
210,0.0249181066506,0.0248378190761,0.0248546696923,0.931902189366,0.927799886299,0.929513415189,0.963348381667,0.961245041196,0.96205630355,204.564137123
220,0.0282858155405,0.0278910086435,0.0278682293936,0.896502701166,0.896532120523,0.895861755343,0.945402729864,0.945410917816,0.945070760374,214.477581398
230,0.0269142252418,0.0269255067791,0.0268106329609,0.90545919818,0.902217168846,0.903592542065,0.949883186374,0.94825511432,0.94894026975,224.418647229
240,0.0288037455708,0.0288437673854,0.0290114952768,0.896076201308,0.895963615691,0.895861755343,0.94519007273,0.945127436282,0.945070760374,233.792812464
250,0.0260853805146,0.0258746511702,0.0259083414389,0.937162354279,0.934053439454,0.93815370623,0.966020910209,0.964460784314,0.96656833825,243.57766168
260,0.0247538619966,0.0244591485087,0.0244891163556,0.928490190503,0.924388857305,0.925875397908,0.961559037065,0.959463578177,0.96017591009,253.255507156
270,0.026120009272,0.0258038350123,0.0258104388714,0.93901052033,0.93291642979,0.93860845839,0.966992382858,0.963848039216,0.966756956415,263.401629149
280,0.020136399084,0.0200694070674,0.0203085050911,0.951521182826,0.956225127914,0.950886766712,0.973649640677,0.976138828633,0.973306969847,273.206934278
290,0.0237071138961,0.0235063725318,0.0237562287686,0.934887688371,0.931779420125,0.933151432469,0.964941824862,0.963325183374,0.964032297529,282.761402271
300,0.021351476275,0.0211885395265,0.0212921454416,0.952089849303,0.952245594088,0.957253296953,0.973902269031,0.97400990099,0.976651763537,292.687221078
310,0.019367786487,0.0196310799094,0.0195849883676,0.958913847029,0.964184195566,0.957708049113,0.977574299682,0.980392156863,0.976928801786,302.156139967
320,0.0192838836351,0.0192127879874,0.0195248163068,0.964316178561,0.96532120523,0.960891314234,0.980456279685,0.980990962917,0.978617603182,311.675038944
330,0.0187608477859,0.018542028434,0.0189705683763,0.969149843617,0.970437748721,0.967712596635,0.983034946447,0.983729662078,0.98224556139,321.327842225
340,0.0185742190331,0.0184661479095,0.0186397972117,0.963321012226,0.965889710063,0.962255570714,0.979928426949,0.981308411215,0.979348096541,330.80774384
350,0.0180832569933,0.0180702891208,0.0185149322709,0.963747512084,0.967595224559,0.963165075034,0.980132450331,0.982215288612,0.979805534779,340.110938944
360,0.0181854555299,0.0182276863328,0.0185210984582,0.962894512368,0.966458214895,0.959981809914,0.979680809654,0.981602743998,0.97812033814,350.103870494
370,0.0181907188986,0.0182989581388,0.0186294527933,0.961615012795,0.965889710063,0.958617553433,0.97898505604,0.981296758105,0.977368813728,359.055547691
380,0.0173739028761,0.0175896664509,0.0179071235118,0.967586010805,0.972143263218,0.965438835834,0.982184716362,0.984663536776,0.981009495252,368.99218132
390,0.0161037971855,0.0158659726507,0.0161678042747,0.9764003412,0.975554292211,0.974533879036,0.986869166271,0.986431050805,0.98583712696,378.707171316
400,0.0166722252203,0.0164239714847,0.0168709175225,0.973557008814,0.97271176805,0.969986357435,0.985263825067,0.984848484848,0.983308042489,388.019422032
410,0.0180500207772,0.0183697235914,0.0186144463019,0.95678134774,0.956793632746,0.954524783993,0.976415826222,0.976426799007,0.975222993062,398.079768549
420,0.015931604991,0.0158907236989,0.0160490696136,0.973557008814,0.973280272882,0.972260118236,0.985282481405,0.985159456899,0.984592068704,409.860898252
430,0.0158676630529,0.015857624949,0.0159744495973,0.973983508672,0.973848777715,0.972260118236,0.985523297207,0.98547979798,0.984592068704,419.944298221
440,0.0149342993842,0.0153948592851,0.0151108534782,0.976542507819,0.974985787379,0.974988631196,0.987023200944,0.98617221873,0.986156556758,429.845450142
450,0.0133644302826,0.0135704489698,0.0134973211229,0.977111174296,0.977259806708,0.975443383356,0.987269708231,0.98738170347,0.986363636364,439.403176212
460,0.0134971968677,0.0138285981554,0.013603789646,0.978817173728,0.978396816373,0.975898135516,0.988248284565,0.98804279421,0.986646510456,449.623805325
470,0.0123321437334,0.0123763796242,0.012473452242,0.981518339494,0.981239340534,0.979081400637,0.989733059548,0.989599747873,0.988383838384,459.631495997
480,0.0109806981745,0.0111454941677,0.0114492795614,0.979101506966,0.977259806708,0.976807639836,0.988455195162,0.987460815047,0.987208427389,469.51591072
490,0.0106573216022,0.0107737185986,0.011103261084,0.979670173443,0.977828311541,0.976352887676,0.988762278978,0.987762786319,0.986947791165,478.991441367
500,0.0110953381592,0.0112684620417,0.0113796724757,0.980807506397,0.978396816373,0.977717144156,0.989389294978,0.988072818581,0.987703889586,488.400262627
510,0.0122352404924,0.0125614636987,0.0128958678512,0.974125675291,0.974985787379,0.975443383356,0.985743380855,0.986215538847,0.986466165414,498.01399111
520,0.0112898941879,0.0113469998446,0.0117700274534,0.978532840489,0.978965321205,0.974079126876,0.988126130377,0.988375746151,0.985689179011,507.95941408
530,0.0103169602082,0.0105671175,0.0107336341036,0.980096673301,0.98010233087,0.977262391996,0.988967691095,0.988983317595,0.987430869784,517.60373064
540,0.0118631370616,0.0121276486807,0.012435163185,0.977964174012,0.977259806708,0.975898135516,0.987830729371,0.987452948557,0.986706797091,526.826824942
550,0.00926715641585,0.00943832379662,0.00957500578285,0.982655672448,0.983513359864,0.980445657117,0.990369434796,0.990860384494,0.989155107188,536.438402314
560,0.00984404139675,0.0102678245543,0.0104100727578,0.980807506397,0.979533826038,0.978626648477,0.989380948635,0.988686360779,0.988193921125,546.337141197
570,0.00847393964142,0.00837751918838,0.00865414297235,0.984361671879,0.984650369528,0.984993178718,0.991304347826,0.991479962133,0.991656131479,555.922539386
580,0.0082180236686,0.00857750295802,0.00873122445089,0.98421950526,0.982944855031,0.983628922237,0.99124260355,0.990542244641,0.990918264379,565.55181198
590,0.00871718497972,0.00912532996698,0.00912938243637,0.983366505544,0.983513359864,0.979990904957,0.990788126919,0.990877634476,0.988944723618,575.154581047
600,0.00909075959605,0.00921250245208,0.00938028030048,0.982940005687,0.982944855031,0.980445657117,0.990540753587,0.990542244641,0.989171493327,585.164842386
610,0.00879901773933,0.00886243644802,0.00888524873837,0.984646005118,0.984081864696,0.984538426558,0.991462450593,0.991161616162,0.991409802931,594.989445901
620,0.00752549152692,0.0077907900001,0.00788040150807,0.985641171453,0.985787379193,0.986357435198,0.992032815335,0.992121021116,0.992431886983,604.957651307
630,0.00760203311567,0.00770536744565,0.00782208841584,0.987347170884,0.984650369528,0.985902683038,0.992966094997,0.991474581623,0.992165782158,614.824882412
640,0.00753208172564,0.00750177086521,0.00758288246068,0.987631504123,0.98521887436,0.986812187358,0.993121985928,0.991777356104,0.992671215567,624.617201065
650,0.00746694841499,0.00778786557945,0.00756712578913,0.985356838214,0.98521887436,0.984538426558,0.991864781613,0.991798107256,0.991409802931,634.460511558
660,0.0079507071862,0.00822746619417,0.00808665543016,0.985641171453,0.984650369528,0.984993178718,0.992026525618,0.991479962133,0.991672975019,643.896215212
670,0.0090875669154,0.00940524178694,0.00937775495146,0.984503838499,0.983513359864,0.980445657117,0.991424750216,0.990883370009,0.989198693796,653.371902699
680,0.00732018522296,0.00744370934717,0.00738754835089,0.986778504407,0.984081864696,0.988176443838,0.992652287272,0.991156032849,0.993431025771,663.363016571
690,0.0073291768171,0.00760777116217,0.00785445911731,0.985072504976,0.984650369528,0.983174170077,0.991725116242,0.991490702805,0.990687138183,672.920868665
700,0.00668843659273,0.0069688960698,0.00692851226015,0.987062837646,0.986355884025,0.986812187358,0.992820512821,0.992433795712,0.992686002522,682.663425301
710,0.00684608688418,0.00701629306404,0.00724896033648,0.985641171453,0.98521887436,0.984083674397,0.992042858268,0.991813602015,0.991186099219,692.528432996
720,0.00623433561138,0.00643845760672,0.00638868264684,0.987489337504,0.98521887436,0.988631195998,0.993047874862,0.991792929293,0.993688462509,702.123810452
730,0.00964651733083,0.00998310254284,0.00991470447821,0.981802672732,0.982376350199,0.978171896317,0.989913317573,0.990242367013,0.987915407855,711.618967386
740,0.00700608727449,0.00688898533052,0.00653573377481,0.984503838499,0.984081864696,0.986812187358,0.99142340074,0.991194968553,0.992689689942,721.439825318
750,0.0063792394522,0.00635403544082,0.00630119384481,0.989053170316,0.986924388857,0.988631195998,0.993908709754,0.992733017378,0.993682082386,730.910362381
760,0.00537912971455,0.00542875116457,0.00543346252383,0.989621836793,0.98749289369,0.989085948158,0.99423517334,0.993055555556,0.993939393939,740.308814051
770,0.00583267548576,0.0057372515855,0.0059028017266,0.988626670458,0.986355884025,0.986812187358,0.993689856444,0.992438563327,0.992686002522,749.841331608
780,0.00553502616784,0.00572481636195,0.0056615916987,0.988768837077,0.98749289369,0.988176443838,0.993768241698,0.993064312736,0.993437657749,759.605899914
790,0.00590843331224,0.00620137378366,0.00600103425404,0.989053170316,0.986924388857,0.989540700318,0.99392313156,0.992746767581,0.994190452134,769.294008704
800,0.00520894043919,0.0053995382117,0.00512726275677,0.990048336651,0.988061398522,0.989085948158,0.994471647449,0.993373303881,0.993939393939,779.284532745
810,0.00514621087754,0.00515882850535,0.00503996542419,0.989906170031,0.988061398522,0.989085948158,0.994388682526,0.99336492891,0.993936331481,788.583675696
820,0.00532692209362,0.00548413378627,0.00537018224416,0.989621836793,0.986924388857,0.988631195998,0.994230617245,0.992733017378,0.993685274059,798.286721389
830,0.00555112434252,0.00586871796338,0.00584330954232,0.9882001706,0.986355884025,0.987721691678,0.993453742409,0.992433795712,0.993186979561,807.891693719
840,0.00631899368042,0.00616180057672,0.00604768047657,0.989479670173,0.988629903354,0.989540700318,0.994140934283,0.993670886076,0.994184576485,817.509707836
850,0.00598036515711,0.00589358651696,0.00569907090168,0.989479670173,0.98749289369,0.989085948158,0.994161275051,0.993064312736,0.993942453306,826.846485583
860,0.00510861997792,0.00491075703721,0.00500655015433,0.99019050327,0.990335417851,0.990904956799,0.994541571078,0.994625355675,0.994944388271,836.53081995
870,0.00558032406371,0.00576753698198,0.00558824541475,0.989337503554,0.988061398522,0.989085948158,0.994074425219,0.993373303881,0.993939393939,846.399065178
880,0.00534421545272,0.00498972359246,0.00511078285107,0.989764003412,0.989766913019,0.990904956799,0.994301092291,0.99430740038,0.994941831057,856.104336254
890,0.00508470533283,0.00460898442923,0.00498394187008,0.990759169747,0.990903922683,0.991814461119,0.994857188069,0.994939911448,0.995447647951,866.125869112
900,0.00522079015415,0.00499851565529,0.00503964276563,0.990332669889,0.991472427516,0.991814461119,0.994621955078,0.995260663507,0.995447647951,875.54375665
910,0.00477053070567,0.00453971078715,0.00468904338185,0.990759169747,0.990335417851,0.989995452478,0.994863690241,0.994632143985,0.994441637191,885.640575691
920,0.00498155002459,0.00486546577084,0.00504666808375,0.990617003128,0.988061398522,0.989085948158,0.994785082174,0.993377483444,0.993939393939,895.466214663
930,0.00482505472305,0.00464669522232,0.00471094143948,0.990759169747,0.989766913019,0.990450204638,0.99486206624,0.994318181818,0.994692949204,905.140582801
940,0.00496816356746,0.00508594464347,0.00505570510298,0.989479670173,0.988629903354,0.988631195998,0.994152970923,0.993686868687,0.993688462509,914.7690471
950,0.00478194985644,0.0046426854335,0.00458306637606,0.990901336366,0.990335417851,0.991814461119,0.994940711462,0.994628751975,0.995449949444,924.408242865
960,0.00495122279559,0.00469401025531,0.0048093229521,0.990901336366,0.989766913019,0.990904956799,0.994941511224,0.994314592546,0.9949469429,934.263105762
970,0.00632753063218,0.0058794253758,0.00588860321967,0.987915837361,0.986924388857,0.989995452478,0.993261989695,0.992700729927,0.994427558257,943.861253791
980,0.00541823942759,0.00503913753411,0.00520945457257,0.990474836508,0.991472427516,0.991359708959,0.994698947702,0.995254666245,0.995193523906,954.222311261
990,0.00490170735704,0.0048467397481,0.00477662310481,0.99019050327,0.989198408186,0.991359708959,0.994545885701,0.993996840442,0.995198382613,963.660038026
1000,0.00500946858014,0.00499348289784,0.00487923998114,0.990332669889,0.989198408186,0.989995452478,0.994626205153,0.994004417797,0.994441637191,973.440135038
1010,0.00486941547763,0.00486045218592,0.00483875419515,0.99019050327,0.989198408186,0.989085948158,0.994548471202,0.994004417797,0.993939393939,982.875084913
1020,0.00483449572211,0.00483882381034,0.00484652734719,0.990332669889,0.989198408186,0.989085948158,0.994627054362,0.994004417797,0.993939393939,992.406052643
1030,0.00492037511046,0.00482647437662,0.00471061829746,0.990617003128,0.990903922683,0.990450204638,0.994784257942,0.994946304485,0.99469563021,1001.72671541
1040,0.00502490220201,0.00491745489657,0.00484266601753,0.991043502985,0.990903922683,0.990904956799,0.995021730541,0.994949494949,0.9949469429,1011.58093792
1050,0.00490134476267,0.00480874920596,0.0047769577459,0.990332669889,0.989766913019,0.990450204638,0.994627903302,0.994321766562,0.99469563021,1021.139831
1060,0.00478079414397,0.00472278262348,0.00462653252891,0.991043502985,0.990903922683,0.991359708959,0.995022517184,0.994946304485,0.995198382613,1030.65515032
1070,0.00521985148182,0.00490069742916,0.0049050301932,0.990759169747,0.990903922683,0.991359708959,0.994859628312,0.994946304485,0.995198382613,1040.55179696
1080,0.00503959171911,0.00500291593801,0.00497579141595,0.989764003412,0.989198408186,0.989540700318,0.994313694519,0.994004417797,0.994193385509,1050.00851554
1090,0.00480271229614,0.00452829539574,0.00483756115028,0.990617003128,0.989198408186,0.989995452478,0.994786729858,0.994004417797,0.994441637191,1059.57422265
1100,0.0053038412546,0.00539525270604,0.00538595276927,0.989621836793,0.989198408186,0.988176443838,0.994237903544,0.994008199306,0.993440968718,1069.57700429
1110,0.00449884100934,0.00407676088248,0.00420027038769,0.990474836508,0.99260943718,0.990904956799,0.994698947702,0.995884773663,0.994939271255,1078.59754435
1120,0.00425797052112,0.00392547553439,0.00417215617467,0.991043502985,0.992040932348,0.990904956799,0.99501936912,0.995575221239,0.994944388271,1088.18391202
1130,0.0043714261314,0.00427830462182,0.00428334029944,0.990901336366,0.988629903354,0.990904956799,0.994943109987,0.993686868687,0.9949469429,1097.83663313
1140,0.00478154677071,0.00428770382149,0.00453882740605,0.991043502985,0.992040932348,0.991814461119,0.995017793594,0.995572422517,0.995447647951,1107.54903705
1150,0.00415760887562,0.00380486905283,0.0039692603211,0.991185669605,0.990903922683,0.991359708959,0.995097263957,0.994939911448,0.995193523906,1117.21902869
1160,0.0051155248657,0.00508502411625,0.00523943856984,0.990901336366,0.989198408186,0.989995452478,0.994944707741,0.994004417797,0.994447248864,1126.47310415
1170,0.00403533446913,0.00370207393418,0.00374641605183,0.991754336082,0.993746446845,0.992723965439,0.995411392405,0.996517885407,0.995953464846,1135.99527267
1180,0.00424973489415,0.00389563821877,0.00406047989843,0.991043502985,0.99260943718,0.992269213279,0.995018581482,0.995889977869,0.995701643489,1145.59177526
1190,0.00410775635164,0.00395531927451,0.00400512319861,0.991754336082,0.990903922683,0.991814461119,0.995416469101,0.994946304485,0.995449949444,1155.33058632
1200,0.00412007918402,0.00356304755327,0.0038258303764,0.991185669605,0.993177942013,0.991359708959,0.995098039216,0.996207332491,0.995195954488,1164.80305325
1210,0.00427124652826,0.0039124101691,0.00413191638008,0.991043502985,0.992040932348,0.989995452478,0.995020156509,0.995578016425,0.994441637191,1174.92412515
1220,0.00365497838148,0.00326864869337,0.00341004241501,0.991612169463,0.993746446845,0.992269213279,0.995335599652,0.996522288966,0.995701643489,1184.70277584
1230,0.00386392126546,0.00332886524439,0.00347312240001,0.991470002843,0.99260943718,0.991814461119,0.995252413357,0.995882166614,0.99544534413,1194.50939692
1240,0.00422784129741,0.00390415403595,0.00402555897449,0.991185669605,0.992040932348,0.991814461119,0.995098039216,0.995572422517,0.995449949444,1203.83761407
1250,0.00402188496286,0.00391389734688,0.00401058390708,0.991896502701,0.990903922683,0.991359708959,0.995495851442,0.994949494949,0.995198382613,1213.32479431
1260,0.00369468139592,0.00322300442236,0.00345356016231,0.991896502701,0.993177942013,0.992723965439,0.995490863065,0.996207332491,0.995953464846,1222.76498033
1270,0.0037453509037,0.00338807807103,0.00357001669452,0.991612169463,0.993177942013,0.991814461119,0.995336337048,0.996204933586,0.995449949444,1232.59726306
1280,0.00401193419927,0.0035694255477,0.00386166189502,0.991327836224,0.993746446845,0.991814461119,0.995179008931,0.996522288966,0.995447647951,1242.19399954
1290,0.00404873493768,0.00359750067447,0.00387984586473,0.991327836224,0.99260943718,0.991814461119,0.995180532512,0.995889977869,0.995449949444,1251.93328032
1300,0.00435389476283,0.00413467924115,0.00444031015094,0.991612169463,0.990903922683,0.989995452478,0.995339284304,0.994949494949,0.994444444444,1261.43759874
1310,0.00375950075727,0.00334024870868,0.00360542279396,0.991896502701,0.993177942013,0.991359708959,0.995492289442,0.996204933586,0.995198382613,1271.16385867
1320,0.00395437140366,0.00358123937693,0.00385744975923,0.992323002559,0.993177942013,0.991814461119,0.995731900095,0.996207332491,0.995449949444,1281.15164415
1330,0.0042465365117,0.00357360135289,0.00412289540151,0.990759169747,0.99260943718,0.991359708959,0.994861253854,0.995889977869,0.995195954488,1290.71731096
1340,0.00383159867349,0.00334692886547,0.00350045417788,0.992323002559,0.992040932348,0.993178717599,0.995730550285,0.995572422517,0.99620541361,1301.03218213
1350,0.00383020852082,0.0035226026203,0.00380726597549,0.991896502701,0.993177942013,0.991359708959,0.995493002293,0.996207332491,0.995198382613,1310.47424668
1360,0.00387419735777,0.00305357463955,0.00370962106242,0.990332669889,0.993177942013,0.990904956799,0.994613434728,0.996204933586,0.994939271255,1319.94603293
1370,0.00392423186588,0.00365385689528,0.00400286247953,0.991185669605,0.992040932348,0.990450204638,0.995098814229,0.995575221239,0.99469563021,1329.66830668
1380,0.00370616578707,0.00333997830396,0.0037290971088,0.991470002843,0.99260943718,0.991814461119,0.995254666245,0.995889977869,0.995449949444,1339.60615039
1390,0.00388100336849,0.00326461303993,0.00370677290742,0.991896502701,0.99260943718,0.991359708959,0.995494427318,0.995889977869,0.995198382613,1348.98885884
1400,0.00347938330899,0.00298229507651,0.00327202996684,0.993176002275,0.993177942013,0.994088221919,0.996201930685,0.996202531646,0.996709693748,1358.63217747
1410,0.00343170837611,0.00299438056882,0.00319438628884,0.99218083594,0.994314951677,0.992723965439,0.995649078396,0.996835443038,0.995953464846,1368.74106487
1420,0.00342079149918,0.00316483086394,0.00324502354134,0.992323002559,0.993177942013,0.993178717599,0.995727848101,0.996202531646,0.996203492787,1378.75525075
1430,0.00340524011591,0.00293400089646,0.00331967985712,0.992465169178,0.993746446845,0.992723965439,0.995807293727,0.99652008858,0.995951417004,1388.60471473
1440,0.00357012609773,0.00313629927587,0.00343411394542,0.992891669036,0.993177942013,0.992269213279,0.9960449296,0.996202531646,0.995699468758,1397.93367144
1450,0.00338304731699,0.00281645376417,0.00320381397921,0.992891669036,0.994314951677,0.993633469759,0.996044303797,0.996835443038,0.996455696203,1407.24475632
1460,0.00399800632157,0.00371382067639,0.00413846747913,0.991327836224,0.992040932348,0.989995452478,0.995180532512,0.995575221239,0.994444444444,1417.0291441
1470,0.00345097531846,0.00300942416138,0.00335261450832,0.992607335798,0.993746446845,0.992269213279,0.995886726784,0.99652008858,0.995699468758,1427.19807382
1480,0.00369556738028,0.00345197156935,0.00373006825214,0.991896502701,0.993177942013,0.991814461119,0.995495851442,0.996204933586,0.995449949444,1436.98586308
1490,0.00352688252826,0.00305617418525,0.00326115267005,0.992465169178,0.99260943718,0.993178717599,0.995805966606,0.995884773663,0.996203492787,1446.57729387
1500,0.0035335167387,0.0029160230744,0.0029875395797,0.991896502701,0.994883456509,0.993178717599,0.995480136389,0.997145575642,0.996197718631,1456.57330454
1510,0.00342484954433,0.00284936039202,0.00323666164949,0.992749502417,0.994314951677,0.993178717599,0.995964232017,0.996833438885,0.996201570018,1466.04519429
1520,0.00353042141527,0.00289328387843,0.00319442720168,0.992323002559,0.994883456509,0.992269213279,0.995723788407,0.997147385103,0.99569293134,1475.61986813
1530,0.00335699319723,0.00296118701087,0.00318683305502,0.992749502417,0.993746446845,0.992723965439,0.995968060716,0.99652008858,0.995953464846,1485.32131303
1540,0.00346518059788,0.00295794368687,0.0031152975877,0.993176002275,0.99260943718,0.993633469759,0.996202531646,0.995887377412,0.996455696203,1495.18048369
1550,0.00337070207981,0.00273868202124,0.00307972404032,0.992891669036,0.994314951677,0.994088221919,0.996041798607,0.996835443038,0.996708027349,1504.75093273
1560,0.00358990876758,0.00311129797711,0.00333482499362,0.99218083594,0.994314951677,0.993178717599,0.995650454725,0.996837444655,0.99620541361,1514.38178281
1570,0.00317379836825,0.00267462795995,0.00293682637515,0.993460335513,0.994314951677,0.992723965439,0.996360183573,0.996835443038,0.995951417004,1524.07242869
1580,0.00360883463926,0.00345651148515,0.00370521325663,0.99218083594,0.991472427516,0.990904956799,0.995653204774,0.995260663507,0.9949469429,1534.79722215
1590,0.00341400108769,0.00262469271126,0.00289034436486,0.992749502417,0.996020466174,0.994088221919,0.995962314939,0.9977827051,0.996709693748,1545.96082248
1600,0.00429103320473,0.00385400635518,0.00385849618437,0.990901336366,0.99260943718,0.991814461119,0.994947900221,0.995892575039,0.99545224861,1555.41880091
1610,0.00374628126241,0.003643465683,0.00378331299635,0.991185669605,0.991472427516,0.990904956799,0.995103459169,0.995263656457,0.994949494949,1565.26431625
1620,0.00307440926798,0.00284848093761,0.00284533277315,0.993176002275,0.994314951677,0.992723965439,0.996203732996,0.996835443038,0.995951417004,1574.97579454
1630,0.00355852732208,0.00334091857346,0.00336850510381,0.99218083594,0.992040932348,0.992269213279,0.995653891742,0.995572422517,0.995701643489,1584.54808615
1640,0.00317552367883,0.00297373317005,0.0029905778622,0.992323002559,0.993177942013,0.992723965439,0.995731225296,0.996202531646,0.995953464846,1594.22605528
1650,0.00321911212309,0.00295773922362,0.00312714090499,0.992323002559,0.993746446845,0.991814461119,0.995731900095,0.99652008858,0.995449949444,1603.7551836
1660,0.00321615901922,0.00296649742417,0.00290669724444,0.992607335798,0.993746446845,0.993178717599,0.995887377412,0.996517885407,0.996203492787,1613.54794512
1670,0.00316624380372,0.00276590559822,0.0029213066017,0.992323002559,0.993746446845,0.992723965439,0.99573257468,0.99652008858,0.995953464846,1623.49813056
1680,0.00326769170404,0.00297254130477,0.00292186897275,0.992891669036,0.994314951677,0.993178717599,0.996042425202,0.996833438885,0.996201570018,1633.27416475
1690,0.00317817205994,0.00295725583005,0.00299660498123,0.992749502417,0.993746446845,0.993178717599,0.995967423104,0.996517885407,0.996203492787,1642.50996582
1700,0.0034470136815,0.0032635437851,0.00342653553898,0.991470002843,0.992040932348,0.992269213279,0.995260663507,0.995578016425,0.995703816022,1651.95129516
1710,0.00284285635505,0.00232649933488,0.0026467449002,0.993744668752,0.994883456509,0.994542974079,0.996519538048,0.997152799747,0.996962025316,1661.76218726
1720,0.00341943313493,0.00308775456849,0.00327398371667,0.991612169463,0.993177942013,0.992723965439,0.995336337048,0.996202531646,0.995951417004,1671.54533059
1730,0.0033950405096,0.00327860387876,0.0034927146421,0.99203866932,0.99260943718,0.991359708959,0.995573822321,0.995887377412,0.995195954488,1681.30369721
1740,0.0030026349098,0.00232448931826,0.00270856150006,0.993744668752,0.996020466174,0.993633469759,0.996520638937,0.997784108895,0.996457489879,1690.95532953
1750,0.00319657541023,0.00262800382809,0.00289923900922,0.993318168894,0.995451961342,0.993633469759,0.996283115856,0.99746835443,0.99645928174,1700.78867893
1760,0.00364613929297,0.00308557990382,0.00349946842424,0.992749502417,0.993746446845,0.992723965439,0.995969972343,0.996522288966,0.995955510617,1710.9894305
1770,0.00268425355815,0.00234298124322,0.00257160371551,0.99417116861,0.995451961342,0.995452478399,0.99675350384,0.997465145754,0.997467071935,1720.53407764
1780,0.00290159370375,0.00239133407752,0.00265250734138,0.993602502132,0.995451961342,0.994542974079,0.996438464583,0.997465145754,0.996960486322,1730.44079164
1790,0.00292105112587,0.00256301970659,0.00264283190456,0.992749502417,0.994314951677,0.994088221919,0.995968060716,0.996835443038,0.996709693748,1740.84746021
1800,0.00272751092937,0.00236568705676,0.00244528258774,0.993744668752,0.995451961342,0.994997726239,0.996519538048,0.997466751108,0.99721307322,1750.72951168
1810,0.00325598075747,0.00249752009176,0.00292247070117,0.993318168894,0.995451961342,0.994542974079,0.996276637883,0.997463538364,0.996958945768,1760.35421182
1820,0.00304745890312,0.0027255955535,0.00294939469788,0.992607335798,0.993746446845,0.993178717599,0.995888678052,0.99652008858,0.996203492787,1770.24199959
1830,0.00279056666117,0.00226652214247,0.00243887130959,0.993318168894,0.996020466174,0.994542974079,0.996283115856,0.997784108895,0.996962025316,1779.67267015
1840,0.00287711263813,0.00250904569642,0.00254337980979,0.992323002559,0.994883456509,0.994542974079,0.995721755665,0.997147385103,0.996958945768,1789.06801822
1850,0.00285064350259,0.0024382984992,0.00259065816417,0.993176002275,0.994883456509,0.994542974079,0.996199524941,0.997149192271,0.996958945768,1798.73944907
1860,0.00278974152362,0.00241892228426,0.00245493548001,0.993318168894,0.994883456509,0.994997726239,0.996279585213,0.997147385103,0.99721307322,1807.8898966
1870,0.00299058685107,0.0026265944998,0.00267839014331,0.992607335798,0.994883456509,0.993633469759,0.99587955626,0.997145575642,0.99645030426,1819.21421606
1880,0.00306970062093,0.00265646969313,0.00273622877408,0.993318168894,0.995451961342,0.994088221919,0.996285465897,0.99746835443,0.996711358462,1830.12294804
1890,0.00280298799857,0.00256695015292,0.00247520095326,0.993318168894,0.994314951677,0.994542974079,0.996279585213,0.996831432193,0.996958945768,1840.65056446
1900,0.0033822786374,0.00312043845202,0.0030860891355,0.993033835655,0.991472427516,0.993178717599,0.996126175982,0.995254666245,0.996207332491,1851.14197976
1910,0.00265406636435,0.0022830206905,0.00229349851268,0.99417116861,0.996588971006,0.994997726239,0.996755045509,0.998098859316,0.99721448468,1861.54585722
1920,0.00300441071199,0.00264596623736,0.00288749819458,0.993176002275,0.994883456509,0.993633469759,0.996200728194,0.997149192271,0.996452103396,1870.87927694
1930,0.00283987247065,0.00256867493062,0.00259931418555,0.993602502132,0.994883456509,0.993633469759,0.99643902825,0.997149192271,0.996453900709,1879.81899205
1940,0.00269955996785,0.00231279566548,0.00232976849552,0.993744668752,0.994883456509,0.994542974079,0.99652008858,0.997150997151,0.996962025316,1889.16749642
1950,0.00553862124984,0.00474952511055,0.00537814993934,0.984788171737,0.988061398522,0.983628922237,0.991481569939,0.993314231137,0.990811638591,1898.68643451
1960,0.00263601095212,0.00237453979481,0.00228063486554,0.993602502132,0.996020466174,0.994088221919,0.996440718184,0.997784108895,0.996708027349,1908.24270438
1970,0.00285414492026,0.00252457842961,0.00251966025084,0.992891669036,0.994883456509,0.994542974079,0.996043677797,0.997149192271,0.996960486322,1917.84186891
1980,0.00279854054768,0.00253626404531,0.00240221954299,0.99402900199,0.995451961342,0.994542974079,0.996678266371,0.99746835443,0.996962025316,1926.79938354
1990,0.0037647507394,0.00385719892431,0.00333470160274,0.993460335513,0.993177942013,0.995452478399,0.996361910788,0.996197718631,0.99746578814,1935.70873853
2000,0.0028878292165,0.00252961581296,0.00257996237322,0.993033835655,0.995451961342,0.994542974079,0.996121883657,0.997466751108,0.996958945768,1944.94824055
