k,Pen Digits Data log-likelihood
2,-1.7439774834063813
3,0.29034824927963604
4,1.1688528453757792
5,1.5549945019811335
6,1.8378878141403845
7,1.8943664092522128
8,1.9238390964865335
9,1.9492260937130637
10,1.9937956543034412
15,2.0101657451277615
20,2.0604761687992177
25,2.0841377465533584
30,2.075538649743875
35,2.0880824263786315
40,2.113167017730252
