iterations,fitness,time,fevals
0,23.0,0.00171931,591
10,25.0,0.00326913799999,1067
20,25.0,0.004720201,1535
30,28.0,0.006569882,2020
40,28.0,0.008176994,2509
50,29.0,0.010876849,2995
60,29.0,0.012342529,3486
70,28.0,0.013818085,3966
80,29.0,0.015586383,4455
90,29.0,0.017279619,4939
100,29.0,0.018712904,5422
110,29.0,0.020151721,5905
120,30.0,0.02161266,6399
130,30.0,0.024378489,6884
140,30.0,0.025829947,7361
150,31.0,0.027289306,7851
160,31.0,0.028757752,8341
170,33.0,0.030473111,8828
180,33.0,0.031938396,9314
190,33.0,0.033826793,9798
200,33.0,0.035274696,10281
210,35.0,0.037893562,10747
220,35.0,0.040244181,11244
230,34.0,0.041698009,11733
240,34.0,0.043203591,12221
250,36.0,0.045240926,12695
260,38.0,0.046728335,13168
270,38.0,0.048180188,13651
280,39.0,0.051159351,14140
290,38.0,0.052692192,14621
300,39.0,0.054151946,15089
310,38.0,0.055628688,15571
320,39.0,0.057135455,16060
330,39.0,0.058648147,16548
340,39.0,0.060143062,17027
350,40.0,0.06160084,17502
360,39.0,0.064775558,17976
370,39.0,0.066272053,18462
380,40.0,0.067723116,18941
390,39.0,0.069184846,19437
400,40.0,0.070653292,19923
410,40.0,0.072106725,20398
420,40.0,0.073560554,20883
430,40.0,0.075093395,21361
440,39.0,0.078742978,21840
450,40.0,0.081255177,22321
460,40.0,0.082693993,22800
470,40.0,0.084136759,23284
480,40.0,0.085802341,23764
490,41.0,0.087615675,24240
500,40.0,0.089128763,24716
510,40.0,0.090599974,25199
520,40.0,0.093265853,25684
530,40.0,0.094668323,26158
540,41.0,0.096120966,26634
550,42.0,0.097567683,27110
560,41.0,0.099962944,27592
570,42.0,0.101398599,28065
580,42.0,0.102805415,28537
590,43.0,0.104341021,29017
600,42.0,0.106995443,29506
610,41.0,0.108427147,29991
620,44.0,0.109862012,30477
630,42.0,0.111292926,30952
640,42.0,0.113229915,31437
650,42.0,0.114615003,31921
660,42.0,0.11603051,32394
670,42.0,0.118309623,32872
680,42.0,0.121082563,33361
690,42.0,0.122539157,33840
700,43.0,0.124363948,34327
710,43.0,0.125797233,34805
720,43.0,0.128211062,35289
730,43.0,0.12991773,35772
740,43.0,0.13131625,36253
750,44.0,0.133172647,36730
760,43.0,0.136834872,37220
770,44.0,0.138409194,37700
780,45.0,0.13988238,38165
790,43.0,0.141466974,38636
800,43.0,0.142930679,39122
810,44.0,0.14436831,39603
820,45.0,0.146477546,40093
830,45.0,0.148041201,40584
840,44.0,0.15157187,41066
850,43.0,0.15303439,41557
860,45.0,0.154478737,42036
870,45.0,0.155930985,42526
880,45.0,0.157361505,43015
890,45.0,0.158773062,43501
900,45.0,0.160883089,43970
910,45.0,0.162311239,44462
920,46.0,0.165223241,44942
930,47.0,0.166662847,45422
940,47.0,0.168081515,45905
950,48.0,0.169485961,46378
960,48.0,0.170907789,46857
970,48.0,0.172316185,47332
980,47.0,0.174150063,47827
990,47.0,0.175546212,48304
1000,47.0,0.178215646,48773
1010,47.0,0.179789573,49245
1020,48.0,0.181237476,49733
1030,49.0,0.18266365,50208
1040,50.0,0.184088639,50693
1050,50.0,0.185517183,51175
1060,50.0,0.187126665,51651
1070,51.0,0.188533086,52127
1080,51.0,0.191163804,52607
1090,52.0,0.192584447,53086
1100,53.0,0.193989682,53559
1110,51.0,0.19540756,54048
1120,51.0,0.196984648,54529
1130,51.0,0.198457439,55013
1140,52.0,0.199854773,55497
1150,53.0,0.201466626,55989
1160,54.0,0.204053097,56460
1170,53.0,0.205519173,56951
1180,53.0,0.206871866,57417
1190,53.0,0.208267225,57892
1200,52.0,0.209696954,58385
1210,52.0,0.211567572,58860
1220,52.0,0.21295266,59325
1230,52.0,0.214530538,59815
1240,52.0,0.217157306,60311
1250,53.0,0.218543579,60788
1260,52.0,0.219946839,61271
1270,52.0,0.221473754,61755
1280,53.0,0.222837509,62237
1290,53.0,0.225504573,62732
1300,54.0,0.226883734,63222
1310,53.0,0.228408674,63698
1320,53.0,0.231063886,64174
1330,53.0,0.232439887,64648
1340,53.0,0.234480382,65126
1350,53.0,0.235903,65614
1360,55.0,0.237476137,66085
1370,54.0,0.238881372,66572
1380,54.0,0.240286607,67050
1390,54.0,0.2417673,67531
1400,54.0,0.244518907,68020
1410,54.0,0.245978661,68502
1420,55.0,0.247372045,68982
1430,54.0,0.248770959,69460
1440,55.0,0.250293924,69943
1450,55.0,0.252374716,70415
1460,56.0,0.253786668,70895
1470,56.0,0.255225484,71395
1480,56.0,0.257801684,71870
1490,56.0,0.259162673,72346
1500,57.0,0.260568699,72820
1510,57.0,0.262112996,73297
1520,56.0,0.263487812,73791
1530,56.0,0.264868949,74262
1540,56.0,0.266236653,74743
1550,56.0,0.267632802,75230
1560,56.0,0.270943817,75719
1570,57.0,0.272411078,76203
1580,56.0,0.273815919,76696
1590,57.0,0.275375624,77166
1600,57.0,0.276742144,77636
1610,56.0,0.278133552,78119
1620,56.0,0.279531676,78596
1630,56.0,0.280942838,79086
1640,56.0,0.283358247,79573
1650,57.0,0.285354101,80057
1660,56.0,0.287037856,80529
1670,56.0,0.288415042,81009
1680,56.0,0.289896129,81488
1690,59.0,0.29155381,81964
1700,55.0,0.292955095,82446
1710,54.0,0.294363491,82937
1720,55.0,0.296818407,83424
1730,55.0,0.298294358,83910
1740,56.0,0.299665223,84399
1750,56.0,0.301275495,84876
1760,56.0,0.303020484,85366
1770,56.0,0.304537127,85843
1780,56.0,0.30592656,86327
1790,56.0,0.307278462,86795
1800,56.0,0.309724292,87277
1810,56.0,0.311097527,87768
1820,57.0,0.312461281,88254
1830,56.0,0.313801727,88732
1840,55.0,0.315908198,89213
1850,56.0,0.31728815,89690
1860,55.0,0.318668892,90168
1870,55.0,0.320020794,90633
1880,56.0,0.322550771,91119
1890,57.0,0.324400056,91607
1900,56.0,0.325831761,92092
1910,56.0,0.327211713,92571
1920,55.0,0.328724011,93060
1930,56.0,0.330197197,93549
1940,55.0,0.331573593,94030
1950,56.0,0.33295789,94515
1960,55.0,0.335408459,94988
1970,56.0,0.336806189,95471
1980,57.0,0.338754635,95956
1990,67.0,0.340274439,96436
2000,67.0,0.341699823,96922
2010,67.0,0.343197108,97406
2020,67.0,0.344603924,97906
2030,67.0,0.345978344,98388
2040,67.0,0.348420222,98859
2050,68.0,0.349786346,99347
2060,68.0,0.351129557,99815
2070,69.0,0.352481854,100288
2080,68.0,0.353840867,100771
2090,69.0,0.355813807,101258
2100,69.0,0.357167289,101741
2110,68.0,0.358531043,102220
2120,68.0,0.361107637,102700
2130,68.0,0.362487589,103201
2140,68.0,0.363865171,103695
2150,69.0,0.366157716,104179
2160,68.0,0.367579545,104646
2170,69.0,0.368964237,105111
2180,69.0,0.370500633,105587
2190,69.0,0.371871103,106084
2200,69.0,0.374379352,106567
2210,69.0,0.375752192,107055
2220,73.0,0.377117132,107546
2230,70.0,0.37847654,108020
2240,70.0,0.380163455,108505
2250,70.0,0.381943604,108993
2260,70.0,0.383282074,109474
2270,70.0,0.384739458,109956
2280,71.0,0.387248497,110430
2290,70.0,0.388608301,110898
2300,70.0,0.390083857,111372
2310,71.0,0.391444846,111845
2320,69.0,0.392884452,112328
2330,70.0,0.394595465,112823
2340,70.0,0.395933935,113295
2350,70.0,0.397384998,113768
2360,70.0,0.400409988,114270
2370,70.0,0.401870137,114751
2380,72.0,0.403238237,115234
2390,70.0,0.404812559,115715
2400,70.0,0.40618382,116189
2410,71.0,0.407498981,116655
2420,70.0,0.408843377,117131
2430,70.0,0.41023202,117624
2440,71.0,0.41280901,118117
2450,71.0,0.414185011,118586
2460,71.0,0.415721407,119064
2470,71.0,0.417095433,119534
2480,72.0,0.418481311,120015
2490,71.0,0.419850596,120499
2500,71.0,0.42188161,120970
2510,74.0,0.423245364,121443
2520,72.0,0.425642996,121914
2530,74.0,0.427052972,122395
2540,71.0,0.428399738,122874
2550,73.0,0.429872529,123351
2560,71.0,0.431221271,123832
2570,73.0,0.43255184,124307
2580,72.0,0.433956286,124786
2590,75.0,0.435308189,125268
2600,75.0,0.437745327,125758
2610,74.0,0.439080636,126237
2620,74.0,0.440673921,126728
2630,73.0,0.442013971,127205
2640,74.0,0.443344935,127678
2650,74.0,0.444779801,128165
2660,76.0,0.446168839,128653
2670,76.0,0.448938224,129136
2680,77.0,0.450831757,129619
2690,76.0,0.452183659,130095
2700,76.0,0.453690821,130582
2710,76.0,0.45505655,131060
2720,78.0,0.456474032,131535
2730,78.0,0.458311071,132009
2740,78.0,0.459679171,132506
2750,79.0,0.462290926,132980
2760,78.0,0.463660211,133467
2770,78.0,0.465015669,133937
2780,77.0,0.466388115,134420
2790,78.0,0.467748314,134904
2800,76.0,0.469309204,135385
2810,76.0,0.470659526,135851
2820,77.0,0.472382391,136360
2830,77.0,0.474961751,136846
2840,78.0,0.476481159,137337
2850,78.0,0.47785637,137814
2860,77.0,0.479298742,138302
2870,77.0,0.480788521,138785
2880,76.0,0.482160571,139261
2890,78.0,0.483693807,139731
2900,78.0,0.485031882,140207
2910,76.0,0.487547636,140689
2920,78.0,0.489686897,141177
2930,79.0,0.49104591,141654
2940,79.0,0.492539245,142125
2950,79.0,0.493897468,142630
2960,79.0,0.495486012,143114
2970,80.0,0.496822507,143589
2980,80.0,0.498488878,144081
2990,80.0,0.500977374,144551
3000,81.0,0.502320585,145027
3010,80.0,0.503681574,145517
3020,80.0,0.505497674,145995
3030,79.0,0.507230021,146487
3040,80.0,0.508613923,146976
3050,80.0,0.509945677,147450
3060,79.0,0.511326418,147944
3070,80.0,0.514714865,148421
3080,80.0,0.516105089,148900
3090,80.0,0.517537584,149386
3100,80.0,0.518900153,149872
3110,80.0,0.520241784,150359
3120,80.0,0.521607119,150833
3130,78.0,0.523485639,151313
3140,78.0,0.524846233,151800
3150,80.0,0.527885445,152280
3160,80.0,0.529227075,152762
3170,80.0,0.530582533,153250
3180,79.0,0.532137102,153730
3190,79.0,0.53346372,154220
3200,79.0,0.534797844,154687
3210,79.0,0.536157647,155167
3220,79.0,0.537534043,155658
3230,79.0,0.540023724,156139
3240,80.0,0.541540762,156613
3250,79.0,0.542877652,157100
3260,79.0,0.544217307,157588
3270,79.0,0.545627284,158081
3280,79.0,0.546985903,158570
3290,79.0,0.548330299,159049
3300,79.0,0.549691683,159529
3310,79.0,0.552411685,160006
3320,79.0,0.553778995,160490
3330,79.0,0.555454058,160967
3340,79.0,0.556822949,161451
3350,79.0,0.558151938,161925
3360,79.0,0.559510952,162414
3370,80.0,0.561157571,162891
3380,79.0,0.562482609,163365
3390,79.0,0.565495352,163852
3400,79.0,0.566970514,164330
3410,79.0,0.568318465,164815
3420,79.0,0.569742664,165297
3430,80.0,0.571719554,165785
3440,80.0,0.573134666,166277
3450,80.0,0.574920347,166757
3460,80.0,0.576338619,167240
3470,80.0,0.578739806,167720
3480,81.0,0.580079462,168198
3490,81.0,0.581418327,168689
3500,81.0,0.582769834,169177
3510,81.0,0.584111465,169651
3520,82.0,0.585856059,170128
3530,81.0,0.587203221,170612
3540,81.0,0.588521543,171082
3550,80.0,0.590897051,171561
3560,80.0,0.592234336,172042
3570,80.0,0.593575176,172526
3580,80.0,0.595151474,173003
3590,80.0,0.596768463,173488
3600,80.0,0.598138143,173971
3610,80.0,0.599517699,174456
3620,80.0,0.601451527,174944
3630,79.0,0.604589505,175419
3640,79.0,0.605931926,175905
3650,81.0,0.607275137,176386
3660,79.0,0.608624274,176870
3670,79.0,0.610294991,177364
3680,79.0,0.611863387,177851
3690,81.0,0.613202648,178328
3700,81.0,0.614561661,178808
3710,82.0,0.617361861,179285
3720,82.0,0.618880479,179761
3730,82.0,0.620345764,180243
3740,82.0,0.62166132,180713
3750,82.0,0.623012432,181191
3760,82.0,0.624472581,181673
3770,83.0,0.62577431,182149
3780,83.0,0.627569077,182629
3790,82.0,0.630639894,183119
3800,82.0,0.633072686,183612
3810,82.0,0.634439206,184098
3820,82.0,0.63577333,184580
3830,82.0,0.637090862,185047
3840,83.0,0.638398517,185530
3850,82.0,0.639714469,186014
3860,82.0,0.641544001,186509
3870,82.0,0.64427704,186988
3880,83.0,0.645594967,187462
3890,83.0,0.647629537,187938
3900,83.0,0.649498575,188419
3910,82.0,0.651260552,188908
3920,82.0,0.652671713,189398
3930,82.0,0.655061048,189872
3940,82.0,0.656511716,190357
3950,82.0,0.659103323,190839
3960,82.0,0.660879522,191321
3970,83.0,0.662228264,191800
3980,84.0,0.663615722,192265
3990,84.0,0.66497039,192741
4000,85.0,0.666332169,193215
4010,84.0,0.667834984,193708
4020,84.0,0.670206541,194193
4030,84.0,0.672748371,194663
4040,87.0,0.674074199,195143
4050,84.0,0.675392521,195624
4060,84.0,0.677140275,196125
4070,87.0,0.678558943,196614
4080,87.0,0.680238747,197091
4090,85.0,0.681572476,197569
4100,86.0,0.68289791,198046
4110,85.0,0.685421566,198534
4120,84.0,0.686898308,199015
4130,85.0,0.688233223,199502
4140,85.0,0.689565373,199992
4150,84.0,0.691407547,200479
4160,85.0,0.692941178,200971
4170,85.0,0.694302562,201460
4180,84.0,0.695655254,201940
4190,84.0,0.69808449,202412
4200,85.0,0.699439552,202900
4210,85.0,0.700973183,203370
4220,85.0,0.70241674,203852
4230,85.0,0.703773778,204345
4240,85.0,0.705094471,204834
4250,85.0,0.706396201,205303
4260,85.0,0.707675412,205771
4270,85.0,0.710505636,206258
4280,84.0,0.711932995,206736
4290,85.0,0.713230774,207208
4300,84.0,0.714622972,207706
4310,85.0,0.715946825,208189
4320,84.0,0.717421197,208679
4330,85.0,0.718826828,209158
4340,84.0,0.720156606,209641
4350,84.0,0.723195818,210132
4360,84.0,0.7245414,210603
4370,84.0,0.725908315,211086
4380,86.0,0.727572712,211566
4390,86.0,0.728951478,212056
4400,85.0,0.73029548,212544
4410,85.0,0.731688074,213002
4420,85.0,0.733065655,213488
4430,86.0,0.735737855,213967
4440,86.0,0.737184178,214452
4450,85.0,0.73853055,214933
4460,86.0,0.739846501,215396
4470,87.0,0.741157317,215870
4480,87.0,0.74251317,216345
4490,85.0,0.743868233,216826
4500,85.0,0.74543584,217319
4510,85.0,0.748377077,217782
4520,87.0,0.749719893,218259
4530,86.0,0.751162659,218739
4540,86.0,0.752507845,219215
4550,85.0,0.753858563,219710
4560,86.0,0.755173329,220186
4570,83.0,0.756529972,220668
4580,84.0,0.757907948,221163
4590,84.0,0.760719605,221644
4600,86.0,0.762090076,222135
4610,84.0,0.763441978,222618
4620,83.0,0.764786769,223094
4630,85.0,0.766120498,223560
4640,85.0,0.7674645,224041
4650,85.0,0.769240304,224525
4660,84.0,0.770566132,225008
4670,86.0,0.773218184,225501
4680,85.0,0.774561,225986
4690,84.0,0.775905791,226468
4700,83.0,0.77819399,226948
4710,84.0,0.779528905,227427
4720,83.0,0.780880807,227917
4730,84.0,0.782227178,228410
4740,86.0,0.783673105,228908
4750,86.0,0.786046637,229376
4760,85.0,0.787455824,229852
4770,84.0,0.788788368,230333
4780,83.0,0.790109851,230817
4790,85.0,0.791468864,231296
4800,84.0,0.793095729,231785
4810,84.0,0.794414446,232261
4820,84.0,0.797395979,232750
4830,84.0,0.799871832,233227
4840,84.0,0.801231636,233707
4850,85.0,0.803333366,234195
4860,84.0,0.804822355,234668
4870,84.0,0.806209023,235153
4880,84.0,0.808133371,235639
4890,84.0,0.809556779,236101
4900,84.0,0.810888533,236577
4910,85.0,0.813326856,237060
4920,86.0,0.814879054,237545
4930,86.0,0.816241228,238022
4940,86.0,0.817968045,238504
4950,86.0,0.819637972,238984
4960,86.0,0.821129726,239468
4970,87.0,0.822838765,239958
4980,87.0,0.824294173,240438
4990,87.0,0.825890224,240920
5000,86.0,0.827471262,241389
