mean_fit_time,std_fit_time,mean_score_time,std_score_time,param_SVM__max_iter,params,split0_test_score,split1_test_score,split2_test_score,split3_test_score,split4_test_score,mean_test_score,std_test_score,rank_test_score,split0_train_score,split1_train_score,split2_train_score,split3_train_score,split4_train_score,mean_train_score,std_train_score
0.012497329711914062,0.006248664914177129,0.006248617172241211,0.007652961844276382,1,{'SVM__max_iter': 1},0.453125,0.415625,0.365625,0.375,0.30625,0.383125,0.04947379356790825,11,0.4234375,0.421875,0.421875,0.409375,0.29921875,0.39515625,0.04823647802752602
0.009372472763061523,0.007652591966373171,0.0,0.0,2,{'SVM__max_iter': 2},0.31875,0.359375,0.434375,0.428125,0.340625,0.37625,0.04675401052316261,12,0.30390625,0.41328125,0.44921875,0.4734375,0.33046875,0.3940625,0.06615780731516123
0.00937342643737793,0.00765337065552201,0.0,0.0,4,{'SVM__max_iter': 4},0.4,0.459375,0.484375,0.54375,0.459375,0.469375,0.04641019553934241,10,0.42421875,0.5203125,0.4703125,0.55,0.475,0.48796875,0.04344649187506399
0.01249542236328125,0.006247711181640625,0.0031246185302734376,0.006249237060546876,8,{'SVM__max_iter': 8},0.478125,0.58125,0.503125,0.51875,0.58125,0.5325,0.04186100512410088,9,0.5171875,0.6109375,0.55390625,0.58359375,0.6171875,0.5765625,0.03720259672556473
0.016925239562988283,0.007877139424083482,0.0015650749206542968,0.0031301498413085936,16,{'SVM__max_iter': 16},0.63125,0.634375,0.64375,0.621875,0.659375,0.638125,0.012716868718359909,8,0.6921875,0.68046875,0.6140625,0.665625,0.68046875,0.6665625000000001,0.027570045735816253
0.015623140335083007,8.58306884765625e-07,0.0124969482421875,0.006248474132010352,32,{'SVM__max_iter': 32},0.675,0.7125,0.684375,0.71875,0.70625,0.699375,0.01681703005884214,7,0.79140625,0.79375,0.78203125,0.7953125,0.7890625,0.7903125,0.004650898770667883
0.049988412857055665,0.011690041355424287,0.0,0.0,64,{'SVM__max_iter': 64},0.76875,0.79375,0.784375,0.803125,0.790625,0.788125,0.01142229180156064,6,0.93671875,0.92578125,0.921875,0.93359375,0.921875,0.92796875,0.006119736258614432
0.06873416900634766,0.007653078642078031,0.018745565414428712,0.006248641052988476,128,{'SVM__max_iter': 128},0.83125,0.86875,0.846875,0.871875,0.853125,0.854375,0.014869221566712873,5,0.99765625,0.99765625,0.99609375,0.99609375,0.996875,0.996875,0.0006987712429686943
0.10474343299865722,0.006513566409446439,0.020771169662475587,0.006543298007684167,256,{'SVM__max_iter': 256},0.84375,0.878125,0.859375,0.8875,0.865625,0.866875,0.01512964804613775,4,0.9984375,0.99765625,0.99609375,0.9984375,0.9984375,0.9978125,0.0009110862335695683
0.11312317848205566,0.023122312640532067,0.01785168647766113,0.00568634053687123,512,{'SVM__max_iter': 512},0.85,0.884375,0.865625,0.878125,0.8625,0.868125,0.012086924753633588,3,0.99921875,0.99765625,0.99609375,0.99765625,0.99921875,0.9979687500000001,0.0011692679333668732
0.09804949760437012,0.013006375291375083,0.01668848991394043,0.00829738731605379,1024,{'SVM__max_iter': 1024},0.853125,0.884375,0.865625,0.878125,0.865625,0.869375,0.010897247358851694,1,0.99921875,0.99765625,0.99609375,0.99765625,0.99921875,0.9979687500000001,0.0011692679333668732
0.09408278465270996,0.011758375523940623,0.01981778144836426,0.005851584488865159,2048,{'SVM__max_iter': 2048},0.853125,0.884375,0.865625,0.878125,0.865625,0.869375,0.010897247358851694,1,0.99921875,0.99765625,0.99609375,0.99765625,0.99921875,0.9979687500000001,0.0011692679333668732
