iterations,fitness,time,fevals
0,535.0,0.0142969,570
10,557.0,0.029372467,1053
20,548.0,0.043646454,1527
30,556.0,0.057889626,2009
40,550.0,0.075629886,2479
50,551.0,0.089741107,2961
60,553.0,0.105730848,3438
70,545.0,0.118331352,3930
80,547.0,0.130795954,4409
90,547.0,0.144066878,4885
100,548.0,0.156699382,5374
110,546.0,0.169211392,5847
120,547.0,0.181282513,6337
130,547.0,0.193479264,6818
140,549.0,0.206851719,7301
150,549.0,0.220756718,7783
160,543.0,0.235180828,8276
170,543.0,0.248610172,8768
180,541.0,0.263232208,9246
190,540.0,0.27569444,9735
200,543.0,0.288377116,10218
210,543.0,0.300766261,10699
220,541.0,0.313133283,11180
230,545.0,0.326606479,11661
240,543.0,0.340550984,12136
250,543.0,0.353285018,12611
260,545.0,0.36647851,13094
270,541.0,0.378854619,13587
280,543.0,0.392387864,14080
290,545.0,0.40573859,14571
300,543.0,0.41876023,15053
310,539.0,0.431348487,15545
320,539.0,0.444166275,16028
330,541.0,0.485316333,16516
340,541.0,0.499147455,16994
350,543.0,0.512921293,17497
360,541.0,0.527150243,17974
370,545.0,0.541417909,18443
380,539.0,0.553612289,18914
390,543.0,0.566756398,19393
400,543.0,0.580048656,19868
410,543.0,0.592502986,20346
420,541.0,0.605600873,20824
430,541.0,0.617356339,21302
440,543.0,0.630654127,21790
450,545.0,0.643406334,22280
460,543.0,0.656426788,22767
470,547.0,0.669548773,23254
480,547.0,0.685052983,23731
490,547.0,0.698465339,24222
500,547.0,0.711061497,24714
510,543.0,0.723625655,25194
520,547.0,0.736129369,25691
530,547.0,0.74810923,26181
540,545.0,0.761845537,26656
550,545.0,0.773921398,27134
560,549.0,0.786533359,27606
570,545.0,0.799377221,28093
580,545.0,0.812191453,28590
590,543.0,0.824446672,29071
600,543.0,0.837483719,29553
610,543.0,0.850550001,30026
620,545.0,0.863074653,30519
630,545.0,0.876630417,31006
640,539.0,0.890282971,31493
650,542.0,0.903552315,31987
660,547.0,0.919390747,32469
670,547.0,0.935533377,32945
680,543.0,0.948549091,33427
690,543.0,0.96099078,33909
700,543.0,0.973234148,34391
710,547.0,0.986988628,34874
720,549.0,1.000094416,35360
730,545.0,1.013243661,35847
740,545.0,1.026458881,36330
750,545.0,1.040965164,36822
760,545.0,1.054462459,37318
770,545.0,1.068135556,37798
780,545.0,1.080411319,38272
790,551.0,1.093751774,38753
800,551.0,1.106579834,39240
810,551.0,1.120957327,39713
820,549.0,1.132877139,40190
830,551.0,1.146439619,40672
840,553.0,1.158457801,41161
850,557.0,1.171366454,41639
860,557.0,1.206388309,42102
870,553.0,1.220363629,42579
880,555.0,1.234394257,43068
890,553.0,1.247850465,43545
900,557.0,1.259792796,44022
910,557.0,1.272582534,44505
920,561.0,1.285543729,44989
930,559.0,1.299464135,45471
940,563.0,1.310852588,45947
950,569.0,1.323709092,46431
960,567.0,1.336304855,46916
970,569.0,1.349474643,47402
980,567.0,1.362054209,47891
990,567.0,1.372656884,48375
1000,567.0,1.384400103,48858
1010,565.0,1.39739962,49342
1020,569.0,1.410282198,49840
1030,569.0,1.424283592,50317
1040,569.0,1.4361797,50803
1050,571.0,1.449295759,51287
1060,571.0,1.461155521,51770
1070,571.0,1.475145458,52248
1080,569.0,1.487968382,52731
1090,567.0,1.500488293,53226
1100,571.0,1.512560994,53716
1110,571.0,1.526081597,54196
1120,573.0,1.538436767,54678
1130,569.0,1.551234802,55161
1140,565.0,1.563323701,55643
1150,567.0,1.576726971,56124
1160,567.0,1.589397401,56619
1170,567.0,1.603126992,57102
1180,569.0,1.616674065,57572
1190,571.0,1.62947605,58048
1200,571.0,1.64275369,58513
1210,575.0,1.656709256,58991
1220,573.0,1.668422055,59464
1230,575.0,1.681958461,59942
1240,573.0,1.69576825,60417
1250,577.0,1.708682038,60902
1260,579.0,1.721261208,61390
1270,575.0,1.73365786,61887
1280,575.0,1.746745476,62370
1290,575.0,1.75880751,62844
1300,575.0,1.771072211,63316
1310,574.0,1.784352616,63789
1320,574.0,1.798202701,64266
1330,574.0,1.813365973,64760
1340,573.0,1.82630702,65242
1350,573.0,1.843466145,65728
1360,575.0,1.855766797,66213
1370,577.0,1.867613128,66696
1380,577.0,1.904695232,67172
1390,579.0,1.919059688,67655
1400,579.0,1.930967648,68127
1410,581.0,1.944363807,68617
1420,579.0,1.957765496,69089
1430,583.0,1.971902001,69569
1440,581.0,1.984999888,70053
1450,581.0,1.998071701,70547
1460,577.0,2.010584106,71037
1470,575.0,2.025757253,71512
1480,575.0,2.038356176,71991
1490,575.0,2.051570211,72464
1500,573.0,2.063260887,72951
1510,573.0,2.076580009,73431
1520,579.0,2.088444908,73905
1530,575.0,2.100836424,74386
1540,579.0,2.114306459,74866
1550,579.0,2.127884741,75351
1560,577.0,2.139894627,75829
1570,579.0,2.15169829,76312
1580,579.0,2.163792325,76796
1590,579.0,2.174748976,77275
1600,577.0,2.188004493,77766
1610,573.0,2.204209938,78253
1620,573.0,2.217132022,78738
1630,575.0,2.229777957,79220
1640,577.0,2.241966016,79695
1650,577.0,2.255185977,80192
1660,577.0,2.268182728,80679
1670,577.0,2.279930688,81155
1680,581.0,2.293347785,81631
1690,587.0,2.306012684,82118
1700,583.0,2.318971904,82602
1710,587.0,2.333257347,83094
1720,593.0,2.346602937,83566
1730,589.0,2.360066257,84056
1740,591.0,2.374817084,84539
1750,587.0,2.389456503,85019
1760,589.0,2.40125266,85495
1770,587.0,2.414752325,85971
1780,587.0,2.428475595,86460
1790,587.0,2.440362616,86948
1800,589.0,2.452345638,87435
1810,591.0,2.465049253,87917
1820,591.0,2.477871386,88387
1830,587.0,2.491064483,88880
1840,595.0,2.503626271,89357
1850,591.0,2.516454331,89838
1860,593.0,2.528776711,90333
1870,595.0,2.541077758,90812
1880,595.0,2.583078779,91300
1890,591.0,2.598264964,91795
1900,591.0,2.61422547,92276
1910,588.0,2.628451654,92774
1920,589.0,2.641264306,93258
1930,589.0,2.654144908,93736
1940,591.0,2.666464918,94232
1950,589.0,2.678545915,94715
1960,591.0,2.692162519,95194
1970,589.0,2.705610036,95672
1980,593.0,2.718489058,96144
1990,589.0,2.730613907,96624
2000,589.0,2.747171352,97108
2010,589.0,2.759965041,97592
2020,589.0,2.782946985,98069
2030,591.0,2.805617225,98544
2040,591.0,2.82860786,99031
2050,595.0,2.840858734,99517
2060,599.0,2.852460916,99998
2070,595.0,2.864296185,100483
2080,595.0,2.876254713,100966
2090,595.0,2.889375514,101460
2100,595.0,2.915630943,101939
2110,595.0,2.935555107,102412
2120,594.0,2.948641537,102900
2130,592.0,2.961509892,103380
2140,590.0,2.975877113,103854
2150,590.0,2.994579745,104352
2160,590.0,3.007990916,104839
2170,600.0,3.019841592,105323
2180,590.0,3.031953404,105802
2190,588.0,3.04791312,106281
2200,592.0,3.060755402,106770
2210,588.0,3.07529092,107251
2220,587.0,3.089600462,107735
2230,592.0,3.10398467,108208
2240,591.0,3.117940631,108689
2250,590.0,3.133889681,109172
2260,585.0,3.146009394,109648
2270,590.0,3.158035082,110141
2280,590.0,3.169445264,110616
2290,584.0,3.182651398,111093
2300,583.0,3.195725977,111572
2310,584.0,3.235804627,112059
2320,581.0,3.248087501,112536
2330,584.0,3.262025685,113013
2340,583.0,3.276781647,113481
2350,582.0,3.289630249,113970
2360,587.0,3.302133173,114447
2370,591.0,3.314605677,114935
2380,593.0,3.326691414,115421
2390,593.0,3.338505349,115903
2400,591.0,3.350860519,116372
2410,591.0,3.363688974,116863
2420,591.0,3.376592886,117361
2430,591.0,3.3887845,117836
2440,587.0,3.401416214,118308
2450,589.0,3.414327236,118794
2460,587.0,3.426872035,119282
2470,587.0,3.439694958,119771
2480,591.0,3.453217931,120250
2490,589.0,3.468062782,120734
2500,591.0,3.480816964,121207
2510,593.0,3.493761567,121689
2520,589.0,3.507587158,122174
2530,589.0,3.520792107,122651
2540,591.0,3.534636266,123144
2550,589.0,3.547682005,123628
2560,589.0,3.560312928,124124
2570,587.0,3.580437784,124608
2580,585.0,3.602406789,125094
2590,585.0,3.622143694,125584
2600,591.0,3.646505195,126058
2610,591.0,3.670719733,126551
2620,591.0,3.692179503,127036
2630,591.0,3.705183365,127526
2640,591.0,3.718670388,128010
2650,593.0,3.731871781,128489
2660,593.0,3.745455199,128968
2670,597.0,3.758029628,129434
2680,595.0,3.771439614,129920
2690,597.0,3.784034587,130390
2700,601.0,3.7960263,130871
2710,597.0,3.808210408,131347
2720,601.0,3.821775258,131824
2730,599.0,3.836028701,132311
2740,599.0,3.852697949,132800
2750,601.0,3.865734602,133283
2760,601.0,3.879613131,133761
2770,601.0,3.893479809,134247
2780,603.0,3.908022833,134743
2790,605.0,3.921767436,135224
2800,605.0,3.934910755,135710
2810,605.0,3.948864741,136196
2820,603.0,3.961709788,136680
2830,599.0,3.973753254,137162
2840,603.0,3.987655487,137642
2850,603.0,4.001189523,138110
2860,601.0,4.037743034,138594
2870,601.0,4.050473118,139078
2880,601.0,4.062794313,139561
2890,603.0,4.074897829,140040
2900,603.0,4.08754653,140534
2910,601.0,4.100024169,141019
2920,601.0,4.112954155,141501
2930,601.0,4.126419845,141988
2940,605.0,4.138507953,142473
2950,605.0,4.152422038,142949
2960,609.0,4.164326047,143427
2970,611.0,4.177344922,143911
2980,606.0,4.196384146,144398
2990,607.0,4.20908618,144878
3000,607.0,4.221487178,145363
