iteration,MSE_trg,MSE_val,MSE_tst,acc_trg,acc_val,acc_tst,f1_trg,f1_val,f1_tst,elapsed
0,0.203329639693,0.202555194606,0.203901753691,0.206568097811,0.204093234792,0.203274215553,0.223675059118,0.215246636771,0.218554861731,0.153876665
10,0.20718764215,0.205900976348,0.207229574053,0.202587432471,0.199545196134,0.198271941792,0.214535779303,0.205417607223,0.204781235904,1.603117909
20,0.21148285931,0.210250732708,0.211524154364,0.191356269548,0.188743604321,0.18826739427,0.19433427762,0.185037121645,0.185303514377,3.00661729
30,0.20025827185,0.198523663169,0.199349812755,0.221069092977,0.222853894258,0.214188267394,0.266434596332,0.263866451265,0.254529767041,4.361452139
40,0.191413141735,0.189597049295,0.190711100047,0.281774239409,0.288800454804,0.278308321965,0.357251908397,0.361408882083,0.351450756028,5.77940842
50,0.196916573854,0.195431375473,0.196362604586,0.248507250498,0.248436611711,0.24738517508,0.312613784135,0.307853403141,0.310129220509,7.145841895
60,0.19297157565,0.191476768776,0.192617952045,0.263150412283,0.262080727686,0.261937244202,0.332517707663,0.323958333333,0.327950310559,8.469584176
70,0.181685839337,0.179986343054,0.181556622408,0.321865226045,0.333712336555,0.322419281492,0.418008784773,0.428292682927,0.417513682565,10.005724847
80,0.17750030117,0.175668366061,0.177050714906,0.335513221496,0.349630471859,0.340609367894,0.441843802245,0.457305502846,0.446142093201,11.414313022
90,0.168065270395,0.165924527143,0.16797126096,0.365794711402,0.383740761796,0.363801728058,0.482782608696,0.500920810313,0.479344994418,12.70903286
100,0.164858669754,0.162699458182,0.164827152164,0.372618709127,0.395110858442,0.37289677126,0.49176551883,0.515482695811,0.490956072351,14.091782
110,0.162743834132,0.160489205395,0.162791205825,0.388683537105,0.408186469585,0.387903592542,0.507783882784,0.528318985048,0.505147058824,15.501821634
120,0.172384028131,0.170346641319,0.172635223199,0.362098379301,0.382603752132,0.362437471578,0.474897600936,0.497687326549,0.474512743628,16.871423506
130,0.151907926374,0.149964778425,0.152477496324,0.43702018766,0.45650938033,0.427921782628,0.563299514777,0.582532751092,0.55390070922,18.273337501
140,0.146648175884,0.144809665497,0.146860741581,0.444697185101,0.466742467311,0.443383356071,0.573394495413,0.594290657439,0.571728481456,19.653145406
150,0.137326150051,0.136179931816,0.138117355976,0.481802672732,0.500852757248,0.478854024557,0.611282926309,0.627650551315,0.607265250171,21.040827292
160,0.135375957013,0.134095094256,0.136448516458,0.489621836793,0.511654349062,0.482946793997,0.617841175218,0.638010956595,0.611282051282,22.514424902
170,0.130354607581,0.129724800385,0.131024628998,0.500426499858,0.512222853894,0.50022737608,0.629324894515,0.638888888889,0.629592180654,23.890888605
180,0.116347933806,0.114971873644,0.116821410701,0.592123969292,0.609437180216,0.589358799454,0.716641975309,0.730904817861,0.714511539678,25.291591341
190,0.10064173873,0.0992103739663,0.101269892091,0.697185100938,0.703808982376,0.68485675307,0.804335844204,0.808947561423,0.795031055901,26.697357586
200,0.0985190813706,0.0970812391833,0.0990825489249,0.704577765141,0.712905059693,0.68758526603,0.809007352941,0.81522136846,0.795839524517,28.195224646
210,0.0928061666977,0.0910669058765,0.0935195386331,0.736423087859,0.739624786811,0.722146430196,0.832399204484,0.835014409222,0.821813939924,29.62393333
220,0.0841756070132,0.0824207745951,0.0850186352322,0.764714245095,0.76918703809,0.7517053206,0.854017817765,0.856941508104,0.844974446337,31.036825707
230,0.0841175888216,0.0823431685818,0.0850331990901,0.765282911572,0.768618533258,0.755343337881,0.854113280905,0.856437389771,0.846723646724,32.404966246
240,0.0834992563324,0.0817993036835,0.0844504049175,0.770543076486,0.770892552587,0.758071850841,0.857922535211,0.85824832923,0.849035187287,33.796661965
250,0.0819205996688,0.0803256166658,0.0826367999561,0.776798407734,0.772598067084,0.766257389723,0.862135581314,0.859451862263,0.854802259887,35.224233263
260,0.0748297180152,0.0734737303787,0.0753198364826,0.81290872903,0.820352472996,0.81537062301,0.889225589226,0.893171061528,0.890566037736,36.576651516
270,0.0726674447573,0.0714499267822,0.0731499806682,0.819874893375,0.826037521319,0.825829922692,0.893520463905,0.896691424713,0.897015326701,37.951944654
280,0.0692258859743,0.0680145732195,0.0695387889212,0.84247938584,0.846503695281,0.851750795816,0.908156498674,0.909939959973,0.913665254237,39.33525044
290,0.0672579284795,0.0660211492788,0.0675698841007,0.849587716804,0.851620238772,0.856298317417,0.912634186623,0.913260219342,0.916534601162,40.65010422
300,0.063015013561,0.0614411569868,0.0635114812319,0.86607904464,0.865264354747,0.869940882219,0.924068998872,0.923076923077,0.926250644662,42.138479519
310,0.0616161576253,0.0601339562032,0.0622301581361,0.872903042366,0.875497441728,0.87266939518,0.928307939054,0.9292864062,0.928020565553,43.620296392
320,0.0574234423713,0.0561007561051,0.0583041574687,0.895081034973,0.901080159181,0.894952251023,0.942081305917,0.945248584015,0.942148760331,45.008734822
330,0.0554842587071,0.054050610371,0.0562781374381,0.900483366506,0.906196702672,0.899045020464,0.945423358802,0.948389114795,0.94474863116,46.372359009
340,0.0527703260635,0.0511396108662,0.053669004067,0.905032698322,0.911313246163,0.901773533424,0.948023653906,0.951371571072,0.946268656716,47.772821944
350,0.0508467681086,0.0492813048078,0.051506956618,0.907023030992,0.913587265492,0.904956798545,0.949025720966,0.952470293934,0.947945205479,49.15151617
360,0.0489199762483,0.0474205243406,0.0496166368134,0.909582030139,0.918703808982,0.907685311505,0.950804455446,0.955686396033,0.949789760079,50.553417919
370,0.0452275814919,0.0438846847108,0.0459370378212,0.921950526016,0.928368391131,0.919054115507,0.957504450809,0.960966542751,0.955896927651,51.943595414
380,0.0440880147531,0.042538027158,0.0447786265145,0.926926357691,0.93803297328,0.924965893588,0.96015503876,0.966159577771,0.95900621118,53.331562932
390,0.0409068116635,0.0394509287035,0.041507213786,0.937731020756,0.947697555429,0.93997271487,0.966203703704,0.971552257267,0.967439565861,54.779663631
400,0.0396910390038,0.0382918872788,0.0402144408715,0.938441853853,0.945992040932,0.94042746703,0.966581770472,0.970651838122,0.967694204686,56.131970873
410,0.0378658292601,0.0365512018442,0.0383225291471,0.936025021325,0.944286526435,0.93815370623,0.965347297089,0.969771745836,0.966518956179,57.482649671
420,0.0373874874828,0.0359450834541,0.0378760301672,0.937446687518,0.946560545765,0.93951796271,0.966091245376,0.970969734404,0.967233308697,58.874308646
430,0.0365621219694,0.0351239443702,0.0370456858666,0.937873187376,0.947129050597,0.93997271487,0.966340599245,0.971287434393,0.967487684729,60.222741119
440,0.0343078790449,0.0329717690973,0.0347114187603,0.94284901905,0.949403069926,0.942701227831,0.968947937587,0.972488408037,0.968904244817,61.587236815
450,0.033133019579,0.0320137463825,0.0335442243487,0.948251350583,0.956225127914,0.950886766712,0.971774193548,0.976064656512,0.973214285714,63.022624021
460,0.0326510302571,0.0314712346155,0.0329787641835,0.949246516918,0.956793632746,0.952705775352,0.972340590377,0.976382846489,0.974219137333,64.31334978
470,0.0305090346341,0.0295362516744,0.0309676612633,0.956212681262,0.961910176236,0.956343792633,0.975732745036,0.97888433659,0.97583081571,65.746850566
480,0.0289668565947,0.0280625662224,0.0295542043214,0.958060847313,0.963047185901,0.957253296953,0.976799056233,0.979527559055,0.976358148893,67.187789186
490,0.0280711098182,0.0271403545377,0.0286421876771,0.958771680409,0.963615690733,0.959072305593,0.977194086191,0.979848866499,0.977375565611,68.714422294
500,0.027374959277,0.026451644433,0.0279367467346,0.960477679841,0.963615690733,0.959527057754,0.978165252906,0.979848866499,0.977655033894,70.141189644
510,0.0269738500348,0.0260691844442,0.0275386020476,0.960051179983,0.964184195566,0.959072305593,0.977924424542,0.980169971671,0.977386934673,71.510377098
520,0.0244225597852,0.0236153703579,0.0250151014435,0.964031845323,0.969300739056,0.962710322874,0.980177074356,0.983050847458,0.979469203806,72.914658305
530,0.022781601186,0.0220415595488,0.0232372959014,0.964316178561,0.970437748721,0.964074579354,0.980352250489,0.983699059561,0.980225281602,74.33550091
540,0.0222450186197,0.0215393486264,0.0226897871087,0.965169178277,0.971006253553,0.965893587995,0.980836918264,0.984027560288,0.981254686328,75.748967311
550,0.0217649838731,0.0210879930494,0.0222281981871,0.966306511231,0.971006253553,0.965893587995,0.9814481409,0.984017549358,0.981254686328,77.187516201
560,0.0216074389174,0.0209230748013,0.0220785805762,0.96644867785,0.971006253553,0.966348340155,0.981527864746,0.984017549358,0.9815,78.545721719
570,0.0216669492055,0.0209222008452,0.0220862968794,0.964316178561,0.971006253553,0.964529331514,0.980358400501,0.984017549358,0.98048048048,79.995166026
580,0.0210103087787,0.0203311170296,0.0214805355223,0.965595678135,0.971574758385,0.966348340155,0.981081926204,0.984355444305,0.981509245377,81.403166346
590,0.0203215201346,0.0196830006039,0.0208149699049,0.96644867785,0.972143263218,0.966348340155,0.981553853369,0.98467313106,0.981527708437,82.965999777
600,0.0194695539906,0.0188983258315,0.0198943272974,0.966733011089,0.971574758385,0.967712596635,0.981693005789,0.984355444305,0.982263302523,84.525046937
610,0.019761218707,0.0192188592973,0.0202105924809,0.966306511231,0.970437748721,0.965438835834,0.981456850012,0.983709273183,0.980990495248,85.894851478
620,0.017646734126,0.0175815077814,0.0178712008323,0.973699175434,0.969869243889,0.972714870396,0.985390507779,0.983264919482,0.984879032258,87.332556121
630,0.017119095028,0.0170530144262,0.0174153189678,0.974694341769,0.971006253553,0.972714870396,0.985953282828,0.983926883076,0.984901862104,88.871875461
640,0.0170325356716,0.0169791617444,0.0172929827925,0.974267841911,0.971574758385,0.972714870396,0.985724426217,0.984256926952,0.98490945674,90.42662948
650,0.017277379167,0.01724987218,0.0175592342367,0.973983508672,0.973848777715,0.972714870396,0.985582604585,0.985543683218,0.984924623116,91.802962025
660,0.016530812179,0.0165650623067,0.0168244167717,0.973983508672,0.972143263218,0.971805366075,0.985575786238,0.984586347908,0.984414278532,93.118243655
670,0.0165185894358,0.0165640217739,0.0169127337111,0.975263008246,0.97271176805,0.972714870396,0.986312146004,0.984915147706,0.984939759036,94.486208783
680,0.0158622232872,0.01588020457,0.0161219574274,0.975973841342,0.973848777715,0.973624374716,0.986687672312,0.985543683218,0.985434455048,95.856341619
690,0.0151756032575,0.0152042415454,0.0154986391638,0.974267841911,0.972143263218,0.973169622556,0.985726677707,0.984586347908,0.985172153807,97.237123351
700,0.0148457383545,0.0148792590351,0.015143307049,0.974267841911,0.971006253553,0.974079126876,0.985726677707,0.983957219251,0.985674792661,98.605772729
710,0.0145859594872,0.0146012502819,0.0148616964316,0.975263008246,0.97271176805,0.974079126876,0.986271106202,0.984886649874,0.985660377358,99.930810814
720,0.0142227994447,0.0143556555193,0.0145394257622,0.974836508388,0.972143263218,0.973624374716,0.986035502959,0.984586347908,0.985412474849,101.31486998
730,0.0140733852168,0.0142930264391,0.0144844600446,0.976542507819,0.973280272882,0.975443383356,0.986996611238,0.985215476565,0.986418511066,102.671854361
740,0.0138077847247,0.0140235691904,0.0142176838254,0.976542507819,0.973280272882,0.974988631196,0.986996611238,0.985215476565,0.986163522013,104.030410691
750,0.0137978941227,0.0140442865319,0.0139617740943,0.975973841342,0.973280272882,0.974988631196,0.986666666667,0.985196850394,0.98614260519,105.370907949
760,0.0135491748695,0.0138150054083,0.0137178869315,0.975831674723,0.973280272882,0.974533879036,0.986588829284,0.985196850394,0.985887096774,106.82220549
770,0.0132923267399,0.013639206698,0.013631484274,0.975547341484,0.971574758385,0.975443383356,0.98646521876,0.98427672956,0.986452584044,108.337032957
780,0.0131680683073,0.0135155180539,0.0134349915576,0.976258174581,0.971006253553,0.974988631196,0.986863840164,0.98397737983,0.986212083229,109.685589085
790,0.0127941811103,0.0132156941408,0.0129987150767,0.975831674723,0.972143263218,0.974988631196,0.986601513241,0.984576644633,0.986170480262,111.164935636
800,0.0125859045626,0.0129200840309,0.0128321983719,0.9764003412,0.974417282547,0.975443383356,0.986918833727,0.985835694051,0.986418511066,112.661670843
810,0.012306263092,0.0126688090286,0.0124387759978,0.977395507535,0.974985787379,0.976352887676,0.987437781465,0.986119873817,0.986875315497,114.093822098
820,0.0120126010007,0.0124026106187,0.0122118697426,0.977679840773,0.973848777715,0.976352887676,0.987605589327,0.985498108449,0.98689516129,115.501442765
830,0.0120116983636,0.0123952589248,0.0122110472622,0.977679840773,0.973848777715,0.976352887676,0.987605589327,0.985498108449,0.98689516129,116.862094508
840,0.0114076888912,0.0117475569246,0.0115729500535,0.977111174296,0.97271176805,0.974533879036,0.987295825771,0.984877126654,0.985894206549,118.227033862
850,0.0113581064837,0.0116854528004,0.011526387105,0.976969007677,0.973280272882,0.975443383356,0.9872199432,0.985187519697,0.986397984887,119.651410298
860,0.0111593993658,0.0115059865058,0.0112115668976,0.976258174581,0.973848777715,0.974079126876,0.986803634927,0.985470625395,0.985609694522,120.978289373
870,0.0110578645951,0.0113578993243,0.0110608099743,0.976542507819,0.974417282547,0.974988631196,0.98695342769,0.985781990521,0.98610760293,122.361512195
880,0.0107506736912,0.011144280928,0.0108166499362,0.977395507535,0.974417282547,0.975443383356,0.987443733712,0.985790969372,0.986363636364,123.703889945
890,0.0103802432061,0.0106698857496,0.0105008769733,0.977964174012,0.974985787379,0.976352887676,0.987773132445,0.9861373661,0.986888552698,125.066140502
900,0.00953840444143,0.00983276707252,0.00954074235989,0.981091839636,0.979533826038,0.981355161437,0.989508558807,0.988650693569,0.989680342311,126.50989868
910,0.0095114612724,0.00979687922171,0.00948380695361,0.980949673017,0.979533826038,0.981355161437,0.989427173742,0.988650693569,0.989680342311,127.897467975
920,0.00938992631024,0.00965002248441,0.00926800626311,0.980807506397,0.979533826038,0.982719417917,0.989345750138,0.988657844991,0.990437845999,129.227714161
930,0.00921769125216,0.00947641823237,0.00911559387177,0.981376172875,0.98010233087,0.983174170077,0.98965816689,0.988969429562,0.990682447746,130.595826649
940,0.00920122091357,0.0094622892877,0.00910206957371,0.981376172875,0.98010233087,0.982719417917,0.98965816689,0.988969429562,0.990428211587,131.97684305
950,0.0091832703922,0.00946116301705,0.00908615954955,0.981376172875,0.98010233087,0.983628922237,0.98965816689,0.988969429562,0.990931989924,133.400521016
960,0.00934926339804,0.00953279249251,0.00909360506648,0.98038100654,0.979533826038,0.983174170077,0.989106409852,0.988657844991,0.990677752583,134.832838987
970,0.00884624105197,0.00911417151569,0.0087126767593,0.982797839067,0.98010233087,0.984538426558,0.990447619799,0.988969429562,0.991431451613,136.279270156
980,0.00889189894418,0.00878413679942,0.00858780205718,0.982513505829,0.980670835702,0.985447930878,0.990275911139,0.989267676768,0.991927346115,137.664518855
990,0.00866429706631,0.00880920800752,0.00855390693022,0.982087005971,0.980670835702,0.984538426558,0.990058387249,0.989287964713,0.991440080564,138.982116737
1000,0.00850842938393,0.00867118956308,0.00832997746495,0.982940005687,0.98010233087,0.983628922237,0.990521327014,0.988969429562,0.990927419355,140.343491046
1010,0.00830420166557,0.00806533773431,0.00779627598519,0.982940005687,0.981807845367,0.984083674397,0.990485252141,0.989867004433,0.991136996708,141.82369804
1020,0.00791593405344,0.00777687767742,0.00749926501356,0.984077338641,0.982376350199,0.984538426558,0.991130820399,0.990186767965,0.991405460061,143.273296419
1030,0.0076072599488,0.00750861886962,0.00726992177258,0.984503838499,0.983513359864,0.985447930878,0.991375899992,0.990831489093,0.991911021234,144.660134849
1040,0.00683728895583,0.00686531803793,0.00668585564312,0.986778504407,0.985787379193,0.987266939518,0.99265344814,0.992111076049,0.992932862191,146.045586612
1050,0.00726963521105,0.00729650611239,0.00702774626773,0.985499004834,0.984650369528,0.985902683038,0.991949486977,0.991485335856,0.992181588903,147.393608222
1060,0.00669925405229,0.00673248977676,0.00656868103589,0.987205004265,0.985787379193,0.987266939518,0.992890995261,0.992111076049,0.992932862191,148.771628472
1070,0.00722693983816,0.00722901372438,0.00700138373427,0.985925504691,0.984650369528,0.985447930878,0.9921844162,0.991485335856,0.991927346115,150.236300838
1080,0.00661074628088,0.0066286162472,0.00650850011865,0.987205004265,0.985787379193,0.987721691678,0.992890995261,0.992111076049,0.993186979561,151.531301959
1090,0.00650424729744,0.00654638489667,0.00648716176719,0.987347170884,0.985787379193,0.987721691678,0.992967206638,0.992106094095,0.993186979561,152.90754917
1100,0.00641790426338,0.00645605781638,0.00642048628567,0.987489337504,0.985787379193,0.988176443838,0.993046776233,0.992106094095,0.993440968718,154.286771989
1110,0.00640360944034,0.00643631568538,0.00643130019052,0.987489337504,0.985787379193,0.988176443838,0.993047874862,0.992111076049,0.993440968718,155.61902667
1120,0.00653177732647,0.00654673371851,0.00653395676375,0.987489337504,0.98521887436,0.988176443838,0.993047874862,0.991792929293,0.993440968718,157.006293346
1130,0.00662557723938,0.00673541722916,0.00692662281618,0.986636337788,0.985787379193,0.984993178718,0.992583241281,0.992130941139,0.991689750693,158.351232682
1140,0.00606405648232,0.00593800892206,0.00603199485919,0.9882001706,0.988629903354,0.988176443838,0.993439253814,0.993682880606,0.993437657749,159.743355064
1150,0.00606655648682,0.00590893652781,0.00603410779367,0.988342337219,0.988629903354,0.988631195998,0.993517786561,0.993682880606,0.993688462509,161.201634145
1160,0.00604615673846,0.00586609763409,0.00600693123878,0.988342337219,0.988629903354,0.988631195998,0.993517786561,0.993682880606,0.993688462509,162.603688783
1170,0.00604438603793,0.00588942580292,0.00601229773486,0.988342337219,0.988629903354,0.988631195998,0.993517786561,0.993682880606,0.993688462509,163.901243585
1180,0.00606026638451,0.00589703039576,0.00601561072208,0.9882001706,0.988629903354,0.988631195998,0.99343821646,0.993682880606,0.993688462509,165.489960692
1190,0.00557863462291,0.00553204339628,0.00569152420944,0.988911003696,0.989198408186,0.989085948158,0.993836915297,0.994004417797,0.993945509586,166.811284007
1200,0.00555615702815,0.00553969051077,0.00569080223048,0.989337503554,0.989198408186,0.989085948158,0.994076297291,0.994004417797,0.993945509586,168.204921453
1210,0.00546902131933,0.00542917269812,0.00560138271568,0.989195336935,0.989766913019,0.989085948158,0.993996840442,0.994321766562,0.993945509586,169.545272534
1220,0.00543401336336,0.00539825579089,0.00557935690775,0.989195336935,0.989766913019,0.989085948158,0.993996840442,0.994321766562,0.993945509586,170.930658715
1230,0.00530522207596,0.00520358814393,0.0054137579963,0.989621836793,0.989766913019,0.990904956799,0.994232440547,0.994321766562,0.994949494949,172.326331523
1240,0.00523405367658,0.00508130976464,0.0053340710096,0.989621836793,0.989766913019,0.990904956799,0.99423152904,0.994318181818,0.994949494949,173.703759179
1250,0.00524266078144,0.00507795685122,0.00534419473221,0.989764003412,0.989766913019,0.990904956799,0.994310099573,0.994318181818,0.994949494949,175.121066768
1260,0.00520266244097,0.00503554341324,0.00529325938194,0.989764003412,0.989766913019,0.990904956799,0.994310099573,0.994318181818,0.994949494949,176.541400534
1270,0.00515917228162,0.00496038111848,0.00524047463856,0.989764003412,0.989766913019,0.990904956799,0.994310099573,0.994318181818,0.994949494949,177.893340764
1280,0.00507952340689,0.00484907457919,0.00519721204454,0.990332669889,0.990903922683,0.990904956799,0.994627054362,0.994949494949,0.994949494949,179.201260414
1290,0.00507551862675,0.00483995842664,0.00519214682297,0.990474836508,0.990903922683,0.990904956799,0.994704813088,0.994949494949,0.994949494949,180.796349081
1300,0.00510268286906,0.00485454514429,0.00523974333477,0.990332669889,0.990903922683,0.990904956799,0.994626205153,0.994949494949,0.994949494949,182.131891076
1310,0.00501443005109,0.00476594243163,0.00516881727273,0.990474836508,0.991472427516,0.990904956799,0.994704813088,0.995263656457,0.994949494949,183.378335122
1320,0.00494907107915,0.0046828038866,0.00509111803098,0.990474836508,0.991472427516,0.990904956799,0.994704813088,0.995263656457,0.994949494949,184.577545947
1330,0.00466812356482,0.00429823297968,0.00459644629594,0.990901336366,0.993177942013,0.991814461119,0.994940711462,0.996207332491,0.99545224861,185.740984695
1340,0.00465736881308,0.00428433195271,0.00458134490484,0.990901336366,0.993177942013,0.991814461119,0.994940711462,0.996207332491,0.99545224861,186.888699576
1350,0.00463223613937,0.00425420067491,0.00456820816887,0.990901336366,0.993177942013,0.991814461119,0.994940711462,0.996207332491,0.99545224861,188.141236665
1360,0.00462955378983,0.00425116154687,0.00456939984618,0.990901336366,0.993177942013,0.991814461119,0.994940711462,0.996207332491,0.99545224861,189.271762794
1370,0.00460860996762,0.00422955281567,0.00455568797205,0.990901336366,0.993177942013,0.991814461119,0.994940711462,0.996207332491,0.99545224861,190.395255236
1380,0.00454436161165,0.00412405571373,0.00448593080051,0.990759169747,0.993177942013,0.991814461119,0.994861253854,0.996207332491,0.99545224861,191.54429318
1390,0.00449687226985,0.00405148937517,0.00441169009355,0.991185669605,0.993177942013,0.991814461119,0.995098814229,0.996207332491,0.99545224861,192.685020206
1400,0.0044290977055,0.0040001900492,0.00437735443641,0.991327836224,0.993177942013,0.991814461119,0.995178246779,0.996207332491,0.99545224861,193.837851537
1410,0.00443733822713,0.003990759127,0.00440265162987,0.991327836224,0.993177942013,0.991814461119,0.995178246779,0.996207332491,0.99545224861,194.959320867
1420,0.00442506730211,0.00399176908379,0.00436561105754,0.991327836224,0.993177942013,0.991814461119,0.995178246779,0.996207332491,0.99545224861,196.146912522
1430,0.00440010935455,0.00396151213579,0.00434800203711,0.991327836224,0.993177942013,0.991814461119,0.995178246779,0.996207332491,0.99545224861,197.337607784
1440,0.0042268213434,0.00371588766017,0.00413270172029,0.991327836224,0.993177942013,0.991814461119,0.995176721752,0.996207332491,0.995447647951,198.485364542
1450,0.00410664553948,0.00357517201751,0.00402376707399,0.991896502701,0.993746446845,0.991814461119,0.995492289442,0.996522288966,0.995447647951,199.638666392
1460,0.00407221910382,0.00352830433624,0.00399706915148,0.99203866932,0.994314951677,0.991814461119,0.995571722284,0.996837444655,0.995447647951,200.802658617
1470,0.0042875330371,0.0036985827749,0.00419570732294,0.991327836224,0.993177942013,0.991359708959,0.995175958877,0.996202531646,0.995195954488,201.934922626
1480,0.00409052171128,0.00354283656492,0.00400506955482,0.991612169463,0.994314951677,0.991814461119,0.995333386063,0.996837444655,0.995447647951,203.063138037
1490,0.00402562693594,0.00346714503847,0.00390575571263,0.99218083594,0.993746446845,0.991814461119,0.995651142563,0.996522288966,0.995447647951,204.194833548
1500,0.0039744899326,0.00361729118014,0.0039655050356,0.992465169178,0.993746446845,0.992723965439,0.99580994545,0.996522288966,0.995955510617,205.32301103
1510,0.00395593481667,0.00358433685632,0.00395690222118,0.992465169178,0.993746446845,0.992723965439,0.99580994545,0.996522288966,0.995955510617,206.534272827
1520,0.00395044007251,0.00358175750748,0.00395328744484,0.992465169178,0.993746446845,0.992723965439,0.99580994545,0.996522288966,0.995955510617,207.685337045
1530,0.00393687864992,0.00354558762398,0.00392843958409,0.992465169178,0.993746446845,0.992723965439,0.99580994545,0.996522288966,0.995955510617,208.901592426
1540,0.00387833245596,0.00341832852861,0.00382926805241,0.99218083594,0.993746446845,0.992269213279,0.995651830184,0.996522288966,0.995701643489,210.07881568
1550,0.00385558579015,0.00338873172986,0.00382721608592,0.992323002559,0.993746446845,0.991814461119,0.995731225296,0.996522288966,0.995449949444,211.157412878
1560,0.00382410326164,0.00333929094683,0.00376902788839,0.992323002559,0.993746446845,0.992723965439,0.995731225296,0.996522288966,0.995955510617,212.295059603
1570,0.00380587880495,0.00332044957936,0.00375924932861,0.992465169178,0.993746446845,0.992269213279,0.99580994545,0.996522288966,0.995701643489,213.442718387
1580,0.00377408124514,0.00329075743459,0.00373662546101,0.992323002559,0.993746446845,0.992269213279,0.995731225296,0.996522288966,0.995701643489,214.563443025
1590,0.00376088465514,0.00327833260666,0.00375416439689,0.99218083594,0.993746446845,0.991814461119,0.995651830184,0.996522288966,0.995447647951,215.653191243
1600,0.00376725402029,0.00328928294501,0.00376302016268,0.992323002559,0.993746446845,0.991814461119,0.995730550285,0.996522288966,0.995447647951,216.744842475
1610,0.00377830825534,0.00333009216553,0.00376540489531,0.992607335798,0.993177942013,0.991359708959,0.995888678052,0.996204933586,0.995195954488,217.932535265
1620,0.0037312745259,0.00328972189163,0.00372380869824,0.992465169178,0.993177942013,0.991814461119,0.995809282834,0.996204933586,0.995447647951,219.035622751
1630,0.00365260904081,0.00317073734051,0.00361210161261,0.992607335798,0.994314951677,0.992269213279,0.995888027835,0.996835443038,0.995699468758,220.21790398
1640,0.00360621939942,0.0031042796754,0.0035273083103,0.992607335798,0.994883456509,0.992269213279,0.995888027835,0.997150997151,0.995699468758,221.390167626
1650,0.00358363598376,0.0031174653076,0.00349672391243,0.992607335798,0.994314951677,0.992723965439,0.995888678052,0.996835443038,0.995953464846,222.521318349
1660,0.00350423907316,0.00302426023496,0.0033979525195,0.992891669036,0.994883456509,0.992723965439,0.99604618061,0.997150997151,0.995953464846,223.675171311
1670,0.00345987118191,0.00298211622574,0.00337472922428,0.992891669036,0.994883456509,0.992723965439,0.996046805819,0.997150997151,0.995953464846,224.796386618
1680,0.00343454090856,0.00297016696095,0.00336775079437,0.992891669036,0.994883456509,0.992723965439,0.996046805819,0.997150997151,0.995953464846,225.982300443
1690,0.00342263224264,0.00295724696069,0.00336830638072,0.992891669036,0.994883456509,0.992269213279,0.996046805819,0.997150997151,0.995699468758,227.09985629
1700,0.00341846622427,0.00294692806038,0.00337395450909,0.993033835655,0.995451961342,0.992269213279,0.996126175982,0.99746835443,0.995699468758,228.181359961
1710,0.00339508120116,0.00291699233142,0.00333822621109,0.993176002275,0.995451961342,0.992269213279,0.996204933586,0.99746835443,0.995699468758,229.326811532
1720,0.00338745247304,0.00291218980301,0.00333203588188,0.993176002275,0.995451961342,0.992269213279,0.996204933586,0.99746835443,0.995699468758,230.43043117
1730,0.00336369517506,0.00288662696714,0.00328709275133,0.993176002275,0.994883456509,0.992269213279,0.996204933586,0.997150997151,0.995699468758,231.527256531
1740,0.00332140786883,0.00284306231405,0.00325218771096,0.993176002275,0.995451961342,0.992269213279,0.996204933586,0.99746835443,0.995699468758,232.697888961
1750,0.00331540072821,0.00284606490145,0.00323357734568,0.993176002275,0.995451961342,0.993178717599,0.996204933586,0.99746835443,0.996207332491,233.808948409
1760,0.00332361557822,0.00284354301666,0.00325394507721,0.993318168894,0.995451961342,0.992269213279,0.996283703645,0.99746835443,0.995699468758,234.928626923
1770,0.00326441863485,0.00277647382684,0.00316258968635,0.993318168894,0.995451961342,0.992723965439,0.996283703645,0.99746835443,0.995951417004,236.123185891
1780,0.00325537539255,0.00276839712967,0.00316447563986,0.993318168894,0.995451961342,0.992723965439,0.996283703645,0.99746835443,0.995951417004,237.239057586
1790,0.0032072741195,0.00270780494816,0.00310583635158,0.993318168894,0.995451961342,0.993633469759,0.996283703645,0.99746835443,0.996457489879,238.340321862
1800,0.00319390407413,0.00269029341471,0.00309402044425,0.993318168894,0.995451961342,0.993178717599,0.996283703645,0.99746835443,0.996203492787,239.457746154
1810,0.00319620774025,0.00269647523319,0.00310833945264,0.993318168894,0.995451961342,0.992723965439,0.996283703645,0.99746835443,0.995951417004,240.74413927
1820,0.00312086904799,0.00259836200542,0.00302636521878,0.993460335513,0.995451961342,0.993178717599,0.996362486162,0.99746835443,0.996203492787,241.866294823
1830,0.00307739177952,0.00254972777041,0.00295614074822,0.993460335513,0.995451961342,0.994088221919,0.996362486162,0.99746835443,0.996708027349,243.114436846
1840,0.00304540579327,0.00250960963877,0.00291185253172,0.993744668752,0.995451961342,0.994542974079,0.99652008858,0.99746835443,0.996960486322,244.221656683
1850,0.00303720864364,0.0025238243508,0.00292336745262,0.993886835371,0.995451961342,0.994542974079,0.996598908487,0.99746835443,0.996960486322,245.290796884
1860,0.00301932627889,0.00250702477451,0.00294049635088,0.993602502132,0.995451961342,0.994088221919,0.996441281139,0.99746835443,0.996708027349,246.366809195
1870,0.00298362963953,0.00248696529814,0.00289907920539,0.993602502132,0.995451961342,0.994088221919,0.996441281139,0.99746835443,0.996708027349,247.428721738
1880,0.00303512249107,0.0025452719586,0.00292886890069,0.993460335513,0.995451961342,0.993633469759,0.996362486162,0.99746835443,0.996455696203,248.49333295
1890,0.00295010904276,0.0024553008619,0.00282224377225,0.994455501848,0.996020466174,0.994542974079,0.996914312841,0.997784108895,0.996960486322,249.510834595
1900,0.00287096790193,0.00239890835283,0.00272437970548,0.99417116861,0.996020466174,0.994542974079,0.996756585713,0.997784108895,0.996960486322,250.507532666
1910,0.0028406344227,0.00239293548222,0.00267924894036,0.994597668467,0.996020466174,0.994542974079,0.996993195126,0.997784108895,0.996960486322,251.573227533
1920,0.00282077227103,0.00239961306254,0.00263133977318,0.994882001706,0.996020466174,0.994542974079,0.997151448014,0.997784108895,0.996960486322,252.621503322
1930,0.00279684367228,0.00239591347332,0.00264355330244,0.995024168325,0.995451961342,0.994542974079,0.997230355306,0.997466751108,0.996960486322,253.645139884
1940,0.0027721454031,0.00234353167269,0.00259442971579,0.994882001706,0.996020466174,0.994997726239,0.997151448014,0.997784108895,0.99721448468,254.662680245
1950,0.00268607758942,0.00228388362588,0.00250702647742,0.994882001706,0.995451961342,0.994997726239,0.997150997151,0.997466751108,0.99721307322,255.743453049
1960,0.00267283507693,0.00225615862543,0.00249150766543,0.994739835087,0.996020466174,0.994997726239,0.997072089895,0.997784108895,0.99721307322,256.781543745
1970,0.00266640081983,0.00224113996261,0.00248078303314,0.994739835087,0.996020466174,0.994542974079,0.997072089895,0.997784108895,0.996960486322,257.965602755
1980,0.0026766433116,0.00224793815599,0.00247925866827,0.994882001706,0.996020466174,0.994997726239,0.997150997151,0.997784108895,0.99721448468,258.991267961
1990,0.00264621286322,0.00221177996293,0.00243995296544,0.994882001706,0.996588971006,0.994542974079,0.997151448014,0.998100063331,0.996960486322,260.030445868
2000,0.00263244351725,0.00220594999385,0.00242528347137,0.994882001706,0.996588971006,0.994542974079,0.997151448014,0.998100063331,0.996960486322,261.104802865
2010,0.0026484787255,0.00219313616602,0.00242968735227,0.995024168325,0.996588971006,0.994997726239,0.997230355306,0.998100063331,0.99721307322,262.175384651
2020,0.00261624509741,0.00218727060915,0.00243203099753,0.994882001706,0.996588971006,0.994997726239,0.997150997151,0.998100063331,0.99721307322,263.384130695
2030,0.00259939694512,0.00217665080433,0.00241203142758,0.994882001706,0.996588971006,0.994997726239,0.997150997151,0.998100063331,0.99721307322,264.411298717
2040,0.00260809507005,0.0021741729609,0.0024146450477,0.994882001706,0.996588971006,0.994997726239,0.997150997151,0.998100063331,0.99721307322,265.458517717
2050,0.00259796433442,0.00217448286351,0.00241233152336,0.994882001706,0.996588971006,0.994997726239,0.997150997151,0.998100063331,0.99721307322,266.512750252
2060,0.00259691527271,0.00217317910012,0.00241189559051,0.994882001706,0.996588971006,0.994997726239,0.997150997151,0.998100063331,0.99721307322,267.554693593
2070,0.0025583137639,0.00216991521444,0.00236542972504,0.994882001706,0.996020466174,0.995452478399,0.997151448014,0.997784108895,0.997467071935,268.574839782
2080,0.00253968614039,0.00214864239516,0.00234673384591,0.994882001706,0.996588971006,0.995452478399,0.997151448014,0.998100063331,0.997467071935,269.610246427
2090,0.00252704705059,0.00213290831628,0.00233435819074,0.994882001706,0.996588971006,0.995452478399,0.997151448014,0.998100063331,0.997467071935,270.776685672
2100,0.00252643866592,0.00213270293303,0.00233369690383,0.994882001706,0.996588971006,0.995452478399,0.997151448014,0.998100063331,0.997467071935,271.823253214
2110,0.00252590449544,0.00213112106393,0.00234044366519,0.994882001706,0.996588971006,0.995452478399,0.997151448014,0.998100063331,0.997467071935,272.901963004
2120,0.00248083464575,0.0020977557686,0.00226710434377,0.995024168325,0.996588971006,0.995452478399,0.997229916898,0.998100063331,0.99746578814,273.945586939
2130,0.00242770896975,0.00204207886841,0.0022341269926,0.995024168325,0.996588971006,0.995452478399,0.997229916898,0.998100063331,0.99746578814,274.997539969
2140,0.00237845023341,0.00200025507996,0.00222511285765,0.995024168325,0.996588971006,0.995452478399,0.997229916898,0.998100063331,0.99746578814,276.097700048
2150,0.0023979680464,0.00197555678044,0.00222916973325,0.995024168325,0.996588971006,0.995452478399,0.997229916898,0.998100063331,0.99746578814,277.156031353
2160,0.00234949116154,0.0019305872426,0.00221492294217,0.995308501564,0.996588971006,0.995452478399,0.997387380255,0.998100063331,0.99746578814,278.219834267
2170,0.00233770980811,0.00194302033741,0.00219355283908,0.995024168325,0.996588971006,0.995452478399,0.99722947835,0.998100063331,0.99746578814,279.263361018
2180,0.00232128219491,0.00192935639308,0.00218918640432,0.995308501564,0.996588971006,0.995452478399,0.997387380255,0.998100063331,0.99746578814,280.288182765
2190,0.00232173835684,0.001929863159,0.00219047378122,0.995308501564,0.996588971006,0.995452478399,0.997387380255,0.998100063331,0.99746578814,281.296735858
2200,0.00223485551204,0.00187168128291,0.00213806801795,0.995450668183,0.996588971006,0.995452478399,0.997466751108,0.998100063331,0.99746578814,282.323662499
2210,0.00222480612856,0.00186527548429,0.00214187433804,0.995592834802,0.996588971006,0.995452478399,0.997545720846,0.998100063331,0.99746578814,283.362969197
2220,0.00235276741948,0.00202614881653,0.00227112052522,0.995166334945,0.996588971006,0.995452478399,0.997309275087,0.998100063331,0.997467071935,284.374048318
2230,0.0022112946951,0.00185559005896,0.00214419684446,0.995592834802,0.996588971006,0.995452478399,0.997545720846,0.998100063331,0.99746578814,285.392343642
2240,0.00217838529557,0.00182284400907,0.00210856012413,0.995877168041,0.996588971006,0.995452478399,0.997703697838,0.998100063331,0.99746578814,286.484088899
2250,0.00218783877352,0.00181907475179,0.00212257161235,0.995877168041,0.996588971006,0.995452478399,0.997703697838,0.998100063331,0.99746578814,287.546270481
2260,0.00218084641764,0.00182314003446,0.0020985800205,0.995735001422,0.996588971006,0.995907230559,0.997624326893,0.998100063331,0.997718631179,288.548525102
2270,0.00215984659097,0.00181357422447,0.00209406427144,0.995877168041,0.996588971006,0.995452478399,0.997703334125,0.998100063331,0.99746578814,289.590294618
2280,0.00224655954658,0.00188693191017,0.00215625451259,0.995592834802,0.996588971006,0.994997726239,0.997545332172,0.998100063331,0.99721307322,290.621360322
2290,0.00209171946528,0.00177633812677,0.00204680668102,0.995877168041,0.996588971006,0.995452478399,0.997703697838,0.998100063331,0.99746578814,291.721983019
2300,0.00209053495289,0.00177798182297,0.00204955758983,0.995877168041,0.996588971006,0.995452478399,0.997703697838,0.998100063331,0.99746578814,292.752180377
2310,0.00206550527031,0.00177844751058,0.00202814203009,0.995877168041,0.996588971006,0.995907230559,0.997703697838,0.998100063331,0.99771978718,293.783803905
2320,0.00213205947919,0.00188604006056,0.00206292772324,0.99601933466,0.996588971006,0.996361982719,0.997783056215,0.998100063331,0.997972630512,294.876567634
2330,0.00204858070383,0.00176429164989,0.0020132764229,0.995877168041,0.996588971006,0.995907230559,0.997703697838,0.998100063331,0.997718631179,295.918866135
2340,0.00201693802015,0.00173805535094,0.00199644552235,0.995877168041,0.996588971006,0.995907230559,0.997703697838,0.998100063331,0.997718631179,296.938229309
2350,0.00199608037316,0.00172273316193,0.00197785949076,0.995877168041,0.996588971006,0.995907230559,0.997703697838,0.998100063331,0.997718631179,297.991020261
2360,0.0019986956568,0.00178351863347,0.00195972350376,0.996161501279,0.996588971006,0.996361982719,0.997861724875,0.998100063331,0.997972630512,299.064603728
2370,0.00194133698284,0.00169358278204,0.00190062096856,0.996161501279,0.996588971006,0.996361982719,0.997861724875,0.998100063331,0.997972630512,300.112518432
2380,0.00191173014661,0.00167379816883,0.00188427872814,0.996303667899,0.996588971006,0.996361982719,0.997940757168,0.998100063331,0.997972630512,301.130075384
2390,0.00186958569136,0.001661528804,0.00185652920529,0.996303667899,0.996588971006,0.996361982719,0.997940757168,0.998100063331,0.997972630512,302.161939507
2400,0.00185624249562,0.00163878906147,0.0018322191377,0.996445834518,0.996588971006,0.996361982719,0.998020115625,0.998100063331,0.997972630512,303.2006145
2410,0.00189324043998,0.00165974424469,0.00187756181166,0.996161501279,0.996588971006,0.996361982719,0.997861724875,0.998100063331,0.997972630512,304.202476032
2420,0.00184418177503,0.00162111861739,0.00182628372945,0.996303667899,0.996588971006,0.996361982719,0.997940757168,0.998100063331,0.997972630512,305.333563148
2430,0.00174588675103,0.00153706901706,0.00169655638868,0.996445834518,0.997157475839,0.996361982719,0.99801980198,0.998416217928,0.997972630512,306.449737068
2440,0.00173205804844,0.00151885905006,0.00167371600096,0.996445834518,0.997157475839,0.996816734879,0.99801980198,0.998416217928,0.998225602028,307.468196342
2450,0.001692043588,0.00150806109338,0.00169765938827,0.996445834518,0.997157475839,0.996816734879,0.99801980198,0.998416217928,0.998225602028,308.461193865
2460,0.00164693314632,0.00146520786887,0.00161683234221,0.996730167757,0.997157475839,0.99727148704,0.998178217822,0.998416217928,0.998478701826,309.469845329
2470,0.00160923696954,0.00142511220593,0.00159118622219,0.996730167757,0.997157475839,0.99727148704,0.998178217822,0.998416217928,0.998478701826,310.537765974
2480,0.00155111032399,0.00138298690782,0.00159022490135,0.996872334376,0.997157475839,0.99727148704,0.998257287706,0.998416217928,0.998478701826,311.503771281
2490,0.00154565131185,0.00137140993123,0.00159104706921,0.996872334376,0.997157475839,0.99727148704,0.998257287706,0.998416217928,0.998478701826,312.479176298
2500,0.00151032331247,0.00137720056359,0.00161055926502,0.996730167757,0.997157475839,0.99727148704,0.998178217822,0.998416217928,0.998478701826,313.498918339
2510,0.00146813860797,0.00136557713495,0.00159660275336,0.996588001137,0.997157475839,0.99727148704,0.998099160463,0.998416217928,0.998478701826,314.507090196
2520,0.00142816302645,0.0013293231665,0.00157581702085,0.997156667614,0.997157475839,0.99727148704,0.998415465061,0.998416217928,0.998478701826,315.50486323
2530,0.00140930229562,0.00131456585606,0.0015408729131,0.997156667614,0.997157475839,0.99727148704,0.998415465061,0.998416217928,0.998478701826,316.611321784
2540,0.00140317937153,0.00130690376183,0.00154147765011,0.997156667614,0.997157475839,0.99727148704,0.998415465061,0.998416217928,0.998478701826,317.652378211
2550,0.00138499589474,0.00130607471634,0.00156565635002,0.997298834234,0.997157475839,0.99727148704,0.998494572538,0.998416217928,0.998478701826,318.711649764
2560,0.00135752955482,0.00129224804299,0.00156504231632,0.997014500995,0.997157475839,0.99727148704,0.998336370118,0.998416217928,0.998478701826,319.736934525
2570,0.00136385725918,0.00130089580312,0.00156204950592,0.996872334376,0.997157475839,0.99727148704,0.998257287706,0.998416217928,0.998478701826,320.783138613
2580,0.00136693632858,0.00130219498558,0.00156924893591,0.997156667614,0.997157475839,0.99727148704,0.998415465061,0.998416217928,0.998478701826,321.840599596
2590,0.00133322471893,0.00118164179469,0.00154988242043,0.997156667614,0.997725980671,0.99727148704,0.998414962752,0.998732572877,0.998478701826,322.982836154
2600,0.0013474138482,0.00124960724505,0.00157936087491,0.997441000853,0.997157475839,0.99727148704,0.998573692552,0.998416217928,0.998478701826,324.039490817
2610,0.0012535518487,0.00113032712165,0.00154369570046,0.997441000853,0.997725980671,0.99727148704,0.998573692552,0.998732572877,0.998478701826,325.059142781
2620,0.00127531281281,0.00114855133694,0.00155997498151,0.997441000853,0.997725980671,0.99727148704,0.998573692552,0.998732572877,0.998478701826,326.145356775
2630,0.00124866308102,0.0011144809323,0.00153611153995,0.997441000853,0.997725980671,0.99727148704,0.998573692552,0.998732572877,0.998478701826,327.205780726
2640,0.00122733788833,0.00113746649959,0.00152161111333,0.997298834234,0.997725980671,0.99727148704,0.998494572538,0.998732572877,0.998478701826,328.207774208
2650,0.00122643583114,0.00110677613087,0.00155657212912,0.997441000853,0.997725980671,0.99727148704,0.998573692552,0.998732572877,0.998478701826,329.241418088
2660,0.00120354953691,0.00113109795357,0.00151157839777,0.997298834234,0.997725980671,0.99727148704,0.998494572538,0.998732572877,0.998478701826,330.286815458
2670,0.00119339023448,0.00109936461561,0.00152562592125,0.997298834234,0.997725980671,0.996816734879,0.998494572538,0.998732572877,0.998225602028,331.369478238
2680,0.0011856825791,0.00109028978066,0.00153010160448,0.997441000853,0.997725980671,0.996816734879,0.998573692552,0.998732572877,0.998225602028,332.428192358
2690,0.00119352706813,0.00110253910831,0.0015160366379,0.997441000853,0.997725980671,0.996816734879,0.998573692552,0.998732572877,0.998225602028,333.480123265
2700,0.00117602437068,0.00106015314579,0.0015010080363,0.997441000853,0.997725980671,0.996816734879,0.998573692552,0.998732572877,0.998225602028,334.495614832
2710,0.00114280545696,0.00103140269491,0.00148207614253,0.997441000853,0.997725980671,0.996816734879,0.998573692552,0.998732572877,0.998225602028,335.54307798
2720,0.00114430304898,0.00102762761865,0.00147088577794,0.997725334092,0.997725980671,0.996816734879,0.998732171157,0.998732572877,0.998225602028,336.581241764
2730,0.00112674522653,0.00103438459113,0.00147634458215,0.99800966733,0.997725980671,0.9977262392,0.998890298034,0.998732572877,0.998732572877,337.616227666
2740,0.0011202287682,0.00102152210489,0.00147695583108,0.99800966733,0.997725980671,0.9977262392,0.998890298034,0.998732572877,0.998732572877,338.623351819
2750,0.00125939873202,0.00123667241323,0.00151988097572,0.996872334376,0.997157475839,0.99727148704,0.998257287706,0.998416217928,0.998479472884,339.608339461
2760,0.00112150818452,0.000977616514222,0.00147854981758,0.998294000569,0.997725980671,0.99727148704,0.999048525214,0.998732572877,0.998478701826,340.664004887
2770,0.00195442358398,0.00138822659923,0.00209384634126,0.997725334092,0.998294485503,0.9977262392,0.99873015873,0.999047921295,0.998731930003,341.73783645
2780,0.00104479160688,0.00089882329377,0.00141282673852,0.998294000569,0.997725980671,0.9977262392,0.999048525214,0.998732572877,0.998732572877,342.814305449
2790,0.0010145008249,0.000924874412622,0.00136933009348,0.998436167188,0.997725980671,0.99727148704,0.999127883929,0.998732572877,0.998479472884,343.825530744
2800,0.000988499864286,0.000902294445116,0.00135224042535,0.998436167188,0.997725980671,0.9977262392,0.999127745619,0.998732572877,0.998732572877,344.852029532
2810,0.000986220620527,0.00090328573155,0.00134998370378,0.998436167188,0.997725980671,0.99727148704,0.999127745619,0.998732572877,0.998479472884,345.954023886
2820,0.000967559341043,0.000942691617787,0.00133236879261,0.998578333807,0.997725980671,0.99727148704,0.999207104345,0.998732572877,0.998479472884,347.025233422
2830,0.000982863390512,0.000933762817972,0.00131008936641,0.998294000569,0.997725980671,0.99727148704,0.999048676074,0.998732572877,0.998479472884,348.034377134
2840,0.000942305685338,0.000901309169881,0.00131935517251,0.998436167188,0.997725980671,0.9977262392,0.999127883929,0.998732572877,0.998732572877,349.071702596
2850,0.000923853767282,0.000849507716646,0.00129179437383,0.998436167188,0.997725980671,0.99818099136,0.999127883929,0.998731769182,0.998985801217,350.323359092
2860,0.000920724061872,0.0008221925272,0.00128481566687,0.998578333807,0.998294485503,0.99818099136,0.999207104345,0.999049128368,0.998985801217,351.531764589
2870,0.000917384496481,0.00081837122487,0.00128204509789,0.998578333807,0.998294485503,0.99818099136,0.999207104345,0.999049128368,0.998985801217,352.575869315
2880,0.000914380388796,0.000808463478962,0.00128010107397,0.998578333807,0.998294485503,0.99818099136,0.999207104345,0.999049128368,0.998985801217,353.633002398
2890,0.00088033522148,0.000781107791862,0.00125399502817,0.998720500426,0.998862990335,0.99818099136,0.999286337325,0.999365884591,0.998985801217,354.700164131
2900,0.000878292847306,0.000778807029041,0.00125989992866,0.998720500426,0.998862990335,0.99818099136,0.999286337325,0.999365884591,0.998985801217,355.745047129
2910,0.000858619225691,0.000765391476602,0.00123742966709,0.998720500426,0.998862990335,0.9977262392,0.999286337325,0.999365884591,0.998732572877,356.796526871
2920,0.00082621318965,0.000740006980619,0.00121754602983,0.998720500426,0.998862990335,0.9977262392,0.999286450488,0.999365884591,0.998732572877,357.847004343
2930,0.000812368319974,0.000750581914797,0.00120391934317,0.998720500426,0.998862990335,0.9977262392,0.999286450488,0.999365884591,0.998732572877,358.892601612
2940,0.000841003507465,0.000816624349628,0.00122283388272,0.998720500426,0.998862990335,0.9977262392,0.999286450488,0.999365884591,0.998732572877,359.939389998
2950,0.000821135957246,0.000750764495137,0.00120063219707,0.998720500426,0.998862990335,0.99818099136,0.999286450488,0.999365884591,0.998985801217,360.946558399
2960,0.000788205708024,0.000789205787664,0.00114638243123,0.998720500426,0.998294485503,0.99818099136,0.999286450488,0.999049128368,0.998985801217,362.019000132
2970,0.000773646787972,0.000737332705903,0.001127508084,0.998720500426,0.998862990335,0.99818099136,0.999286450488,0.999365884591,0.998985801217,363.08008897
2980,0.000764671758571,0.000758580930315,0.00114352878568,0.998720500426,0.998294485503,0.9977262392,0.999286450488,0.999049128368,0.998732572877,364.151931793
2990,0.000774467510398,0.000770209465463,0.00114545068308,0.998578333807,0.998294485503,0.9977262392,0.999207230062,0.999049128368,0.998732572877,365.22609837
3000,0.000736242999708,0.000708289713236,0.00112060118106,0.998720500426,0.998294485503,0.9977262392,0.999286450488,0.999049128368,0.998732572877,366.422597882
3010,0.00071246664241,0.000696833942293,0.00110719205532,0.998720500426,0.998862990335,0.9977262392,0.999286450488,0.999365884591,0.998732572877,367.44936926
3020,0.000703033957902,0.000680245572253,0.00110180573072,0.998720500426,0.998862990335,0.9977262392,0.999286450488,0.999365884591,0.998732572877,368.511293654
3030,0.000696513403168,0.00061480145183,0.00110965840079,0.998720500426,0.998862990335,0.9977262392,0.999286450488,0.999365884591,0.998732572877,369.544740003
3040,0.000725201692717,0.000740196582053,0.00113553830597,0.998862667046,0.998294485503,0.9977262392,0.999365784049,0.999049128368,0.998732572877,370.651250703
3050,0.000672530432479,0.000604084385438,0.00110786447073,0.998862667046,0.998862990335,0.99818099136,0.999365683476,0.999365884591,0.998985801217,371.643201315
3060,0.000667892173478,0.000657846534374,0.00111851997994,0.998862667046,0.998294485503,0.9977262392,0.999365683476,0.999049128368,0.998732572877,372.672194126
3070,0.000637087824312,0.000578331531434,0.00107403258296,0.998862667046,0.998862990335,0.99818099136,0.999365683476,0.999365884591,0.998985801217,373.727201774
3080,0.000619017005444,0.000562335295996,0.00105782756963,0.998862667046,0.998862990335,0.99818099136,0.999365683476,0.999365884591,0.998985801217,374.770239437
3090,0.000613756498787,0.000570717006998,0.00104817753561,0.999004833665,0.998862990335,0.99818099136,0.999445017046,0.999365884591,0.998985801217,375.834601364
3100,0.000647912074133,0.000655607508822,0.00108897084323,0.998862667046,0.998862990335,0.99818099136,0.999365784049,0.999365884591,0.998985801217,376.849271601
3110,0.000595993199011,0.000534050514446,0.00102669668207,0.999004833665,0.998862990335,0.99818099136,0.999445017046,0.999365884591,0.998985801217,377.888130695
3120,0.000593655492444,0.000530281576492,0.00101974082694,0.999147000284,0.998862990335,0.99818099136,0.999524262607,0.999365884591,0.998985801217,378.940766785
3130,0.000677157466325,0.000668525418991,0.00106167829571,0.999004833665,0.998294485503,0.99818099136,0.999445017046,0.999049128368,0.998985801217,379.968117325
3140,0.000584231608214,0.000555474951042,0.00100468415176,0.999147000284,0.998862990335,0.99818099136,0.999524262607,0.999365884591,0.998985801217,380.971271498
3150,0.000585040100547,0.000568040704632,0.00100370687826,0.999004833665,0.998862990335,0.99818099136,0.99944492903,0.999365884591,0.998985801217,382.016675583
3160,0.000565901603478,0.000535309149768,0.000969474035697,0.999004833665,0.998862990335,0.99818099136,0.99944492903,0.999365884591,0.998985801217,383.171446669
3170,0.000558666158594,0.000528859511262,0.000966217227242,0.999004833665,0.998862990335,0.99818099136,0.99944492903,0.999365884591,0.998985801217,384.228523652
3180,0.000549109582645,0.000517182984599,0.000929424478925,0.999004833665,0.998862990335,0.99818099136,0.99944492903,0.999365884591,0.998985801217,385.249625497
3190,0.000528174984584,0.0005026535985,0.000938533396203,0.999004833665,0.998862990335,0.99818099136,0.99944492903,0.999365884591,0.998985801217,386.305228109
3200,0.000524573922479,0.000526956910832,0.000956757332363,0.999147000284,0.998862990335,0.99818099136,0.999524262607,0.999365884591,0.998985801217,387.459348921
3210,0.00054081641058,0.000561798354796,0.000978481294834,0.999147000284,0.998862990335,0.99818099136,0.999524262607,0.999365884591,0.998985801217,388.548034421
3220,0.000505331689903,0.000480143048768,0.000938698849614,0.999147000284,0.998862990335,0.99818099136,0.999524262607,0.999365884591,0.998985801217,389.656119838
3230,0.00050340097555,0.000509146875963,0.000936236147989,0.999147000284,0.998862990335,0.99818099136,0.999524262607,0.999365884591,0.998985801217,390.773893758
3240,0.000494697452559,0.000449331726317,0.000933155219996,0.999289166904,0.998862990335,0.99818099136,0.999603520736,0.999365884591,0.998985801217,391.904507193
3250,0.000493874620643,0.000470583738262,0.00095100881722,0.999289166904,0.998862990335,0.99818099136,0.999603520736,0.999365884591,0.998985801217,393.311198672
3260,0.00048229497795,0.000492877649283,0.000932726903984,0.999431333523,0.998862990335,0.99818099136,0.999682791435,0.999365884591,0.998985801217,394.47142675
3270,0.000477215066448,0.000490259130822,0.000940313384785,0.999431333523,0.998862990335,0.99818099136,0.999682791435,0.999365884591,0.998985801217,395.7313274
3280,0.000479676545015,0.000505275532849,0.000938202654076,0.999431333523,0.998862990335,0.99818099136,0.999682791435,0.999365884591,0.998985801217,396.909357764
3290,0.000445709766562,0.00044600567522,0.000940105451862,0.999431333523,0.998862990335,0.99818099136,0.999682791435,0.999365884591,0.998985801217,398.05203126
3300,0.000546504566447,0.000654209898935,0.00110067736272,0.999004833665,0.998294485503,0.9977262392,0.999445017046,0.999049128368,0.998732572877,399.200043229
3310,0.000435759025023,0.000439780787862,0.000930230553884,0.999431333523,0.998862990335,0.99818099136,0.999682791435,0.999365884591,0.998985801217,400.326873946
3320,0.000433421135269,0.00043656659562,0.00092434018568,0.999431333523,0.998862990335,0.99818099136,0.999682791435,0.999365884591,0.998985801217,401.494508253
3330,0.000425983724102,0.0004278210546,0.000916688662036,0.999431333523,0.998862990335,0.99818099136,0.999682791435,0.999365884591,0.998985801217,402.639114789
3340,0.00042658556284,0.000426804852231,0.000914435352334,0.999431333523,0.998862990335,0.99818099136,0.999682791435,0.999365884591,0.998985801217,403.84113845
3350,0.00042405854916,0.000398029178098,0.000902770963005,0.999431333523,0.998862990335,0.99818099136,0.999682791435,0.999365884591,0.998985801217,404.974678902
3360,0.00041934698015,0.00040891886469,0.000903016038123,0.999431333523,0.998862990335,0.99818099136,0.999682791435,0.999365884591,0.998985801217,406.079027034
3370,0.000407559012926,0.000394562153221,0.000928822634459,0.999431333523,0.998862990335,0.99818099136,0.999682791435,0.999365884591,0.998985801217,407.227635941
3380,0.000408363656833,0.000393213813314,0.000927180998046,0.999431333523,0.998862990335,0.99818099136,0.999682791435,0.999365884591,0.998985801217,408.350203543
3390,0.000407440371131,0.000396211355125,0.000930140119868,0.999431333523,0.998862990335,0.99818099136,0.999682791435,0.999365884591,0.998985801217,409.468011439
3400,0.000406745279778,0.000397819692204,0.000923758009358,0.999431333523,0.998862990335,0.99818099136,0.999682791435,0.999365884591,0.998985801217,410.583213901
3410,0.000404775164426,0.000393262706995,0.000911196412894,0.999431333523,0.999431495168,0.99818099136,0.999682791435,0.999682841738,0.998985801217,411.623920305
3420,0.00040479518393,0.000398334607959,0.000908878316883,0.999431333523,0.999431495168,0.99818099136,0.999682791435,0.999682841738,0.998985801217,412.647398842
3430,0.000402018055867,0.000398328040917,0.000916190211439,0.999431333523,0.999431495168,0.99818099136,0.999682791435,0.999682841738,0.998985801217,413.664225326
3440,0.000402939167269,0.000415534409038,0.000907506923382,0.999431333523,0.999431495168,0.99818099136,0.999682791435,0.999682841738,0.998985801217,414.731262219
3450,0.000399377293506,0.000410562334508,0.000903389223902,0.999431333523,0.999431495168,0.99818099136,0.999682791435,0.999682841738,0.998985801217,415.74326223
3460,0.000397891062661,0.000414560401819,0.000902875445166,0.999431333523,0.999431495168,0.99818099136,0.999682791435,0.999682841738,0.998985801217,416.770766449
3470,0.000397138706474,0.00040790331965,0.000901683011063,0.999431333523,0.999431495168,0.99818099136,0.999682791435,0.999682841738,0.998985801217,417.8175572
3480,0.000404824144267,0.000398196788395,0.000911678335987,0.999431333523,0.999431495168,0.99818099136,0.999682791435,0.999682841738,0.998985801217,418.834574893
3490,0.000393125101768,0.000408525841,0.00090285813311,0.999431333523,0.999431495168,0.99818099136,0.999682791435,0.999682841738,0.998985801217,419.853096587
3500,0.000392589856736,0.000428545378006,0.000904826146326,0.999431333523,0.999431495168,0.99818099136,0.999682791435,0.999682841738,0.998985801217,420.878651174
3510,0.000389558395364,0.000421956215261,0.000901431700665,0.999431333523,0.999431495168,0.99818099136,0.999682791435,0.999682841738,0.998985801217,421.922859405
3520,0.00038691485831,0.000418761547387,0.000897486810817,0.999431333523,0.999431495168,0.99818099136,0.999682791435,0.999682841738,0.998985801217,422.941091519
3530,0.000382455931146,0.000411655245887,0.000888773983739,0.999431333523,0.999431495168,0.99818099136,0.999682791435,0.999682841738,0.998985801217,423.961788816
3540,0.00037806516038,0.000442957416835,0.000890180315245,0.999431333523,0.998862990335,0.99818099136,0.999682791435,0.999365884591,0.998985801217,424.990525235
3550,0.000380681480884,0.00045149801477,0.000898609155493,0.999431333523,0.998862990335,0.99818099136,0.999682791435,0.999365884591,0.998985801217,426.013069451
3560,0.000373982049612,0.000432752269591,0.000892860351696,0.999431333523,0.998862990335,0.99818099136,0.999682791435,0.999365884591,0.998985801217,427.030632723
3570,0.000364888430908,0.000415876158883,0.000888230490354,0.999431333523,0.999431495168,0.99818099136,0.999682791435,0.999682841738,0.998985801217,428.042702263
3580,0.000362337157857,0.000414390092745,0.000882037068813,0.999431333523,0.999431495168,0.99818099136,0.999682791435,0.999682841738,0.998985801217,429.080830491
3590,0.000362516473709,0.000419347828086,0.000885740801217,0.999431333523,0.999431495168,0.99818099136,0.999682791435,0.999682841738,0.998985801217,430.089876621
3600,0.00036084940267,0.000412996165154,0.00089409135644,0.999431333523,0.999431495168,0.99818099136,0.999682791435,0.999682841738,0.998985801217,431.100362752
3610,0.000358585280921,0.000423548954812,0.000885279933068,0.999431333523,0.999431495168,0.99818099136,0.999682791435,0.999682841738,0.998985801217,432.115117924
3620,0.000362990379919,0.000410699912245,0.000888008242554,0.999431333523,0.999431495168,0.99818099136,0.999682791435,0.999682841738,0.998985801217,433.140246636
3630,0.000362645779074,0.000418322028508,0.000878200165664,0.999431333523,0.999431495168,0.99818099136,0.999682791435,0.999682841738,0.998985801217,434.175155503
3640,0.000363240722514,0.000431655421104,0.000877624353443,0.999431333523,0.999431495168,0.99818099136,0.999682791435,0.999682841738,0.998985801217,435.183904548
3650,0.000366925981541,0.000466326056188,0.00093160743306,0.999431333523,0.998862990335,0.99818099136,0.999682791435,0.999365884591,0.998985801217,436.208693901
3660,0.000349866091648,0.000424054323619,0.000881525126999,0.999431333523,0.998862990335,0.99818099136,0.999682791435,0.999365884591,0.998985801217,437.236608194
3670,0.00035553322079,0.000433826985129,0.000884692541263,0.999431333523,0.998862990335,0.99818099136,0.999682791435,0.999365884591,0.998985801217,438.257748359
3680,0.000346960633078,0.00042660569401,0.000882213037994,0.999431333523,0.998862990335,0.99818099136,0.999682791435,0.999365884591,0.998985801217,439.277944325
3690,0.000346406019667,0.000410660455533,0.000899614762983,0.999431333523,0.998862990335,0.99818099136,0.999682791435,0.999365884591,0.998985801217,440.306370618
3700,0.000344252554315,0.000411050001729,0.000869380824942,0.999431333523,0.999431495168,0.99818099136,0.999682791435,0.999682841738,0.998985801217,441.332530442
3710,0.000347983183284,0.000398429727489,0.000932516275973,0.999431333523,0.999431495168,0.9977262392,0.999682791435,0.999682841738,0.998731930003,442.3605356
3720,0.000336370222704,0.000408814059469,0.000839444939696,0.999431333523,0.999431495168,0.99818099136,0.999682791435,0.999682841738,0.998985801217,443.388476757
3730,0.000330831261224,0.000410491630433,0.000832191702732,0.999431333523,0.999431495168,0.99818099136,0.999682791435,0.999682841738,0.998985801217,444.408590156
3740,0.000327952685822,0.000411256904645,0.000818108927209,0.999431333523,0.999431495168,0.99818099136,0.999682791435,0.999682841738,0.998985801217,445.419753816
3750,0.000323399364306,0.000404747077316,0.000817083820978,0.999431333523,0.999431495168,0.99818099136,0.999682791435,0.999682841738,0.998985801217,446.440764795
3760,0.000339166322138,0.000400814025552,0.000874552944929,0.999431333523,0.999431495168,0.9977262392,0.999682791435,0.999682841738,0.998731930003,447.511002481
3770,0.000340722925445,0.000443580244833,0.000863479093353,0.999431333523,0.999431495168,0.9977262392,0.999682791435,0.999682841738,0.998731930003,448.534544623
3780,0.000324566058896,0.000395148459904,0.000830787018785,0.999431333523,0.999431495168,0.99818099136,0.999682791435,0.999682841738,0.998985801217,449.566510674
3790,0.000316808809117,0.000400939998435,0.000822203243319,0.999431333523,0.999431495168,0.99818099136,0.999682791435,0.999682841738,0.998985801217,450.589418742
3800,0.000307269648691,0.000393614599119,0.000791488002976,0.999431333523,0.999431495168,0.99818099136,0.999682791435,0.999682841738,0.998985801217,451.615708933
3810,0.000305219504986,0.000396441407982,0.000762757978712,0.999431333523,0.999431495168,0.99818099136,0.999682791435,0.999682841738,0.998985801217,452.636443765
3820,0.000305354807575,0.000396335862839,0.000774003437023,0.999431333523,0.999431495168,0.99818099136,0.999682791435,0.999682841738,0.998985801217,453.655290201
3830,0.000301356592527,0.000387360855486,0.000762639818265,0.999431333523,0.999431495168,0.99818099136,0.999682791435,0.999682841738,0.998985801217,454.700166879
3840,0.000299694186698,0.000389597607186,0.000710284986999,0.999431333523,0.999431495168,0.99818099136,0.999682791435,0.999682841738,0.998985801217,455.732310313
3850,0.000307923627964,0.000387642664153,0.000710141905452,0.999431333523,0.999431495168,0.99818099136,0.999682791435,0.999682841738,0.998985801217,456.775617802
3860,0.000295261200142,0.000432906214178,0.000784773921015,0.999431333523,0.998862990335,0.99818099136,0.999682791435,0.999365884591,0.998985801217,457.783129118
3870,0.000285485218017,0.000424845992419,0.000767614388741,0.999431333523,0.998862990335,0.99818099136,0.999682791435,0.999365884591,0.998985801217,458.821749987
3880,0.000282477815641,0.000421216844311,0.000761126371938,0.999431333523,0.998862990335,0.99818099136,0.999682791435,0.999365884591,0.998985801217,459.837355727
3890,0.000277616806599,0.000415212281492,0.00076085263603,0.999431333523,0.998862990335,0.99818099136,0.999682791435,0.999365884591,0.998985801217,460.858427149
3900,0.000307360651802,0.00044815362385,0.000732861610764,0.999431333523,0.998862990335,0.99818099136,0.999682791435,0.999365884591,0.998985801217,461.904677459
3910,0.000270544425791,0.000421446783465,0.000742706137783,0.999573500142,0.998862990335,0.99818099136,0.999762074709,0.999365884591,0.998985801217,462.926653183
3920,0.000269440291399,0.000400094968761,0.000728610134065,0.999573500142,0.999431495168,0.99818099136,0.999762074709,0.999682841738,0.998985801217,463.946940408
3930,0.000262006415642,0.000397709875639,0.000727389276188,0.999573500142,0.998862990335,0.99818099136,0.999762074709,0.999365884591,0.998985801217,464.953557301
3940,0.000261222569398,0.0003933380957,0.00072211937518,0.999573500142,0.999431495168,0.99818099136,0.999762074709,0.999682841738,0.998985801217,465.975465864
3950,0.000257474987594,0.000386182705208,0.000667100277006,0.999573500142,0.999431495168,0.99818099136,0.999762074709,0.999682841738,0.998985801217,466.99198538
3960,0.000257511089884,0.000390344082734,0.000654537031338,0.999573500142,0.999431495168,0.99818099136,0.999762074709,0.999682841738,0.998985801217,468.00603339
3970,0.000258396181739,0.000374280463636,0.000618117141811,0.999573500142,0.999431495168,0.99863574352,0.999762074709,0.999682841738,0.999239158002,469.021386686
3980,0.000286023645523,0.000398527435767,0.000669691674176,0.999573500142,0.999431495168,0.99818099136,0.999762074709,0.999682841738,0.998985801217,470.036799637
3990,0.000254546999619,0.000382816191641,0.000655348328219,0.999573500142,0.999431495168,0.99818099136,0.999762074709,0.999682841738,0.998985801217,471.059291309
4000,0.000323362380219,0.000388846544646,0.000727828704624,0.999715666761,0.999431495168,0.99818099136,0.999841370558,0.999682841738,0.998985801217,472.077426632
4010,0.000253636846794,0.000382734692035,0.000654886928383,0.999573500142,0.999431495168,0.99818099136,0.999762074709,0.999682841738,0.998985801217,473.091191779
4020,0.000250116247146,0.000373269934396,0.000680794775373,0.999573500142,0.999431495168,0.99818099136,0.999762074709,0.999682841738,0.998985801217,474.107544977
4030,0.000249992779693,0.000373430814316,0.000681287767279,0.999573500142,0.999431495168,0.99818099136,0.999762074709,0.999682841738,0.998985801217,475.129420747
4040,0.000247570572715,0.000340647055674,0.000630878791782,0.999573500142,0.999431495168,0.99863574352,0.999762074709,0.999682841738,0.999239158002,476.150656911
4050,0.000249470515088,0.000353666852957,0.000666814770005,0.999573500142,0.999431495168,0.99863574352,0.999762074709,0.999682841738,0.999239158002,477.16825969
4060,0.000245153437446,0.000331063295654,0.000625561021077,0.999573500142,0.999431495168,0.99863574352,0.999762074709,0.999682841738,0.999239158002,478.182598863
4070,0.000242681570396,0.000333302936304,0.00061135549279,0.999573500142,0.999431495168,0.99863574352,0.999762074709,0.999682841738,0.999239158002,479.199237294
4080,0.000233855618958,0.000329561817016,0.000602712078427,0.999573500142,0.999431495168,0.99863574352,0.999762074709,0.999682841738,0.999239158002,480.227519787
4090,0.000247253992507,0.000355032605666,0.000623297770063,0.999573500142,0.999431495168,0.99863574352,0.999762074709,0.999682841738,0.999239158002,481.253194872
4100,0.000232419353134,0.000342649688876,0.000639419140194,0.999715666761,0.999431495168,0.99863574352,0.999841370558,0.999682841738,0.999239158002,482.27846936
4110,0.000231665814695,0.000337307128938,0.00063749611491,0.999573500142,0.999431495168,0.99863574352,0.999762074709,0.999682841738,0.999239158002,483.29955303
4120,0.000230878453027,0.000329729377508,0.000620994126066,0.999715666761,0.999431495168,0.99863574352,0.999841370558,0.999682841738,0.999239158002,484.319742279
4130,0.000227905646625,0.000327727745299,0.000604771696826,0.999715666761,0.999431495168,0.99863574352,0.999841370558,0.999682841738,0.999239158002,485.346572125
4140,0.000225898445369,0.000324995812113,0.000603359895875,0.999715666761,0.999431495168,0.99863574352,0.999841370558,0.999682841738,0.999239158002,486.365845621
4150,0.000225632358736,0.000314877024027,0.00063944446609,0.999715666761,0.999431495168,0.99863574352,0.999841370558,0.999682841738,0.999239158002,487.384967019
4160,0.000223304620696,0.000330640877104,0.000633674975503,0.999715666761,0.999431495168,0.99863574352,0.999841370558,0.999682841738,0.999239158002,488.399419575
4170,0.000223178350557,0.000330805066043,0.000633147348413,0.999715666761,0.999431495168,0.99863574352,0.999841370558,0.999682841738,0.999239158002,489.421095049
4180,0.000222322753327,0.000331410189989,0.000629350598063,0.999715666761,0.999431495168,0.99863574352,0.999841370558,0.999682841738,0.999239158002,490.438247061
4190,0.00022090832313,0.000324061787461,0.000617004956664,0.999715666761,0.999431495168,0.99863574352,0.999841370558,0.999682841738,0.999239158002,491.456655371
4200,0.000215924891596,0.000315501220342,0.000581964202136,0.999715666761,0.999431495168,0.99863574352,0.999841370558,0.999682841738,0.999239158002,492.469232567
4210,0.000212040567457,0.000312247533323,0.000556941772627,0.999715666761,0.999431495168,0.99909049568,0.999841370558,0.999682841738,0.999492643328,493.489703497
4220,0.000211465913301,0.00031069848976,0.000562569977227,0.999715666761,0.999431495168,0.99909049568,0.999841370558,0.999682841738,0.999492643328,494.506274375
4230,0.000213017782678,0.000319576790422,0.000535934119473,0.999715666761,0.999431495168,0.99909049568,0.999841370558,0.999682841738,0.999492643328,495.513408405
4240,0.000211052568438,0.000320079973831,0.000532583427321,0.999715666761,0.999431495168,0.99909049568,0.999841370558,0.999682841738,0.999492643328,496.52462698
4250,0.000209690867601,0.000320631969887,0.000540842264801,0.999715666761,0.999431495168,0.99909049568,0.999841370558,0.999682841738,0.999492643328,497.544805167
4260,0.00021230292369,0.000320825433393,0.000521274840709,0.999715666761,0.999431495168,0.99909049568,0.999841370558,0.999682841738,0.999492643328,498.573184447
4270,0.000206839146227,0.000314453708574,0.000551912324773,0.999715666761,0.999431495168,0.99909049568,0.999841370558,0.999682841738,0.999492643328,499.601035134
4280,0.000204693360675,0.000312158907503,0.000550273871177,0.999715666761,0.999431495168,0.99909049568,0.999841370558,0.999682841738,0.999492643328,500.617211343
4290,0.000205061872632,0.000316314629952,0.000578981574304,0.999715666761,0.999431495168,0.99863574352,0.999841370558,0.999682841738,0.999239158002,501.646521391
4300,0.000198856336931,0.000311273740315,0.000586971630781,0.999715666761,0.999431495168,0.99863574352,0.999841370558,0.999682841738,0.999239158002,502.666647432
4310,0.000197480317074,0.00030875798331,0.000559592190368,0.999715666761,0.999431495168,0.99863574352,0.999841370558,0.999682841738,0.999239158002,503.686323497
4320,0.000198637146731,0.000311672842102,0.00055836837779,0.999715666761,0.999431495168,0.99863574352,0.999841370558,0.999682841738,0.999239158002,504.708437886
4330,0.000196844423246,0.000306048381566,0.000558394917164,0.999715666761,0.999431495168,0.99863574352,0.999841370558,0.999682841738,0.999239158002,505.723789999
4340,0.000194311205353,0.000305753199068,0.000551091023184,0.999715666761,0.999431495168,0.99863574352,0.999841370558,0.999682841738,0.999239158002,506.741380135
4350,0.000200318948851,0.000307864362505,0.000587845140367,0.999573500142,0.999431495168,0.99863574352,0.999762074709,0.999682841738,0.999239158002,507.75271407
4360,0.000200437923658,0.000309327478816,0.000550773815715,0.999715666761,0.999431495168,0.99863574352,0.999841370558,0.999682841738,0.999239158002,508.809892587
4370,0.00019310418236,0.000306250614386,0.000547174290406,0.999715666761,0.999431495168,0.99863574352,0.999841370558,0.999682841738,0.999239158002,509.835190779
4380,0.000190984267078,0.000307361555225,0.000549995380545,0.999715666761,0.999431495168,0.99863574352,0.999841370558,0.999682841738,0.999239158002,510.9813586
4390,0.000191579477902,0.000305969214296,0.000555667993779,0.999715666761,0.999431495168,0.99863574352,0.999841370558,0.999682841738,0.999239158002,512.094574294
4400,0.000188296018219,0.000313812461805,0.000543342166967,0.999715666761,0.999431495168,0.99863574352,0.999841370558,0.999682841738,0.999239158002,513.192350569
4410,0.000188068878716,0.000313322091798,0.000541459399605,0.999715666761,0.999431495168,0.99863574352,0.999841370558,0.999682841738,0.999239158002,514.248399204
4420,0.000187688414083,0.000311326790253,0.000540908494594,0.999715666761,0.999431495168,0.99863574352,0.999841370558,0.999682841738,0.999239158002,515.29135825
4430,0.000187126307556,0.000317025304641,0.000555976146314,0.999715666761,0.999431495168,0.99863574352,0.999841370558,0.999682841738,0.999239158002,516.359624971
4440,0.000184124923671,0.000316647729362,0.000549855704982,0.999715666761,0.999431495168,0.99863574352,0.999841370558,0.999682841738,0.999239158002,517.416443982
4450,0.000185909567016,0.000315975576474,0.000558722450465,0.999715666761,0.999431495168,0.99863574352,0.999841370558,0.999682841738,0.999239158002,518.490114362
4460,0.000184143636761,0.00031649156627,0.000549088200207,0.999715666761,0.999431495168,0.99863574352,0.999841370558,0.999682841738,0.999239158002,519.519597447
4470,0.000182838536034,0.000310633979438,0.000546780296468,0.999715666761,0.999431495168,0.99863574352,0.999841370558,0.999682841738,0.999239158002,520.543235194
4480,0.000177029403672,0.00030651782005,0.000550677693054,0.999715666761,0.999431495168,0.99863574352,0.999841370558,0.999682841738,0.999239158002,521.672546111
4490,0.000175424302088,0.000305897146477,0.000545085055571,0.999715666761,0.999431495168,0.99863574352,0.999841370558,0.999682841738,0.999239158002,522.75070479
4500,0.000174424835229,0.000305925534455,0.000545505570961,0.999715666761,0.999431495168,0.99863574352,0.999841370558,0.999682841738,0.999239158002,523.768343518
4510,0.000182925110203,0.000272095794346,0.000564133490221,0.999715666761,0.999431495168,0.99818099136,0.999841370558,0.999682841738,0.998985286657,524.789963289
4520,0.000165463625636,0.00029173800531,0.000526959563705,0.999715666761,0.999431495168,0.99863574352,0.999841370558,0.999682841738,0.999239158002,525.864682162
4530,0.000165306958818,0.000292122484773,0.000539108808596,0.999715666761,0.999431495168,0.99863574352,0.999841370558,0.999682841738,0.999239158002,527.003696198
4540,0.000165229465065,0.000293970843324,0.000533673701373,0.999715666761,0.999431495168,0.99863574352,0.999841370558,0.999682841738,0.999239158002,528.025582637
4550,0.000171326347974,0.000293956277697,0.000564539793399,0.999715666761,0.999431495168,0.99818099136,0.999841370558,0.999682841738,0.998985801217,529.075008057
4560,0.000165466169336,0.000306245637175,0.000514027395001,0.999715666761,0.999431495168,0.99863574352,0.999841370558,0.999682841738,0.999239158002,530.095702197
4570,0.000161066315595,0.000303746945315,0.000485890532929,0.999715666761,0.999431495168,0.99863574352,0.999841370558,0.999682841738,0.999239158002,531.124890961
4580,0.000164267204214,0.000296270822543,0.000489502300533,0.999715666761,0.999431495168,0.99818099136,0.999841370558,0.999682841738,0.998985286657,532.15021681
4590,0.00016064183252,0.00030528013596,0.000485498993596,0.999715666761,0.999431495168,0.99863574352,0.999841370558,0.999682841738,0.999239158002,533.202391862
4600,0.000160318792973,0.000299075038518,0.000471452421763,0.999715666761,0.999431495168,0.99863574352,0.999841370558,0.999682841738,0.999239158002,534.244689968
4610,0.000164071813626,0.000326206364947,0.000482693446939,0.999715666761,0.999431495168,0.99863574352,0.999841370558,0.999682841738,0.999239158002,535.296695143
4620,0.000159332380816,0.000295530063351,0.000473949494625,0.999715666761,0.999431495168,0.99863574352,0.999841370558,0.999682841738,0.999239158002,536.332612604
4630,0.000166988205533,0.000304910909908,0.000470648124945,0.999857833381,0.999431495168,0.99909049568,0.999920678988,0.999682841738,0.999492643328,537.365766211
4640,0.000180947845304,0.000308059108803,0.000528194891038,0.999857833381,0.999431495168,0.99863574352,0.999920678988,0.999682841738,0.999238771885,538.40267686
4650,0.00015382225287,0.000301230869204,0.000439568797214,0.999857833381,0.999431495168,0.99909049568,0.999920678988,0.999682841738,0.999492643328,539.42796478
4660,0.000152859897329,0.000299474877535,0.000448582525716,0.999857833381,0.999431495168,0.99909049568,0.999920678988,0.999682841738,0.999492643328,540.498931354
4670,0.000180934838256,0.000385898993106,0.000425129155962,0.999715666761,0.999431495168,0.99863574352,0.999841370558,0.999682841738,0.999239158002,541.520681099
4680,0.000148865750021,0.0003154475055,0.000417117564054,0.999857833381,0.999431495168,0.99909049568,0.999920678988,0.999682841738,0.999492643328,542.559234019
4690,0.000148376233611,0.000308851111285,0.000430203990443,0.999857833381,0.999431495168,0.99954524784,0.999920678988,0.999682841738,0.999746257295,543.583453693
4700,0.000152331800855,0.000304711492185,0.000434515595929,0.999857833381,0.999431495168,0.99954524784,0.999920678988,0.999682841738,0.999746257295,544.604133217
4710,0.000146736906472,0.000310318689468,0.000412495999073,0.999857833381,0.999431495168,0.99954524784,0.999920678988,0.999682841738,0.999746257295,545.652450094
4720,0.00014595341336,0.00031212843518,0.000410673757883,0.999857833381,0.999431495168,0.99954524784,0.999920678988,0.999682841738,0.999746257295,546.680566264
4730,0.000145753725824,0.000309492058328,0.000410437223983,0.999857833381,0.999431495168,0.99954524784,0.999920678988,0.999682841738,0.999746257295,547.740915548
4740,0.000146693829296,0.000299954178943,0.000410790277519,0.999857833381,0.999431495168,0.99954524784,0.999920678988,0.999682841738,0.999746257295,548.773140757
4750,0.000144536487547,0.000314882734442,0.000408924248155,0.999857833381,0.999431495168,0.99954524784,0.999920678988,0.999682841738,0.999746257295,549.81655531
4760,0.000143186802633,0.000312009961206,0.000408065202936,0.999857833381,0.999431495168,0.99954524784,0.999920678988,0.999682841738,0.999746257295,550.842941503
4770,0.000143973958117,0.000312948243834,0.000405299195513,0.999857833381,0.999431495168,0.99954524784,0.999920678988,0.999682841738,0.999746257295,551.862808779
4780,0.00014179968748,0.000312597284277,0.000418858713403,0.999857833381,0.999431495168,0.99909049568,0.999920678988,0.999682841738,0.999492643328,552.882375411
4790,0.000144004581346,0.0003083341564,0.000424683166558,0.999857833381,0.999431495168,0.99909049568,0.999920678988,0.999682841738,0.999492643328,553.895840706
4800,0.000139022172333,0.000311830992735,0.000378745026486,0.999857833381,0.999431495168,0.99954524784,0.999920678988,0.999682841738,0.999746257295,554.916751732
4810,0.000139025740368,0.000311414063026,0.000379757952406,0.999857833381,0.999431495168,0.99954524784,0.999920678988,0.999682841738,0.999746257295,555.938638562
4820,0.000140168652572,0.000303522646434,0.000388382635775,0.999857833381,0.999431495168,0.99954524784,0.999920678988,0.999682841738,0.999746257295,556.975372221
4830,0.000156052167956,0.000305248143817,0.000426250627451,0.999857833381,0.999431495168,0.99909049568,0.999920678988,0.999682841738,0.999492643328,558.028460263
4840,0.000133625100085,0.000301916067569,0.000408763062467,0.999857833381,0.999431495168,0.99909049568,0.999920678988,0.999682841738,0.999492643328,559.050252677
4850,0.00013231937106,0.000308620871063,0.000406668118712,0.999857833381,0.999431495168,0.99909049568,0.999920678988,0.999682841738,0.999492643328,560.084366285
4860,0.000131551323421,0.000303231719105,0.000398021795717,0.999857833381,0.999431495168,0.99909049568,0.999920678988,0.999682841738,0.999492643328,561.099607384
4870,0.000130452691374,0.000305042229048,0.000383638085391,0.999857833381,0.999431495168,0.99909049568,0.999920678988,0.999682841738,0.999492643328,562.104170351
4880,0.000129566465091,0.0003052071142,0.000378671773782,0.999857833381,0.999431495168,0.99954524784,0.999920678988,0.999682841738,0.999746257295,563.125502516
4890,0.000128688861924,0.000298460281103,0.00038251279015,0.999857833381,0.999431495168,0.99954524784,0.999920678988,0.999682841738,0.999746257295,564.167823141
4900,0.000127748195019,0.000298698440775,0.000387349182267,0.999857833381,0.999431495168,0.99909049568,0.999920678988,0.999682841738,0.999492643328,565.185181769
4910,0.000128530527657,0.000295532671052,0.000388305012594,0.999857833381,0.999431495168,0.99909049568,0.999920678988,0.999682841738,0.999492643328,566.201271853
4920,0.000126799860979,0.000296132588532,0.000378165983911,0.999857833381,0.999431495168,0.99954524784,0.999920678988,0.999682841738,0.999746257295,567.243026749
4930,0.000128059677591,0.000293721764267,0.000378097024591,0.999857833381,0.999431495168,0.99954524784,0.999920678988,0.999682841738,0.999746257295,568.261556345
4940,0.000125638306515,0.000293343096916,0.000348289311049,0.999857833381,0.999431495168,0.99954524784,0.999920678988,0.999682841738,0.999746257295,569.278399423
4950,0.000125829019237,0.000292280683754,0.000347751819862,0.999857833381,0.999431495168,0.99954524784,0.999920678988,0.999682841738,0.999746257295,570.309853869
4960,0.000124710956734,0.000292585626431,0.00034295301964,0.999857833381,0.999431495168,0.99954524784,0.999920678988,0.999682841738,0.999746257295,571.332501591
4970,0.000131589855148,0.000287981150936,0.000309718878608,0.999857833381,0.999431495168,0.99954524784,0.999920678988,0.999682841738,0.999746257295,572.350724619
4980,0.000124194672392,0.000290290325224,0.000337427366261,0.999857833381,0.999431495168,0.99954524784,0.999920678988,0.999682841738,0.999746257295,573.376787651
4990,0.000124002364029,0.000289769193526,0.000336851101343,0.999857833381,0.999431495168,0.99954524784,0.999920678988,0.999682841738,0.999746257295,574.5634675
5000,0.000123461262872,0.000286755792369,0.000339862294188,0.999857833381,0.999431495168,0.99954524784,0.999920678988,0.999682841738,0.999746257295,575.595936463
