iterations,fitness,time,fevals
0,21.0,0.003776793,727
10,22.0,0.00583072000001,1345
20,25.0,0.00777245,1989
30,24.0,0.00954193300001,2617
40,23.0,0.011289687,3251
50,23.0,0.013566034,3882
60,23.0,0.015370283,4512
70,23.0,0.017146877,5147
80,23.0,0.02025009,5768
90,25.0,0.022011277,6395
100,26.0,0.023743624,7028
110,26.0,0.025698391,7649
120,28.0,0.027467478,8281
130,27.0,0.029555776,8913
140,27.0,0.031307086,9545
150,28.0,0.033076569,10185
160,31.0,0.036531781,10811
170,30.0,0.038421363,11450
180,35.0,0.040182154,12083
190,35.0,0.041915686,12715
200,35.0,0.043666206,13356
210,38.0,0.045451491,13997
220,37.0,0.047310258,14629
230,38.0,0.04935905,15266
240,38.0,0.05248162,15906
250,39.0,0.054148782,16544
260,39.0,0.056214561,17176
270,40.0,0.057903847,17802
280,41.0,0.059612095,18437
290,41.0,0.061274121,19065
300,39.0,0.06292074,19687
310,40.0,0.064829285,20305
320,41.0,0.067649632,20941
330,42.0,0.069336547,21575
340,42.0,0.071023857,22208
350,42.0,0.073439662,22835
360,42.0,0.075703763,23454
370,42.0,0.07749458,24083
380,43.0,0.079271569,24710
390,44.0,0.082455769,25352
400,44.0,0.084117795,25980
410,45.0,0.086046093,26602
420,44.0,0.087784366,27226
430,43.0,0.089410046,27856
440,43.0,0.091089849,28486
450,42.0,0.092913455,29120
460,43.0,0.094738247,29756
470,43.0,0.098325805,30388
480,42.0,0.100239485,31013
490,42.0,0.102043338,31650
500,42.0,0.103862599,32291
510,42.0,0.105776675,32932
520,42.0,0.107431195,33562
530,43.0,0.109103097,34203
540,44.0,0.11077658,34835
550,44.0,0.113978953,35467
560,43.0,0.115680485,36103
570,44.0,0.118383104,36742
580,44.0,0.120090958,37381
590,44.0,0.122464096,38017
600,45.0,0.124230418,38642
610,45.0,0.126017284,39271
620,46.0,0.127706569,39895
630,44.0,0.130531263,40516
640,44.0,0.132237931,41153
650,46.0,0.134266179,41773
660,45.0,0.136914279,42412
670,46.0,0.139032206,43056
680,46.0,0.140847912,43682
690,47.0,0.142549839,44314
700,46.0,0.144224507,44940
710,46.0,0.147102139,45561
720,46.0,0.148767721,46189
730,47.0,0.150490981,46821
740,47.0,0.152186587,47446
750,47.0,0.153855724,48070
760,48.0,0.155539083,48701
770,47.0,0.158220369,49330
780,47.0,0.159923087,49967
790,47.0,0.163177608,50604
800,47.0,0.164836473,51240
810,47.0,0.16650245,51871
820,47.0,0.168806847,52498
830,47.0,0.170460182,53123
840,47.0,0.172433517,53756
850,47.0,0.174080135,54382
860,48.0,0.175750852,55010
870,48.0,0.178879743,55644
880,48.0,0.180532682,56262
890,48.0,0.182239351,56890
900,48.0,0.183855155,57505
910,48.0,0.185530218,58136
920,48.0,0.187328541,58771
930,47.0,0.188989382,59395
940,47.0,0.190826815,60030
950,46.0,0.193513237,60656
960,46.0,0.195138127,61280
970,47.0,0.19674682,61916
980,46.0,0.198599265,62551
990,46.0,0.200703366,63177
1000,45.0,0.202391467,63798
1010,46.0,0.204264061,64417
1020,46.0,0.207330138,65046
1030,47.0,0.209086584,65674
1040,48.0,0.210763227,66307
1050,47.0,0.212439871,66931
1060,48.0,0.21456807,67575
1070,48.0,0.216334787,68192
1080,49.0,0.218013801,68820
1090,48.0,0.219701506,69455
1100,48.0,0.222582299,70082
1110,49.0,0.225028523,70710
1120,51.0,0.226679488,71330
1130,49.0,0.228384575,71964
1140,50.0,0.230247687,72601
1150,50.0,0.232312281,73232
1160,50.0,0.234296283,73866
1170,49.0,0.236794655,74504
1180,49.0,0.240422114,75135
1190,50.0,0.242174215,75761
1200,50.0,0.243911303,76401
1210,49.0,0.245604539,77033
1220,51.0,0.247374812,77658
1230,49.0,0.249047899,78281
1240,51.0,0.250713481,78915
1250,51.0,0.252564347,79534
1260,51.0,0.255405239,80156
1270,51.0,0.257077932,80781
1280,53.0,0.25868702,81403
1290,51.0,0.260446231,82020
1300,50.0,0.262549541,82646
1310,50.0,0.264223024,83280
1320,50.0,0.265865692,83918
1330,51.0,0.267484657,84545
1340,50.0,0.270646733,85171
1350,50.0,0.272310735,85807
1360,51.0,0.273927724,86428
1370,51.0,0.275598441,87064
1380,51.0,0.277284566,87701
1390,51.0,0.279029555,88331
1400,53.0,0.281592718,88971
1410,53.0,0.283314794,89596
1420,52.0,0.286139882,90231
1430,52.0,0.287754106,90853
1440,52.0,0.289710058,91474
1450,54.0,0.291394602,92117
1460,57.0,0.293200826,92756
1470,57.0,0.294872334,93389
1480,57.0,0.296518558,94013
1490,54.0,0.298181769,94639
1500,58.0,0.301202809,95274
1510,57.0,0.30334207,95893
1520,60.0,0.305006861,96513
1530,58.0,0.307658122,97135
1540,58.0,0.309688346,97760
1550,60.0,0.311511952,98387
1560,58.0,0.313161336,99010
1570,59.0,0.31487314,99645
1580,59.0,0.31652529,100264
1590,59.0,0.319178527,100889
1600,60.0,0.320826331,101522
1610,60.0,0.322471765,102152
1620,60.0,0.324090729,102781
1630,60.0,0.325736163,103420
1640,61.0,0.327749794,104055
1650,63.0,0.33058871,104685
1660,61.0,0.332449453,105329
1670,60.0,0.334147825,105967
1680,60.0,0.335846987,106587
1690,60.0,0.337661112,107216
1700,60.0,0.339700818,107843
1710,59.0,0.341505461,108474
1720,61.0,0.343590203,109104
1730,61.0,0.346373415,109746
1740,61.0,0.348064281,110373
1750,61.0,0.349740134,111000
1760,61.0,0.351385962,111630
1770,60.0,0.353083149,112267
1780,60.0,0.355183299,112895
1790,65.0,0.356812535,113524
1800,60.0,0.358816685,114158
1810,65.0,0.361587255,114794
1820,61.0,0.363224392,115431
1830,60.0,0.365579752,116058
1840,60.0,0.367201086,116680
1850,61.0,0.368984001,117307
1860,63.0,0.370606521,117937
1870,61.0,0.372235362,118575
1880,63.0,0.375068352,119197
1890,64.0,0.377810477,119838
1900,68.0,0.379476849,120471
1910,65.0,0.381092258,121096
1920,66.0,0.382717149,121737
1930,68.0,0.384495719,122360
1940,70.0,0.386254535,122998
1950,74.0,0.387839524,123622
1960,75.0,0.389794291,124262
1970,76.0,0.392530886,124882
1980,75.0,0.39408585,125502
1990,76.0,0.395828469,126130
2000,76.0,0.397438347,126758
2010,76.0,0.399050595,127395
2020,76.0,0.401213165,128038
2030,76.0,0.403095636,128664
2040,76.0,0.404885266,129291
2050,76.0,0.407687837,129929
2060,76.0,0.409272826,130550
2070,76.0,0.41085742,131169
2080,76.0,0.412447149,131795
2090,76.0,0.414037273,132415
2100,76.0,0.415621867,133055
2110,77.0,0.417222658,133684
2120,76.0,0.418825425,134323
2130,76.0,0.422429181,134937
2140,76.0,0.424041034,135564
2150,76.0,0.425795109,136193
2160,75.0,0.427516789,136814
2170,76.0,0.429100593,137450
2180,76.0,0.430691113,138095
2190,76.0,0.432381978,138730
2200,76.0,0.435045486,139354
2210,76.0,0.436768747,139984
2220,76.0,0.438371514,140615
2230,76.0,0.439944652,141232
2240,75.0,0.4417489,141866
2250,76.0,0.444201446,142493
2260,75.0,0.446224954,143113
2270,75.0,0.447853004,143728
2280,76.0,0.450479771,144357
2290,76.0,0.452746637,144992
2300,77.0,0.45436165,145620
2310,77.0,0.456457849,146255
2320,77.0,0.458154245,146876
2330,77.0,0.460245308,147516
2340,77.0,0.462244717,148151
2350,78.0,0.464401756,148782
2360,78.0,0.467781907,149400
2370,77.0,0.469360575,150020
2380,76.0,0.470959787,150660
2390,77.0,0.472554653,151276
2400,77.0,0.474140037,151904
2410,77.0,0.475734112,152544
2420,77.0,0.477359793,153186
2430,78.0,0.478956239,153809
2440,79.0,0.482701032,154442
2450,78.0,0.484272589,155072
2460,78.0,0.485880096,155707
2470,78.0,0.487610073,156344
2480,75.0,0.489185185,156968
2490,76.0,0.490954668,157593
2500,75.0,0.49252504,158217
2510,75.0,0.494095411,158854
2520,75.0,0.496980944,159479
2530,74.0,0.498736995,160104
2540,76.0,0.500328305,160726
2550,76.0,0.502046825,161371
2560,77.0,0.503986975,161997
2570,75.0,0.506627965,162624
2580,77.0,0.508554287,163252
2590,79.0,0.510404758,163878
2600,77.0,0.513210488,164520
2610,77.0,0.514772168,165141
2620,77.0,0.51682017,165767
2630,77.0,0.518542245,166397
2640,78.0,0.52013553,167034
2650,77.0,0.521697606,167657
2660,78.0,0.523271139,168287
2670,78.0,0.524814647,168907
2680,78.0,0.527809612,169554
2690,78.0,0.529401712,170183
2700,78.0,0.531757467,170821
2710,78.0,0.533287542,171440
2720,77.0,0.534861075,172068
2730,77.0,0.53645278,172702
2740,77.0,0.53807767,173341
2750,77.0,0.539693474,173977
2760,77.0,0.542381082,174596
2770,77.0,0.544016243,175217
2780,77.0,0.546334467,175850
2790,77.0,0.547899308,176469
2800,77.0,0.549492989,177105
2810,78.0,0.551073237,177730
2820,77.0,0.552667707,178346
2830,78.0,0.555432746,178975
2840,78.0,0.557016155,179602
2850,77.0,0.558625242,180244
2860,78.0,0.560213787,180862
2870,79.0,0.562227023,181485
2880,79.0,0.564291617,182111
2890,77.0,0.566119569,182750
2900,77.0,0.567693891,183378
2910,78.0,0.570438783,184010
2920,78.0,0.572284512,184644
2930,78.0,0.573876217,185264
2940,77.0,0.575902885,185892
2950,78.0,0.577485108,186521
2960,77.0,0.579056269,187151
2970,77.0,0.580684319,187781
2980,77.0,0.582330938,188413
2990,77.0,0.585730842,189044
3000,77.0,0.58730872,189689
3010,78.0,0.588940326,190333
3020,77.0,0.590520179,190961
3030,77.0,0.59230981,191593
3040,76.0,0.594534009,192223
3050,77.0,0.596120183,192844
3060,76.0,0.59769095,193473
3070,77.0,0.600377767,194101
3080,77.0,0.602223102,194727
3090,77.0,0.603783597,195353
3100,77.0,0.605359105,195990
3110,77.0,0.607419748,196623
3120,78.0,0.609163157,197249
3130,78.0,0.610727208,197872
3140,77.0,0.612244247,198503
3150,77.0,0.615180744,199133
3160,77.0,0.616739659,199757
3170,78.0,0.618415512,200394
3180,77.0,0.619981143,201024
3190,77.0,0.621547169,201650
3200,77.0,0.623123466,202280
3210,77.0,0.625350826,202912
3220,77.0,0.626935814,203543
3230,77.0,0.629733643,204176
3240,77.0,0.631300459,204814
3250,77.0,0.632875966,205440
3260,77.0,0.634984017,206071
3270,77.0,0.636570586,206713
3280,76.0,0.63856723,207346
3290,77.0,0.640109158,207960
3300,77.0,0.64171232,208594
3310,78.0,0.644988964,209222
3320,77.0,0.646569212,209845
3330,78.0,0.648171189,210490
3340,79.0,0.650384326,211115
3350,78.0,0.652420476,211738
3360,79.0,0.653984921,212359
3370,79.0,0.655620872,213003
3380,79.0,0.657370207,213638
3390,80.0,0.65894611,214277
3400,80.0,0.660687544,214908
3410,80.0,0.662665224,215540
3420,81.0,0.664499892,216187
3430,82.0,0.666072634,216810
3440,81.0,0.667763104,217454
3450,82.0,0.669336636,218089
3460,80.0,0.672020293,218717
3470,80.0,0.673593825,219353
3480,81.0,0.675224641,219987
3490,81.0,0.676800149,220616
3500,80.0,0.679038966,221238
3510,80.0,0.680608943,221873
3520,80.0,0.6821805,222501
3530,80.0,0.683884403,223124
3540,80.0,0.686550282,223747
3550,81.0,0.68841616,224369
3560,80.0,0.689986927,224999
3570,80.0,0.691571521,225630
3580,82.0,0.69319009,226270
3590,80.0,0.694906634,226887
3600,81.0,0.696519672,227521
3610,81.0,0.69841834,228149
3620,80.0,0.701140318,228778
3630,81.0,0.702658542,229396
3640,81.0,0.704862198,230030
3650,82.0,0.706963138,230670
3660,81.0,0.708541412,231301
3670,80.0,0.710115735,231927
3680,80.0,0.711805811,232557
3690,81.0,0.713533812,233185
3700,80.0,0.716726703,233806
3710,80.0,0.71832947,234433
3720,81.0,0.719910114,235062
3730,81.0,0.721923745,235687
3740,81.0,0.723676636,236320
3750,80.0,0.725254119,236939
3760,81.0,0.726832787,237571
3770,80.0,0.728422122,238199
3780,80.0,0.731237334,238828
3790,80.0,0.733939559,239463
3800,80.0,0.735536795,240099
3810,80.0,0.737115068,240726
3820,80.0,0.738713094,241357
3830,81.0,0.740489293,241999
3840,80.0,0.74253453,242626
3850,80.0,0.744132161,243258
3860,80.0,0.74689641,243893
3870,81.0,0.748922683,244523
3880,80.0,0.750534141,245156
3890,80.0,0.752127821,245789
3900,79.0,0.753710439,246411
3910,78.0,0.755265799,247035
3920,78.0,0.757486443,247673
3930,79.0,0.759193111,248311
3940,78.0,0.761810397,248936
3950,78.0,0.763558151,249564
3960,77.0,0.765274695,250188
3970,78.0,0.766863239,250819
3980,76.0,0.76846166,251457
3990,76.0,0.77018413,252086
4000,76.0,0.771769909,252716
4010,76.0,0.774486355,253354
4020,76.0,0.776082801,253990
4030,76.0,0.777674111,254622
4040,76.0,0.77926068,255248
4050,76.0,0.780836978,255878
4060,76.0,0.782807548,256510
4070,77.0,0.786121328,257135
4080,77.0,0.787710663,257767
4090,77.0,0.790308196,258392
4100,77.0,0.792895852,259012
4110,78.0,0.794589878,259638
4120,78.0,0.796178027,260271
4130,78.0,0.79778751,260916
4140,77.0,0.799822079,261546
4150,78.0,0.80157892,262181
4160,77.0,0.803163909,262821
4170,77.0,0.80644727,263453
4180,78.0,0.808028704,264081
4190,79.0,0.809934483,264715
4200,78.0,0.811717398,265352
4210,77.0,0.813313053,265990
4220,78.0,0.81558861,266615
4230,78.0,0.817166487,267245
4240,78.0,0.818859723,267885
4250,78.0,0.822077108,268513
4260,80.0,0.823775875,269148
4270,82.0,0.825440272,269782
4280,78.0,0.827246496,270409
4290,79.0,0.828806201,271027
4300,79.0,0.830511684,271662
4310,80.0,0.832298549,272304
4320,80.0,0.834047489,272927
4330,80.0,0.836799096,273554
4340,80.0,0.838456776,274188
4350,80.0,0.840168185,274820
4360,80.0,0.841802162,275452
4370,79.0,0.843381225,276084
4380,80.0,0.845483745,276718
4390,79.0,0.847378858,277351
4400,79.0,0.848983995,277991
4410,80.0,0.85159654,278616
4420,79.0,0.853155455,279250
4430,79.0,0.854704493,279875
4440,80.0,0.856306469,280514
4450,79.0,0.857859853,281127
4460,79.0,0.859458669,281758
4470,79.0,0.861046424,282388
4480,80.0,0.862642475,283020
4490,80.0,0.865975614,283643
4500,79.0,0.867789739,284283
4510,80.0,0.869375913,284919
4520,80.0,0.870960111,285562
4530,81.0,0.872552211,286188
4540,81.0,0.874459175,286814
4550,81.0,0.876058386,287455
4560,80.0,0.87761572,288085
4570,80.0,0.880708266,288708
4580,80.0,0.882281008,289336
4590,81.0,0.884632417,289973
4600,80.0,0.886187381,290599
4610,80.0,0.88786995,291241
4620,80.0,0.889443087,291868
4630,80.0,0.891082595,292515
4640,81.0,0.893985906,293150
4650,80.0,0.895557858,293775
4660,80.0,0.897147983,294413
4670,80.0,0.898739688,295046
4680,80.0,0.900304529,295679
4690,80.0,0.901891493,296317
4700,80.0,0.903769618,296957
4710,80.0,0.905315891,297581
4720,80.0,0.908066313,298216
4730,80.0,0.909715697,298842
4740,79.0,0.911284094,299474
4750,79.0,0.912846169,300099
4760,79.0,0.914413775,300733
4770,81.0,0.915996394,301370
4780,80.0,0.918969235,301997
4790,79.0,0.920837088,302613
4800,80.0,0.923569732,303239
4810,80.0,0.925167363,303870
4820,80.0,0.926729438,304498
4830,80.0,0.928311662,305135
4840,80.0,0.929881244,305757
4850,80.0,0.93167127,306371
4860,80.0,0.933245592,306990
4870,82.0,0.934814779,307618
4880,80.0,0.938462781,308243
4890,80.0,0.940029992,308867
4900,81.0,0.941796314,309490
4910,81.0,0.943359574,310112
4920,81.0,0.944949699,310753
4930,81.0,0.946874837,311379
4940,81.0,0.948430197,312001
4950,81.0,0.949992667,312636
4960,81.0,0.953140917,313265
4970,81.0,0.954693906,313889
4980,81.0,0.956270994,314522
4990,82.0,0.959164823,315153
5000,82.0,0.960724923,315764
