k,GMM,Kmeans
2,0.0010857339147999597,-0.00014713259148915444
3,0.0011133018553649329,-0.00090769636446949
4,0.0007346976431281231,-0.0016534718096596196
5,0.0064089160989576595,0.0163798504966812
6,0.01713430399969708,0.002542413781255293
7,0.009919009128573788,0.02245933079089791
8,0.013242784194363344,0.029633369076081415
9,0.004675066254791152,0.034562807523522775
10,0.02607896280284278,0.01820826039143897
15,0.016585433176156437,0.03391175150188836
20,0.03205834094608579,0.03394935497599232
25,0.019783963162708248,0.03325933025897967
30,0.03897231986491358,0.04394913736934673
35,0.0430525695735286,0.043386315391248854
40,0.04063846210704154,0.03758937901809023
