1,1.6782792888627842
2,1.6569925952365496
3,1.6164282774946033
4,1.4051521812394128
5,1.162371269272872
6,1.089848676058623
7,1.079182398669762
8,1.0476699428641771
9,1.0242265600663334
10,1.001296846281336
11,0.9966240494556955
12,0.9739801415439783
13,0.9522232813556759
14,0.9126489927540725
15,0.8844996625210967
16,0.8429632084991255
17,0.4936713271184575
18,0.4606847963895406
19,0.405996637236214
20,0.32955579274090746
