param_SVM__max_iter,train acc,test acc
1,0.639375,0.73
2,0.698125,0.6375
4,0.7225,0.66
8,0.6925,0.755
16,0.761875,0.7525
32,0.79,0.7625
64,0.850625,0.8275
128,0.859375,0.8275
256,0.8675,0.83
512,0.866875,0.8275
1024,0.866875,0.8275
2048,0.866875,0.8275
