iterations,fitness,time,fevals
0,543.0,0.016103124,648
10,538.0,0.031850297,1198
20,539.0,0.045912925,1745
30,540.0,0.06358405,2292
40,535.0,0.078633148,2840
50,531.0,0.093248074,3387
60,533.0,0.107464381,3944
70,538.0,0.121646318,4497
80,532.0,0.136626675,5055
90,537.0,0.151073304,5606
100,533.0,0.164500278,6157
110,533.0,0.178891598,6704
120,536.0,0.192512152,7256
130,539.0,0.205827718,7793
140,541.0,0.219739828,8347
150,539.0,0.233597814,8896
160,543.0,0.248550122,9447
170,541.0,0.261657095,9992
180,544.0,0.276273205,10533
190,544.0,0.290451982,11088
200,548.0,0.304781277,11634
210,549.0,0.318625041,12174
220,543.0,0.333486879,12728
230,535.0,0.347452717,13276
240,539.0,0.362120976,13819
250,537.0,0.377223803,14370
260,535.0,0.39130342,14913
270,537.0,0.404629653,15459
280,537.0,0.417691194,16005
290,537.0,0.432793231,16556
300,537.0,0.447487564,17097
310,533.0,0.461393353,17644
320,537.0,0.475231192,18196
330,535.0,0.489618167,18742
340,537.0,0.504033586,19293
350,537.0,0.517853646,19839
360,537.0,0.554383452,20380
370,537.0,0.568340994,20932
380,537.0,0.580265941,21481
390,537.0,0.593453507,22030
400,535.0,0.608660631,22575
410,537.0,0.622304889,23126
420,537.0,0.636060949,23673
430,537.0,0.64922244,24222
440,535.0,0.663178402,24774
450,535.0,0.676891795,25321
460,539.0,0.689800842,25869
470,539.0,0.704029001,26419
480,537.0,0.718098345,26958
490,537.0,0.731852035,27510
500,541.0,0.746054515,28058
510,539.0,0.759305291,28608
520,541.0,0.772414239,29158
530,541.0,0.788607042,29708
540,541.0,0.801347398,30256
550,537.0,0.814613186,30799
560,539.0,0.827659715,31347
570,535.0,0.842968764,31894
580,537.0,0.856834256,32442
590,537.0,0.870905181,32981
600,537.0,0.883580747,33530
610,539.0,0.89659093,34075
620,537.0,0.908926348,34626
630,537.0,0.922971594,35169
640,539.0,0.935881827,35720
650,537.0,0.950681247,36272
660,539.0,0.966082345,36819
670,539.0,0.979883443,37366
680,541.0,0.993055602,37914
690,539.0,1.006554477,38462
700,539.0,1.020019377,39013
710,541.0,1.033070646,39563
720,539.0,1.046239645,40117
730,539.0,1.058808544,40661
740,537.0,1.071808456,41209
750,537.0,1.086558492,41760
760,539.0,1.099655588,42318
770,539.0,1.113022908,42868
780,537.0,1.131844849,43409
790,543.0,1.147775726,43960
800,541.0,1.160909564,44506
810,545.0,1.174124389,45057
820,545.0,1.186848547,45610
830,543.0,1.199794335,46157
840,543.0,1.213949408,46698
850,543.0,1.226676331,47246
860,543.0,1.239517823,47795
870,541.0,1.252831809,48341
880,541.0,1.266162388,48886
890,541.0,1.279729609,49426
900,541.0,1.29295194,49975
910,541.0,1.306433037,50519
920,541.0,1.319498529,51080
930,543.0,1.357747646,51624
940,539.0,1.372063114,52180
950,539.0,1.386734928,52724
960,535.0,1.402235978,53274
970,537.0,1.420563696,53825
980,537.0,1.434185435,54382
990,539.0,1.448802335,54930
1000,539.0,1.461694,55477
1010,541.0,1.474944775,56030
1020,537.0,1.487838415,56573
1030,535.0,1.500939068,57128
1040,537.0,1.515960907,57682
1050,535.0,1.529088028,58225
1060,535.0,1.544047842,58770
1070,541.0,1.557795606,59329
1080,537.0,1.571126184,59882
1090,539.0,1.584714343,60424
1100,537.0,1.598179638,60966
1110,539.0,1.61410696,61513
1120,539.0,1.627531168,62067
1130,539.0,1.640751524,62614
1140,539.0,1.654012966,63157
1150,537.0,1.668203199,63710
1160,539.0,1.685045879,64261
1170,539.0,1.699503964,64810
1180,541.0,1.713748321,65352
1190,543.0,1.729461519,65901
1200,545.0,1.744026666,66457
1210,545.0,1.756991812,67011
1220,543.0,1.770453156,67559
1230,545.0,1.784345908,68110
1240,545.0,1.797051498,68650
1250,545.0,1.810458718,69199
1260,545.0,1.823707519,69753
1270,545.0,1.837482542,70309
1280,545.0,1.851507244,70860
1290,549.0,1.864525328,71409
1300,549.0,1.879967513,71956
1310,551.0,1.893078832,72503
1320,553.0,1.905518941,73054
1330,551.0,1.918283001,73591
1340,553.0,1.93095027,74140
1350,553.0,1.944914923,74684
1360,553.0,1.957686094,75230
1370,553.0,1.97160887,75773
1380,553.0,1.986182314,76320
1390,551.0,1.999228448,76875
1400,553.0,2.011293248,77422
1410,555.0,2.024731679,77968
1420,555.0,2.037870652,78522
1430,555.0,2.052839948,79074
1440,555.0,2.066189094,79625
1450,557.0,2.079235623,80181
1460,557.0,2.095805315,80729
1470,555.0,2.108948239,81282
1480,557.0,2.146330589,81839
1490,555.0,2.160613267,82384
1500,557.0,2.174034315,82934
1510,555.0,2.186898721,83482
1520,555.0,2.200075226,84032
1530,557.0,2.213657459,84575
1540,557.0,2.228776878,85120
1550,555.0,2.24372405,85662
1560,555.0,2.257528703,86215
1570,555.0,2.27170906,86770
1580,557.0,2.28626117,87312
1590,557.0,2.299879748,87857
1600,557.0,2.312823165,88399
1610,557.0,2.326380114,88948
1620,557.0,2.339992767,89501
1630,557.0,2.354300334,90050
1640,557.0,2.367544789,90597
1650,557.0,2.380409589,91149
1660,557.0,2.394594291,91699
1670,557.0,2.407234301,92248
1680,559.0,2.422339103,92798
1690,561.0,2.435769237,93347
1700,561.0,2.448645099,93898
1710,565.0,2.461826739,94452
1720,563.0,2.47526517,95000
1730,563.0,2.489077724,95547
1740,561.0,2.502058277,96100
1750,565.0,2.516407325,96640
1760,563.0,2.530565954,97192
1770,565.0,2.54407431,97738
1780,567.0,2.557176147,98287
1790,565.0,2.570904947,98834
1800,563.0,2.583840858,99387
1810,563.0,2.598856376,99941
1820,565.0,2.612559498,100499
1830,563.0,2.626481089,101048
1840,563.0,2.640514087,101594
1850,565.0,2.656020272,102138
1860,565.0,2.671026308,102696
1870,569.0,2.684583257,103242
1880,567.0,2.698537638,103800
1890,565.0,2.712041649,104347
1900,565.0,2.725148227,104900
1910,565.0,2.738998312,105441
1920,565.0,2.75293215,105985
1930,567.0,2.767260261,106529
1940,567.0,2.805606168,107072
1950,567.0,2.819528945,107621
1960,569.0,2.832878882,108167
1970,565.0,2.845856275,108725
1980,567.0,2.859149323,109268
1990,565.0,2.873249088,109822
2000,565.0,2.885513789,110362
2010,567.0,2.900632418,110915
2020,569.0,2.913269267,111460
2030,567.0,2.926138413,112005
2040,567.0,2.939945831,112561
2050,567.0,2.954445398,113103
2060,569.0,2.968847779,113648
2070,567.0,2.981516628,114205
2080,569.0,2.994047206,114756
2090,569.0,3.00674845,115303
2100,565.0,3.019851868,115855
2110,565.0,3.032296717,116394
2120,569.0,3.046051987,116944
2130,567.0,3.058802614,117488
2140,567.0,3.072065242,118041
2150,567.0,3.084983375,118584
2160,567.0,3.098188719,119128
2170,567.0,3.110691247,119672
2180,567.0,3.124618369,120224
2190,569.0,3.13805996,120777
2200,569.0,3.152845157,121331
2210,569.0,3.165370599,121879
2220,569.0,3.178494559,122431
2230,569.0,3.192627508,122986
2240,571.0,3.205762926,123536
2250,565.0,3.219156319,124080
2260,569.0,3.232339144,124630
2270,569.0,3.245412932,125175
2280,569.0,3.258090868,125719
2290,571.0,3.273719523,126271
2300,569.0,3.286338595,126818
2310,571.0,3.300435594,127369
2320,569.0,3.315027211,127920
2330,567.0,3.330396309,128470
2340,567.0,3.343247677,129021
2350,565.0,3.356023194,129575
2360,563.0,3.36920839,130126
2370,565.0,3.38204356,130675
2380,565.0,3.3950012,131215
2390,565.0,3.409178792,131773
2400,565.0,3.422236382,132318
2410,563.0,3.436159949,132865
2420,563.0,3.47399109,133414
2430,563.0,3.487868039,133960
2440,563.0,3.501216,134514
2450,565.0,3.516655419,135058
2460,569.0,3.53003301,135607
2470,569.0,3.543649218,136149
2480,569.0,3.556863648,136701
2490,569.0,3.570355017,137255
2500,567.0,3.582787225,137797
2510,567.0,3.595529951,138339
2520,571.0,3.60834932,138878
2530,569.0,3.62143812,139420
2540,571.0,3.634596847,139966
2550,571.0,3.647638635,140523
2560,575.0,3.66040941,141075
2570,567.0,3.674726853,141627
2580,569.0,3.688412592,142177
2590,569.0,3.702495369,142730
2600,569.0,3.716920269,143277
2610,565.0,3.7297586,143820
2620,565.0,3.742654215,144370
2630,567.0,3.755497682,144915
2640,569.0,3.769229643,145459
2650,569.0,3.782198739,146007
2660,569.0,3.795750947,146555
2670,569.0,3.808679747,147108
2680,569.0,3.821608942,147647
2690,569.0,3.834433051,148187
2700,571.0,3.847719382,148736
2710,571.0,3.861200084,149284
2720,571.0,3.876189133,149827
2730,573.0,3.889238032,150365
2740,571.0,3.902075968,150916
2750,573.0,3.915319633,151464
2760,573.0,3.928953224,152015
2770,573.0,3.942034913,152560
2780,573.0,3.954768158,153102
2790,575.0,3.96684718,153650
2800,577.0,3.980502499,154200
2810,577.0,3.993776979,154751
2820,578.0,4.006239211,155293
2830,578.0,4.019069245,155846
2840,577.0,4.032564959,156400
2850,575.0,4.047533464,156939
2860,577.0,4.061736339,157477
2870,574.0,4.074739016,158023
2880,575.0,4.114982011,158566
2890,575.0,4.129143009,159121
2900,574.0,4.143603465,159667
2910,574.0,4.156992908,160206
2920,578.0,4.169964376,160743
2930,576.0,4.183503152,161301
2940,575.0,4.196537039,161851
2950,576.0,4.208921839,162396
2960,577.0,4.222003133,162937
2970,578.0,4.239365319,163492
2980,576.0,4.254471702,164038
2990,579.0,4.268524453,164590
3000,578.0,4.281045944,165141
