iterations,fitness,time,fevals
0,23.0,0.001387458,464
10,23.0,0.002795459,826
20,24.0,0.004174226,1184
30,26.0,0.005494523,1559
40,28.0,0.006756351,1919
50,31.0,0.00929502,2283
60,28.0,0.010623614,2656
70,28.0,0.013196653,3019
80,29.0,0.014748457,3387
90,28.0,0.015984607,3758
100,29.0,0.017216015,4124
110,30.0,0.018492065,4489
120,29.0,0.019880708,4851
130,29.0,0.022720018,5219
140,30.0,0.023967624,5591
150,30.0,0.02524644,5953
160,30.0,0.026501948,6325
170,31.0,0.027773257,6687
180,30.0,0.029569604,7060
190,30.0,0.031810396,7426
200,31.0,0.033004273,7787
210,30.0,0.035641707,8156
220,31.0,0.036896029,8524
230,31.0,0.038102154,8888
240,31.0,0.039341463,9260
250,32.0,0.040753414,9635
260,32.0,0.042369218,10009
270,32.0,0.043697812,10380
280,32.0,0.045010209,10747
290,37.0,0.047779989,11107
300,37.0,0.048999151,11472
310,38.0,0.050338806,11829
320,38.0,0.051567844,12195
330,38.0,0.05278582,12554
340,38.0,0.053976537,12920
350,38.0,0.05524271,13280
360,38.0,0.056625032,13639
370,39.0,0.059192146,13994
380,39.0,0.060422369,14360
390,39.0,0.061630863,14727
400,39.0,0.06285911,15093
410,39.0,0.064156494,15463
420,40.0,0.065876199,15824
430,40.0,0.067157386,16186
440,40.0,0.068424745,16558
450,40.0,0.07093971,16924
460,39.0,0.072142279,17290
470,39.0,0.073341292,17655
480,39.0,0.074543466,18022
490,39.0,0.075736949,18387
500,39.0,0.076931222,18746
510,39.0,0.078436408,19120
520,40.0,0.079672162,19491
530,39.0,0.082084016,19858
540,39.0,0.084007573,20232
550,40.0,0.085229895,20602
560,40.0,0.08644076,20969
570,39.0,0.087665057,21343
580,38.0,0.089374096,21715
590,38.0,0.091041653,22078
600,38.0,0.092271481,22442
610,39.0,0.094821212,22807
620,38.0,0.096067238,23168
630,38.0,0.097382399,23530
640,38.0,0.098601561,23891
650,38.0,0.099861809,24262
660,38.0,0.101097167,24629
670,38.0,0.102353464,25001
680,38.0,0.103566699,25363
690,39.0,0.106440776,25728
700,38.0,0.107657567,26102
710,39.0,0.108881074,26470
720,39.0,0.110387446,26839
730,39.0,0.111601867,27208
740,39.0,0.112813918,27577
750,38.0,0.114010166,27940
760,40.0,0.1152155,28299
770,40.0,0.117707156,28671
780,40.0,0.119827849,29034
790,40.0,0.121218863,29415
800,40.0,0.12244237,29782
810,39.0,0.123825877,30156
820,40.0,0.125143804,30521
830,39.0,0.126419855,30891
840,40.0,0.127646128,31257
850,40.0,0.130052056,31623
860,40.0,0.131270428,31995
870,41.0,0.132489985,32364
880,40.0,0.134280011,32726
890,40.0,0.135512604,33101
900,42.0,0.136718333,33463
910,42.0,0.137943026,33836
920,42.0,0.139156261,34200
930,41.0,0.141655424,34573
940,40.0,0.143247524,34939
950,41.0,0.144435081,35299
960,41.0,0.145649107,35671
970,41.0,0.146865503,36034
980,40.0,0.148086639,36401
990,40.0,0.149297504,36768
1000,41.0,0.15051153,37144
1010,41.0,0.151742148,37516
1020,41.0,0.152946297,37888
1030,41.0,0.154151631,38260
1040,41.0,0.155349064,38624
1050,41.0,0.157177411,38992
1060,41.0,0.158391042,39364
1070,41.0,0.159618895,39735
1080,41.0,0.162327836,40104
1090,40.0,0.163542651,40470
1100,41.0,0.1647468,40834
1110,41.0,0.165968727,41210
1120,41.0,0.167176036,41575
1130,41.0,0.168371099,41943
1140,41.0,0.17025594,42308
1150,41.0,0.1716272,42679
1160,41.0,0.174325868,43048
1170,41.0,0.175569523,43414
1180,41.0,0.176954215,43776
1190,41.0,0.178174167,44147
1200,40.0,0.179384242,44512
1210,40.0,0.180627108,44892
1220,41.0,0.18187827,45268
1230,40.0,0.183131407,45633
1240,41.0,0.186071854,45997
1250,41.0,0.18732025,46368
1260,41.0,0.188555214,46734
1270,41.0,0.189894474,47105
1280,41.0,0.191195809,47477
1290,41.0,0.192527563,47846
1300,41.0,0.193813095,48209
1310,41.0,0.195249145,48573
1320,41.0,0.197780307,48943
1330,42.0,0.199026728,49308
1340,42.0,0.200520063,49675
1350,42.0,0.201734088,50037
1360,42.0,0.202941002,50407
1370,42.0,0.204141595,50768
1380,42.0,0.20541172,51142
1390,42.0,0.206605992,51508
1400,44.0,0.209605698,51877
1410,42.0,0.210821304,52251
1420,41.0,0.212059429,52622
1430,43.0,0.213745949,52987
1440,43.0,0.214966296,53353
1450,45.0,0.216203235,53723
1460,45.0,0.21766694,54092
1470,45.0,0.218874249,54456
1480,45.0,0.221226053,54823
1490,45.0,0.222423881,55189
1500,48.0,0.223661611,55552
1510,50.0,0.224875242,55918
1520,50.0,0.226571243,56282
1530,50.0,0.228039688,56651
1540,52.0,0.229265171,57024
1550,50.0,0.230479987,57390
1560,54.0,0.232808482,57758
1570,51.0,0.234009076,58116
1580,51.0,0.235223892,58489
1590,52.0,0.236697079,58864
1600,51.0,0.237903203,59236
1610,51.0,0.239680586,59602
1620,52.0,0.241090958,59970
1630,51.0,0.242988441,60336
1640,51.0,0.246114172,60700
1650,51.0,0.247417482,61071
1660,50.0,0.248650866,61447
1670,50.0,0.249895311,61807
1680,50.0,0.251071015,62167
1690,50.0,0.252338374,62526
1700,50.0,0.253523165,62896
1710,51.0,0.255186771,63260
1720,50.0,0.258009884,63631
1730,50.0,0.25919744,63998
1740,51.0,0.26053038,64367
1750,51.0,0.261845936,64733
1760,51.0,0.263036258,65098
1770,51.0,0.264238827,65461
1780,51.0,0.265424408,65826
1790,52.0,0.266607618,66193
1800,51.0,0.26894915,66561
1810,52.0,0.270133942,66927
1820,52.0,0.271622536,67299
1830,52.0,0.272826685,67663
1840,51.0,0.274041106,68036
1850,51.0,0.275255132,68409
1860,51.0,0.276477059,68781
1870,51.0,0.277680813,69144
1880,51.0,0.28023963,69516
1890,50.0,0.281780767,69886
1900,49.0,0.283004669,70253
1910,50.0,0.284234102,70619
1920,50.0,0.285441017,70984
1930,49.0,0.286650697,71354
1940,50.0,0.28784576,71716
1950,50.0,0.290126848,72079
1960,50.0,0.292659985,72446
1970,51.0,0.29383964,72812
1980,50.0,0.295044579,73188
1990,51.0,0.296334851,73555
2000,51.0,0.297523197,73919
2010,51.0,0.298739593,74285
2020,51.0,0.300692385,74649
2030,51.0,0.301872435,75015
2040,51.0,0.304225819,75380
2050,51.0,0.305403894,75743
2060,51.0,0.306582364,76112
2070,51.0,0.307824835,76485
2080,51.0,0.309236392,76853
2090,51.0,0.310409331,77215
2100,51.0,0.311664443,77573
2110,51.0,0.312940889,77940
2120,52.0,0.315317582,78309
2130,51.0,0.316486966,78676
2140,51.0,0.317749189,79041
2150,51.0,0.31893161,79406
2160,51.0,0.320202525,79774
2170,51.0,0.321406674,80138
2180,52.0,0.322602922,80507
2190,51.0,0.323790479,80866
2200,51.0,0.326210233,81237
2210,51.0,0.327402531,81602
2220,52.0,0.32860668,81974
2230,52.0,0.329798187,82343
2240,52.0,0.330988113,82705
2250,52.0,0.332173299,83070
2260,52.0,0.333849152,83436
2270,52.0,0.335080955,83805
2280,52.0,0.337441451,84168
2290,52.0,0.339125995,84538
2300,52.0,0.340484219,84907
2310,54.0,0.341661504,85273
2320,54.0,0.342834048,85638
2330,54.0,0.344183975,86001
2340,54.0,0.345700618,86364
2350,54.0,0.34686289,86727
2360,54.0,0.349784769,87093
2370,54.0,0.351049757,87462
2380,54.0,0.352232967,87835
2390,54.0,0.3537184,88200
2400,55.0,0.354904771,88568
2410,54.0,0.356102995,88943
2420,54.0,0.357264082,89311
2430,55.0,0.35849154,89683
2440,55.0,0.360874949,90043
2450,54.0,0.36206053,90410
2460,54.0,0.36378063,90776
2470,54.0,0.365394458,91138
2480,54.0,0.36658478,91509
2490,54.0,0.367754558,91876
2500,55.0,0.368940139,92244
2510,55.0,0.370116239,92614
2520,55.0,0.372849278,92982
2530,55.0,0.374191303,93346
2540,55.0,0.375367008,93712
2550,55.0,0.37655733,94081
2560,57.0,0.377748442,94449
2570,56.0,0.378949826,94812
2580,56.0,0.380136197,95179
2590,56.0,0.381694717,95552
2600,55.0,0.384822424,95914
2610,55.0,0.386111906,96286
2620,55.0,0.387261931,96652
2630,56.0,0.388444746,97024
2640,55.0,0.390010772,97388
2650,55.0,0.39127418,97752
2660,55.0,0.392506774,98119
2670,55.0,0.393923072,98492
2680,55.0,0.396636358,98854
2690,55.0,0.397814433,99214
2700,57.0,0.399161199,99581
2710,55.0,0.400357842,99951
2720,55.0,0.401804164,100322
2730,55.0,0.402985005,100689
2740,55.0,0.404372858,101058
2750,55.0,0.405559229,101433
2760,54.0,0.407865602,101797
2770,55.0,0.409036961,102163
2780,57.0,0.410202789,102529
2790,54.0,0.41139074,102896
2800,55.0,0.412559728,103258
2810,54.0,0.414407433,103623
2820,57.0,0.415584323,103990
2830,54.0,0.416765558,104362
2840,54.0,0.420361018,104732
2850,55.0,0.421515389,105098
2860,57.0,0.422704131,105466
2870,54.0,0.423892083,105837
2880,58.0,0.425075294,106199
2890,57.0,0.426267591,106564
2900,57.0,0.428217617,106927
2910,57.0,0.429405964,107291
2920,57.0,0.43183046,107660
2930,58.0,0.433020387,108029
2940,57.0,0.434209919,108397
2950,57.0,0.435559451,108765
2960,57.0,0.437132588,109129
2970,57.0,0.43832528,109494
2980,57.0,0.439510071,109861
2990,57.0,0.440696047,110232
3000,57.0,0.443101975,110595
3010,67.0,0.444285186,110963
3020,56.0,0.445976052,111324
3030,56.0,0.447156497,111696
3040,56.0,0.448359461,112064
3050,56.0,0.449938919,112432
3060,56.0,0.451129636,112798
3070,57.0,0.452941785,113170
3080,56.0,0.456464553,113539
3090,56.0,0.457914431,113910
3100,57.0,0.459134383,114281
3110,57.0,0.460315223,114646
3120,56.0,0.461544656,115016
3130,56.0,0.462716805,115378
3140,56.0,0.46389646,115747
3150,56.0,0.465073745,116114
3160,57.0,0.467419228,116483
3170,56.0,0.468604018,116858
3180,57.0,0.469772611,117222
3190,57.0,0.470995723,117583
3200,57.0,0.472174983,117949
3210,57.0,0.473355034,118315
3220,56.0,0.474552862,118694
3230,56.0,0.475745949,119053
3240,56.0,0.478203235,119427
3250,56.0,0.479399482,119801
3260,56.0,0.480574002,120164
3270,56.0,0.481775385,120532
3280,57.0,0.482991781,120901
3290,56.0,0.484192375,121269
3300,56.0,0.485776574,121642
3310,56.0,0.488214502,122012
3320,56.0,0.490660331,122390
3330,56.0,0.491841961,122751
3340,56.0,0.493029517,123119
3350,57.0,0.494247493,123490
3360,60.0,0.495629025,123853
3370,57.0,0.496833174,124221
3380,57.0,0.498021521,124581
3390,57.0,0.49937935,124954
3400,57.0,0.502102118,125323
3410,57.0,0.50373649,125689
3420,56.0,0.505439207,126051
3430,56.0,0.50676464,126422
3440,56.0,0.508508048,126791
3450,57.0,0.510120692,127158
3460,57.0,0.511776002,127526
3470,56.0,0.516171462,127892
3480,56.0,0.517724451,128252
3490,57.0,0.519078724,128616
3500,57.0,0.520265095,128989
3510,61.0,0.52278322,129359
3520,57.0,0.524067566,129723
3530,57.0,0.525345987,130095
3540,57.0,0.526938087,130462
3550,57.0,0.529450287,130823
3560,57.0,0.530801399,131192
3570,58.0,0.532010684,131562
3580,57.0,0.533560908,131928
3590,57.0,0.534767033,132298
3600,57.0,0.535965651,132667
3610,57.0,0.537159133,133036
3620,57.0,0.538337208,133404
3630,58.0,0.541172964,133775
3640,57.0,0.542340768,134137
3650,57.0,0.543540572,134503
3660,57.0,0.544736425,134870
3670,63.0,0.545924376,135230
3680,63.0,0.547137217,135600
3690,63.0,0.548335045,135966
3700,63.0,0.549880132,136330
3710,63.0,0.552601714,136696
3720,63.0,0.553895147,137057
3730,63.0,0.555224926,137428
3740,63.0,0.556387989,137787
3750,63.0,0.557569224,138148
3760,63.0,0.55875283,138520
3770,65.0,0.560172683,138883
3780,63.0,0.56145308,139256
3790,64.0,0.563991748,139623
3800,64.0,0.565150069,139988
3810,64.0,0.566306416,140356
3820,64.0,0.567631059,140719
3830,64.0,0.568798468,141084
3840,64.0,0.569973383,141447
3850,64.0,0.571132099,141805
3860,64.0,0.572532594,142170
3870,64.0,0.574887954,142538
3880,65.0,0.576060893,142903
3890,65.0,0.577212498,143264
3900,65.0,0.578362128,143630
3910,64.0,0.579578128,143996
3920,64.0,0.581084894,144357
3930,64.0,0.582258228,144720
3940,63.0,0.583438674,145090
3950,63.0,0.58752243,145459
3960,63.0,0.588702875,145825
3970,65.0,0.589858431,146187
3980,63.0,0.591210334,146557
3990,63.0,0.59239236,146927
4000,63.0,0.593803916,147301
4010,63.0,0.59497409,147667
4020,63.0,0.596289647,148038
4030,63.0,0.598862291,148406
4040,63.0,0.600392367,148771
4050,63.0,0.601929159,149139
4060,63.0,0.603095777,149506
4070,65.0,0.604376173,149872
4080,65.0,0.605555038,150242
4090,65.0,0.60693815,150608
4100,66.0,0.608270299,150974
4110,65.0,0.610813314,151343
4120,65.0,0.612009957,151708
4130,65.0,0.613183687,152078
4140,65.0,0.614360972,152443
4150,65.0,0.615573417,152815
4160,65.0,0.616835245,153185
4170,65.0,0.618011345,153555
4180,65.0,0.619206803,153921
4190,65.0,0.622304484,154286
4200,66.0,0.623479003,154657
4210,66.0,0.624662609,155025
4220,66.0,0.625833968,155397
4230,66.0,0.627010858,155770
4240,65.0,0.628195649,156135
4250,66.0,0.629387156,156497
4260,65.0,0.630585379,156862
4270,65.0,0.633056887,157228
4280,66.0,0.634339654,157594
4290,66.0,0.635532742,157958
4300,66.0,0.636733336,158322
4310,65.0,0.638330966,158696
4320,66.0,0.639512201,159069
4330,66.0,0.640673289,159433
4340,66.0,0.641888105,159811
4350,67.0,0.644350131,160189
4360,67.0,0.645785786,160545
4370,66.0,0.646963071,160907
4380,66.0,0.648906381,161269
4390,66.0,0.650139764,161635
4400,66.0,0.651674975,161997
4410,67.0,0.653175026,162362
4420,67.0,0.65434757,162732
4430,66.0,0.656975128,163103
4440,66.0,0.658467672,163472
4450,66.0,0.659652463,163844
4460,66.0,0.662200218,164214
4470,66.0,0.663402787,164584
4480,66.0,0.664608121,164944
4490,66.0,0.665794492,165315
4500,67.0,0.666972567,165675
4510,67.0,0.669562988,166047
4520,67.0,0.670780964,166420
4530,66.0,0.672017113,166793
4540,66.0,0.673176225,167157
4550,66.0,0.674460967,167526
4560,66.0,0.675727535,167898
4570,66.0,0.676906795,168270
4580,66.0,0.678104228,168634
4590,66.0,0.680566255,169003
4600,66.0,0.681746305,169369
4610,67.0,0.682929911,169734
4620,66.0,0.684121813,170108
4630,66.0,0.685463839,170474
4640,67.0,0.686671148,170842
4650,67.0,0.687848038,171204
4660,67.0,0.689027298,171567
4670,67.0,0.691933375,171931
4680,67.0,0.693112635,172289
4690,67.0,0.694528143,172655
4700,67.0,0.695708193,173021
4710,67.0,0.696875206,173386
4720,67.0,0.698045774,173754
4730,66.0,0.699531997,174123
4740,67.0,0.700721529,174494
4750,68.0,0.703089926,174864
4760,67.0,0.704467507,175230
4770,67.0,0.705638076,175600
4780,67.0,0.706827213,175978
4790,67.0,0.708437485,176342
4800,67.0,0.709863659,176699
4810,68.0,0.711268104,177059
4820,67.0,0.712681636,177426
4830,68.0,0.715537935,177783
4840,68.0,0.717021788,178144
4850,68.0,0.718502481,178515
4860,68.0,0.720059026,178880
4870,68.0,0.721465842,179240
4880,68.0,0.722906238,179595
4890,68.0,0.724308314,179955
4900,68.0,0.725705253,180322
4910,68.0,0.728512563,180697
4920,68.0,0.729922144,181059
4930,69.0,0.731321454,181420
4940,68.0,0.732738542,181792
4950,68.0,0.733941901,182164
4960,68.0,0.7351421,182533
4970,68.0,0.736383385,182896
4980,68.0,0.737587534,183264
4990,68.0,0.7400464,183626
5000,68.0,0.741367883,183994
