iterations,fitness,time,fevals
0,0.0318111887978,0.00654183199913,575
10,0.0405032575668,0.0138615419983,1054
20,0.0454856948183,0.0220559189984,1532
30,0.0527811502242,0.0299524189995,2006
40,0.054071862114,0.0360849680001,2491
50,0.0546663217774,0.0421890720008,2979
60,0.0647503179123,0.0510688810009,3464
70,0.0669200717587,0.0585331830007,3938
80,0.0676561168924,0.0664233620009,4416
90,0.0676387427103,0.0719036629998,4885
100,0.0782635870193,0.0776281120015,5377
110,0.0837787447689,0.082981597001,5863
120,0.0828157283902,0.0886456019998,6348
130,0.0860561641133,0.0954209159991,6822
140,0.0947873022389,0.100530648999,7312
150,0.0924220612275,0.105910602999,7807
160,0.0951248804535,0.110959890999,8275
170,0.0894728910612,0.116761376999,8745
180,0.0898090029878,0.122047702,9231
190,0.0907153432195,0.127221829998,9725
200,0.0841805313728,0.132936796999,10229
210,0.0806074811035,0.138339269999,10719
220,0.0877208446666,0.143597941,11194
230,0.081244334868,0.148953402,11673
240,0.0832906853176,0.154037060001,12155
250,0.0867292727049,0.159556867002,12636
260,0.081071444018,0.164926550002,13116
270,0.087201763679,0.170320332001,13598
280,0.0915775367465,0.175357768001,14087
290,0.0918291596443,0.180815945001,14574
300,0.0916523947966,0.185880245001,15063
310,0.0933766693538,0.190952051,15549
320,0.0919666391509,0.196948698,16039
330,0.0954940222253,0.202117294,16524
340,0.0953799061179,0.207668311001,17002
350,0.0988669282904,0.213001254,17483
360,0.093174679144,0.220762248,17966
370,0.093174679144,0.225702103999,18454
380,0.0924576548043,0.230832773997,18954
390,0.0902895631559,0.237976679999,19443
400,0.0897348522466,0.243205720997,19927
410,0.084055978314,0.251985579996,20406
420,0.0934653221202,0.259517042998,20890
430,0.0892054886837,0.265082676999,21373
440,0.0819404773351,0.270203471,21862
450,0.0892719170026,0.275933056,22339
460,0.0928328384111,0.280914788,22817
470,0.0893373661719,0.287164669,23291
480,0.0900692508789,0.292647735001,23783
490,0.087738299177,0.297833319,24278
500,0.084550674478,0.303343249001,24754
510,0.0909174702185,0.308294562003,25229
520,0.101097855045,0.313903653003,25710
530,0.092254588281,0.320612596002,26179
540,0.0977740964487,0.325694674002,26667
550,0.095097640207,0.331112555003,27149
560,0.0883618521098,0.339995920001,27646
570,0.0889084146625,0.347903482001,28116
580,0.0790555852884,0.353142004002,28601
590,0.0755749387404,0.361980332002,29078
600,0.088406245504,0.367864386,29576
610,0.0959963803575,0.373553279001,30072
620,0.0952945216896,0.378540147001,30562
630,0.0932157569527,0.384189929002,31040
640,0.0971349652753,0.390077539003,31511
650,0.0891597843177,0.395747074002,32001
660,0.0966197389775,0.400771078002,32491
670,0.0966426088893,0.406104020003,32978
680,0.0944368565111,0.411278543002,33461
690,0.100851258706,0.419555883003,33948
700,0.0946984418284,0.425985913003,34434
710,0.0984602953407,0.430978707003,34927
720,0.093000920448,0.436447945003,35427
730,0.0859800103626,0.441718467002,35915
740,0.0911517805283,0.449171313003,36405
750,0.0926525440405,0.454406675002,36883
760,0.0974514570485,0.460210531002,37365
770,0.101053918485,0.467840759004,37850
780,0.0991266049372,0.472749405004,38326
790,0.0985575410939,0.479935979003,38807
800,0.0964124860754,0.485874551005,39273
810,0.100684946494,0.493805817005,39758
820,0.0921083763438,0.503664195005,40253
830,0.101680419794,0.512095214004,40727
840,0.0988735443661,0.520625789004,41227
850,0.0975469059985,0.528914981005,41720
860,0.10226513306,0.534304418004,42203
870,0.0936751019117,0.542096227004,42680
880,0.0957340628954,0.547252577004,43170
890,0.0994490119723,0.552271445003,43648
900,0.100585273553,0.557754511005,44134
910,0.100904648804,0.562624440005,44624
920,0.0956570316679,0.567846370004,45099
930,0.100257766392,0.573857634005,45564
940,0.0977554635932,0.578634329006,46044
950,0.101924766416,0.585387915005,46529
960,0.104495729048,0.591922241007,47007
970,0.0949030651613,0.597234245006,47478
980,0.0948775482607,0.602374792006,47951
990,0.0879840569791,0.611239984006,48430
1000,0.101246851378,0.618396533006,48912
1010,0.101246851378,0.627088293006,49396
1020,0.102465814938,0.631989433006,49877
1030,0.100051566892,0.637634475006,50364
1040,0.0952118695834,0.644032505006,50840
1050,0.0946570653311,0.649192410006,51310
1060,0.0946570653311,0.654372464005,51800
1070,0.0964976497692,0.659620073005,52273
1080,0.0920357557357,0.666221165005,52754
1090,0.0951407816457,0.671252676006,53251
1100,0.0964562695323,0.680194906006,53723
1110,0.0952282100972,0.688798567007,54206
1120,0.098845587297,0.696296844008,54701
1130,0.0916030094047,0.701779120007,55183
1140,0.103748829199,0.710395818007,55660
1150,0.0950642983359,0.717828910007,56142
1160,0.10308251023,0.724253014007,56616
1170,0.0989521925905,0.730658155007,57100
1180,0.0926435274598,0.735912875007,57581
1190,0.104881391226,0.740961373007,58074
1200,0.103718471011,0.746199896006,58562
1210,0.104627640944,0.751346369007,59046
1220,0.104451392492,0.756646522006,59524
1230,0.0977902190745,0.761559908005,60017
1240,0.0994874374906,0.766621443006,60496
1250,0.107888255594,0.772226584008,60969
1260,0.110779115596,0.776976020006,61448
1270,0.101709908653,0.783908173007,61929
1280,0.10173325184,0.788748868008,62416
1290,0.10454120064,0.793475390008,62895
1300,0.0998938508821,0.798819394009,63373
1310,0.0997297647885,0.803986015009,63849
1320,0.107237651426,0.80959787101,64324
1330,0.110486066751,0.81468508501,64814
1340,0.107472954467,0.81930178101,65287
1350,0.103451302403,0.827232652009,65775
1360,0.104739010598,0.832072162009,66263
1370,0.105546066702,0.837257746009,66736
1380,0.100389997243,0.842194441009,67221
1390,0.10256414695,0.84913133501,67699
1400,0.110195111141,0.85430111701,68200
1410,0.105577902313,0.859297467008,68683
1420,0.10827026144,0.865809669007,69162
1430,0.109942663259,0.870597426006,69651
1440,0.110889068519,0.875614714007,70141
1450,0.112770674459,0.881804942006,70630
1460,0.108686906104,0.886384896006,71110
1470,0.108686906104,0.891511616006,71578
1480,0.100971400682,0.896436459007,72059
1490,0.106438004798,0.901944414007,72546
1500,0.107628883255,0.907745110007,73013
1510,0.102753129037,0.912514299009,73491
1520,0.108043409592,0.918176723007,73976
1530,0.110493565375,0.923124480007,74456
1540,0.11068545174,0.928781769006,74931
1550,0.111579058872,0.933574267005,75407
1560,0.110475955069,0.940101877004,75881
1570,0.110869565645,0.945582968005,76368
1580,0.10753097452,0.951353245004,76854
1590,0.103675505148,0.956395817004,77340
1600,0.105040139736,0.963681551004,77826
1610,0.106780108001,0.972945756004,78313
1620,0.102406789495,0.979194452004,78792
1630,0.102747922423,0.984613518003,79271
1640,0.100370244676,0.989517423002,79750
1650,0.0916198919803,0.995091749002,80238
1660,0.0942933002713,1.000442074,80718
1670,0.0942933002713,1.005887609,81206
1680,0.0861843341541,1.011699762,81695
1690,0.0945993123056,1.016922482,82182
1700,0.109245651481,1.022657203,82664
1710,0.104687889312,1.027537405,83150
1720,0.10481592656,1.032747878,83621
1730,0.101246894942,1.039637365,84108
1740,0.0991010596458,1.044584332,84598
1750,0.106703603385,1.049795596,85085
1760,0.105380340563,1.054803797,85581
1770,0.109971590985,1.060606074,86056
1780,0.114198939608,1.065443214,86530
1790,0.107139996665,1.070589292,87012
1800,0.10436632982,1.076463074,87499
1810,0.100498364423,1.081334979,87983
1820,0.103702823347,1.086599971,88471
1830,0.117543829762,1.091438691,88965
1840,0.116804697295,1.097660523,89453
1850,0.105463678312,1.102813318,89950
1860,0.10851585979,1.107573816,90427
1870,0.111226084466,1.116156934,90929
1880,0.113136567248,1.12094311,91416
1890,0.115478757596,1.126219163,91903
1900,0.117322349613,1.131259759,92389
1910,0.116927694922,1.13658085,92860
1920,0.109901966993,1.142120805,93352
1930,0.113138888621,1.149716662,93834
1940,0.116650909327,1.155263333,94314
1950,0.116845334422,1.15995193,94801
1960,0.115494456603,1.169333469,95283
1970,0.116939921001,1.17647382,95763
1980,0.112126792065,1.181569725,96251
1990,0.112695144038,1.186527754,96725
2000,0.110652279322,1.193193241,97209
