k,Pen Digits Data BIC
2,18877.142594772224
3,-2980.997310718642
4,-12390.94357513656
5,-16498.140981238685
6,-19493.353717656275
7,-20050.079951473122
8,-20315.952557449215
9,-20537.8222820414
10,-20966.288214062224
15,-20884.852914552437
20,-21168.954999806305
25,-21166.049014530687
30,-20815.695564204838
35,-20693.050860873453
40,-20705.47073204269
