,train,test
0.1,0.00993716138218095,0.002259993694804853
0.2,0.01682436238911588,0.0015360814397336303
0.3,0.02434271501071015,0.0019295635430140012
0.4,0.030513984022098196,0.001482273947297108
0.5,0.03625653136834589,0.0010862634449595454
0.6,0.04166264361504175,0.0008051370747845343
0.7,0.05134009100656358,0.0008874680690853509
0.8,0.053760638041502065,0.0005838231448069386
0.9,0.06154470960151639,0.0003928500035160987
