param_Boost__n_estimators,train acc,test acc
1,0.7658985236359899,0.7443722943722945
2,0.7658985236359899,0.7443722943722945
5,0.8105833506809368,0.6849025974025974
10,0.8358634564050853,0.7755952380952381
20,0.8914317532007896,0.7767316017316017
30,0.9426730949768937,0.7943181818181818
40,0.9677745664739884,0.7943181818181818
50,0.9751785107106428,0.770995670995671
60,0.9883373002380144,0.7766774891774892
70,0.9912529751785107,0.7710227272727272
80,0.9955882352941177,0.7823863636363636
90,1.0,0.7764339826839827
100,1.0,0.7880681818181818
