,0,1,2,3,4
64,0.8829656862745097,0.9682692307692308,0.9682692307692308,0.9682692307692308,0.9682692307692308
67,0.8895833333333332,0.9571428571428572,0.9571428571428572,0.9571428571428572,0.9571428571428572
70,0.8929924242424241,0.9583333333333333,0.9583333333333333,0.9583333333333333,0.9583333333333333
73,0.9009661835748793,0.9606060606060605,0.9606060606060605,0.9606060606060605,0.9606060606060605
76,0.8675438596491226,0.936141304347826,0.936141304347826,0.936141304347826,0.936141304347826
80,0.8896536796536797,0.9405882352941177,0.9405882352941177,0.9405882352941177,0.9405882352941177
83,0.9162296037296038,0.9212962962962963,0.9212962962962963,0.9212962962962963,0.9212962962962963
86,0.9193143812709031,0.9101190476190475,0.9101190476190475,0.9101190476190475,0.9101190476190475
89,0.8998397435897436,0.9278508771929823,0.9278508771929823,0.9278508771929823,0.9278508771929823
92,0.9004629629629629,0.9255952380952382,0.9255952380952382,0.9255952380952382,0.9255952380952382
96,0.8943965517241379,0.9358333333333334,0.9358333333333334,0.9358333333333334,0.9358333333333334
99,0.8958333333333334,0.9296703296703296,0.9296703296703296,0.9296703296703296,0.9296703296703296
102,0.8983333333333332,0.943463794270246,0.943463794270246,0.943463794270246,0.943463794270246
105,0.9016129032258063,0.9415878239407652,0.9415878239407652,0.9415878239407652,0.9415878239407652
108,0.9016129032258063,0.9357170962030297,0.9357170962030297,0.9357170962030297,0.9357170962030297
112,0.9031250000000001,0.9360732215591552,0.9360732215591552,0.9360732215591552,0.9360732215591552
115,0.9032352941176471,0.940364277320799,0.940364277320799,0.940364277320799,0.940364277320799
118,0.9095860566448801,0.908119483491337,0.908119483491337,0.908119483491337,0.908119483491337
121,0.8987301587301586,0.9122832282318701,0.9122832282318701,0.9122832282318701,0.9122832282318701
124,0.9027777777777778,0.9131472835314092,0.9131472835314092,0.9131472835314092,0.9131472835314092
128,0.9037524366471736,0.9021255409126673,0.9021255409126673,0.9021255409126673,0.9021255409126673
188,0.8798076923076925,0.9094076655052266,0.9094076655052266,0.9094076655052266,0.9094076655052266
249,0.8947299077733861,0.8818793559240566,0.8818793559240566,0.8818793559240566,0.8818793559240566
309,0.8846636546184738,0.8930775316455697,0.9100197758734345,0.9100197758734345,0.9100197758734345
370,0.8734848484848485,0.8911616161616162,0.8856382978723405,0.8856382978723405,0.8856382978723405
431,0.8855218855218855,0.885395622895623,0.8772321428571428,0.8772321428571428,0.8772321428571428
491,0.8855981416957026,0.8855013550135502,0.8790537835312958,0.8790537835312958,0.8790537835312958
552,0.8901507562856856,0.8845537413603126,0.8648541114058355,0.8648541114058355,0.8648541114058355
613,0.8770424836601306,0.8852124183006536,0.8822800602033866,0.8822800602033866,0.8822800602033866
673,0.8698761876989625,0.8699545576049186,0.8770935092707346,0.8745036572622777,0.8745036572622777
734,0.8839671748776881,0.874637330754352,0.8799613784907901,0.8696236559139786,0.8696236559139786
794,0.8752500365907206,0.8838305605698396,0.8801470946967849,0.8895370861428897,0.8895370861428897
855,0.877301468224199,0.8703291894402173,0.887755867538313,0.880463401790416,0.880463401790416
916,0.8764260702586695,0.8816543642053004,0.8838578822058998,0.8855811403508772,0.886195040069309
976,0.875514403292181,0.8785922852312893,0.8837696464871834,0.8806584362139916,0.8879288274449565
1037,0.8775728414862336,0.8679420385011903,0.879540385730146,0.8901808785529717,0.8814205052862041
1098,0.8727626202715172,0.8708719460320884,0.8772641000754879,0.881059707394227,0.8852205349726883
1158,0.873486235003401,0.875128371542674,0.8811333508539861,0.8803650326109825,0.8870125880522439
1219,0.8694803717512558,0.8686737579156604,0.8808914028455107,0.880090907155479,0.8816297754063831
1280,0.87421875,0.86484375,0.8796875,0.8734375,0.88359375
