k,GMM,Kmeans
2,0.19221859017921147,0.1830294031565788
3,0.33007602366615363,0.3120647958528617
4,0.3906797888698302,0.36840121605500936
5,0.4812488113448526,0.44760783983744923
6,0.5222574681027174,0.5109168256623006
7,0.5844982377423623,0.5799198447321642
8,0.7073626994480653,0.6307744308160207
9,0.684974679403592,0.6693425844445555
10,0.7088029957193189,0.7048066299330825
15,0.7247740634496207,0.6877057679915994
20,0.6941990835337629,0.6347686917607328
25,0.6572795492327537,0.6054585994817475
30,0.6413149546929924,0.594857039195766
35,0.6177388942115462,0.570457050757437
40,0.6047450460680139,0.568777288045481
