,train,test
0.1,1.0535695068752702,0.13761933846018923
0.2,1.7168723229587335,0.11782718866518671
0.3,2.2419956021658907,0.08979498634269376
0.4,2.7812290863867055,0.07709539096555887
0.5,3.2987381708455046,0.07369303497171131
0.6,3.781022863838598,0.05540986533904828
0.7,4.060083057909028,0.0426451636861799
0.8,4.657391419087676,0.03154580787485486
0.9,5.06675439684646,0.018632404752440834
