iterations,fitness,time,fevals
0,20.0,0.003785879,647
10,23.0,0.005552992,1199
20,27.0,0.007335907,1744
30,27.0,0.009040205,2292
40,27.0,0.010576601,2845
50,29.0,0.012109837,3390
60,31.0,0.013648603,3945
70,32.0,0.015169987,4502
80,32.0,0.017958335,5055
90,34.0,0.020146188,5600
100,33.0,0.02181493,6135
110,34.0,0.023516857,6686
120,33.0,0.025297402,7225
130,32.0,0.026931774,7773
140,34.0,0.028453948,8317
150,34.0,0.029959529,8862
160,35.0,0.033160717,9418
170,35.0,0.03521504,9965
180,34.0,0.037129905,10522
190,35.0,0.038839338,11065
200,34.0,0.040600129,11610
210,35.0,0.042210402,12158
220,35.0,0.043674897,12701
230,35.0,0.045140972,13248
240,35.0,0.047810406,13807
250,35.0,0.049287938,14359
260,34.0,0.05096063,14909
270,34.0,0.053385521,15458
280,34.0,0.054835794,16002
290,35.0,0.056295548,16556
300,35.0,0.057752142,17100
310,35.0,0.059226909,17649
320,35.0,0.062806961,18201
330,35.0,0.064358765,18738
340,36.0,0.065843014,19290
350,36.0,0.067315016,19838
360,36.0,0.069213684,20379
370,36.0,0.070660796,20928
380,36.0,0.0721166,21476
390,36.0,0.073747021,22023
400,37.0,0.075488455,22565
410,37.0,0.076944259,23114
420,36.0,0.078395717,23659
430,36.0,0.079861002,24213
440,36.0,0.081329052,24768
450,37.0,0.08325893,25326
460,37.0,0.085289549,25871
470,37.0,0.088317305,26417
480,37.0,0.089792467,26968
490,38.0,0.09156353,27522
500,39.0,0.093045013,28069
510,38.0,0.094513459,28616
520,38.0,0.096025361,29167
530,38.0,0.097731239,29725
540,39.0,0.099593957,30276
550,38.0,0.102619342,30821
560,38.0,0.104124528,31374
570,39.0,0.10559732,31922
580,39.0,0.107646902,32478
590,40.0,0.109526608,33018
600,40.0,0.111135695,33560
610,40.0,0.11276019,34102
620,41.0,0.114356241,34655
630,40.0,0.117179355,35203
640,40.0,0.118672294,35751
650,40.0,0.120233974,36294
660,40.0,0.122216001,36845
670,40.0,0.123787953,37389
680,40.0,0.125280498,37937
690,42.0,0.126791215,38480
700,40.0,0.128303908,39038
710,42.0,0.131089886,39584
720,43.0,0.133212554,40135
730,42.0,0.134671913,40678
740,42.0,0.13614984,41232
750,42.0,0.137598928,41776
760,43.0,0.13904367,42318
770,42.0,0.141605252,42860
780,42.0,0.143207624,43401
790,42.0,0.145962391,43945
800,42.0,0.147434787,44492
810,43.0,0.148877159,45035
820,44.0,0.150894346,45579
830,43.0,0.152384915,46123
840,43.0,0.153830052,46668
850,43.0,0.155287041,47227
860,43.0,0.15674798,47767
870,43.0,0.159992624,48318
880,43.0,0.16149307,48871
890,43.0,0.162999441,49424
900,43.0,0.164484479,49975
910,43.0,0.165980579,50530
920,45.0,0.168190951,51075
930,44.0,0.169961224,51621
940,44.0,0.171453374,52162
950,44.0,0.174133475,52714
960,44.0,0.175596785,53266
970,44.0,0.177100392,53811
980,44.0,0.178698418,54356
990,44.0,0.180148295,54905
1000,45.0,0.18158079,55447
1010,45.0,0.183037779,56008
1020,45.0,0.186724103,56562
1030,46.0,0.188147907,57114
1040,45.0,0.189925291,57661
1050,45.0,0.19138781,58213
1060,45.0,0.192834132,58758
1070,45.0,0.194437689,59296
1080,45.0,0.195887962,59842
1090,46.0,0.197344556,60384
1100,57.0,0.200333991,60928
1110,58.0,0.202241746,61468
1120,58.0,0.204136068,62022
1130,59.0,0.205605303,62564
1140,59.0,0.207099823,63109
1150,58.0,0.208539034,63648
1160,58.0,0.209996022,64199
1170,58.0,0.211545851,64740
1180,58.0,0.214417162,65282
1190,58.0,0.215916423,65830
1200,58.0,0.21739119,66384
1210,58.0,0.218861611,66935
1220,58.0,0.22029134,67482
1230,58.0,0.221742797,68027
1240,58.0,0.223200971,68577
1250,58.0,0.225203146,69123
1260,58.0,0.227857172,69672
1270,57.0,0.229304284,70223
1280,57.0,0.230751792,70781
1290,58.0,0.232194954,71328
1300,57.0,0.234229919,71881
1310,58.0,0.235835451,72433
1320,58.0,0.237286119,72987
1330,58.0,0.238755355,73540
1340,58.0,0.24140385,74091
1350,58.0,0.243284345,74641
1360,58.0,0.245208692,75201
1370,59.0,0.246672002,75747
1380,60.0,0.248174423,76297
1390,58.0,0.249935609,76842
1400,58.0,0.251391807,77386
1410,58.0,0.252842474,77937
1420,58.0,0.25613176,78483
1430,58.0,0.257638526,79033
1440,59.0,0.259307663,79581
1450,58.0,0.261221738,80128
1460,58.0,0.262661344,80668
1470,59.0,0.26422895,81215
1480,58.0,0.26565868,81761
1490,59.0,0.267091175,82305
1500,59.0,0.270199918,82848
1510,59.0,0.271637154,83397
1520,58.0,0.273083477,83942
1530,59.0,0.274544021,84496
1540,59.0,0.276242392,85052
1550,60.0,0.277994492,85597
1560,60.0,0.279647037,86149
1570,60.0,0.281085458,86700
1580,60.0,0.28371183,87247
1590,59.0,0.285148671,87793
1600,60.0,0.287451092,88342
1610,61.0,0.288893464,88887
1620,61.0,0.290440132,89432
1630,61.0,0.291880923,89978
1640,61.0,0.293335146,90523
1650,61.0,0.29695905,91075
1660,61.0,0.298465816,91630
1670,61.0,0.300244781,92181
1680,61.0,0.301716782,92724
1690,60.0,0.303187993,93270
1700,60.0,0.304930611,93811
1710,60.0,0.306375748,94353
1720,60.0,0.308072935,94902
1730,60.0,0.31160321,95448
1740,60.0,0.313574174,96000
1750,60.0,0.316490128,96549
1760,60.0,0.317977536,97099
1770,60.0,0.319450327,97650
1780,59.0,0.320911662,98196
1790,60.0,0.322365095,98741
1800,60.0,0.323803121,99282
1810,60.0,0.326909494,99822
1820,60.0,0.328396507,100376
1830,60.0,0.329869694,100918
1840,60.0,0.331339325,101460
1850,60.0,0.332837005,102013
1860,61.0,0.334749106,102559
1870,60.0,0.336421008,103110
1880,60.0,0.337890244,103660
1890,60.0,0.341309506,104211
1900,61.0,0.342783877,104763
1910,61.0,0.344244421,105308
1920,60.0,0.3457022,105858
1930,60.0,0.347132719,106404
1940,60.0,0.349390103,106954
1950,60.0,0.351063191,107505
1960,60.0,0.352513858,108050
1970,60.0,0.355351984,108598
1980,60.0,0.356907344,109145
1990,60.0,0.358390407,109688
2000,60.0,0.35987426,110231
2010,60.0,0.361362063,110782
2020,60.0,0.362990903,111331
2030,60.0,0.364516237,111869
2040,59.0,0.365994559,112407
2050,59.0,0.369683648,112952
2060,60.0,0.371207402,113504
2070,59.0,0.372671897,114047
2080,60.0,0.374165627,114591
2090,60.0,0.375732444,115145
2100,59.0,0.377513779,115691
2110,60.0,0.378972348,116233
2120,60.0,0.380570769,116775
2130,60.0,0.383852155,117316
2140,59.0,0.385292946,117856
2150,59.0,0.386739663,118399
2160,59.0,0.388325442,118951
2170,59.0,0.389742134,119485
2180,59.0,0.39150016,120030
2190,59.0,0.393243963,120575
2200,59.0,0.395906286,121117
2210,59.0,0.397353003,121659
2220,59.0,0.398804066,122205
2230,59.0,0.400981253,122751
2240,59.0,0.402783526,123298
2250,59.0,0.404236959,123844
2260,59.0,0.405765849,124392
2270,59.0,0.407229553,124940
2280,60.0,0.410042789,125485
2290,60.0,0.411490691,126025
2300,60.0,0.41304684,126582
2310,60.0,0.414523582,127129
2320,59.0,0.416117657,127678
2330,59.0,0.417578991,128231
2340,59.0,0.419337017,128782
2350,59.0,0.420778204,129327
2360,58.0,0.423431441,129873
2370,59.0,0.424893171,130421
2380,58.0,0.426372678,130983
2390,58.0,0.428320729,131536
2400,59.0,0.430770509,132083
2410,59.0,0.432332189,132627
2420,59.0,0.43380419,133182
2430,59.0,0.435547203,133726
2440,59.0,0.43820597,134271
2450,59.0,0.439643996,134817
2460,60.0,0.441106515,135370
2470,59.0,0.442609331,135913
2480,59.0,0.444061184,136454
2490,59.0,0.44578879,136992
2500,60.0,0.447226026,137535
2510,59.0,0.448681829,138082
2520,59.0,0.452127165,138633
2530,60.0,0.453569932,139177
2540,60.0,0.455173884,139733
2550,60.0,0.45664786,140277
2560,59.0,0.458093392,140826
2570,60.0,0.460071467,141374
2580,60.0,0.461511863,141919
2590,60.0,0.462965296,142467
2600,60.0,0.466131323,143016
2610,60.0,0.467596214,143568
2620,60.0,0.4692614,144116
2630,60.0,0.471107525,144675
2640,60.0,0.472550291,145225
2650,60.0,0.473993453,145777
2660,60.0,0.47572185,146329
2670,61.0,0.47715158,146878
2680,61.0,0.480386743,147427
2690,60.0,0.481947238,147980
2700,60.0,0.483374992,148530
2710,60.0,0.4847664,149083
2720,61.0,0.486663883,149643
2730,60.0,0.488821317,150184
2740,60.0,0.490270799,150734
2750,60.0,0.491705269,151279
2760,60.0,0.49451416,151828
2770,60.0,0.496218458,152383
2780,60.0,0.497690854,152944
2790,59.0,0.499226065,153485
2800,59.0,0.500694906,154038
2810,59.0,0.502220635,154586
2820,59.0,0.503672093,155146
2830,59.0,0.506228145,155695
2840,59.0,0.507635751,156247
2850,59.0,0.509073382,156800
2860,59.0,0.510502716,157344
2870,59.0,0.512681483,157888
2880,59.0,0.514117533,158436
2890,59.0,0.515551213,158984
2900,60.0,0.516982523,159532
2910,59.0,0.519608105,160084
2920,59.0,0.521015316,160626
2930,59.0,0.52260307,161167
2940,60.0,0.524047812,161716
2950,60.0,0.525424998,162257
2960,59.0,0.526889888,162803
2970,59.0,0.528338976,163351
2980,60.0,0.52979794,163903
2990,59.0,0.532696115,164454
3000,59.0,0.53422698,164996
3010,59.0,0.535655524,165542
3020,59.0,0.53710145,166085
3030,60.0,0.538579772,166634
3040,59.0,0.540034391,167179
3050,60.0,0.541498491,167727
3060,60.0,0.542940862,168278
3070,59.0,0.545625703,168825
3080,60.0,0.547388865,169381
3090,61.0,0.548805557,169935
3100,60.0,0.550706596,170477
3110,60.0,0.552134745,171025
3120,60.0,0.553556968,171570
3130,60.0,0.555079142,172116
3140,60.0,0.556524279,172670
3150,59.0,0.559232824,173218
3160,59.0,0.560755393,173770
3170,59.0,0.562301666,174316
3180,59.0,0.563719149,174857
3190,59.0,0.565428582,175412
3200,60.0,0.566901769,175964
3210,61.0,0.568403005,176514
3220,61.0,0.570370019,177060
3230,61.0,0.573054465,177610
3240,61.0,0.574608244,178169
3250,61.0,0.576180591,178715
3260,60.0,0.57798484,179260
3270,60.0,0.579422471,179806
3280,59.0,0.580989287,180355
3290,61.0,0.582449437,180906
3300,59.0,0.583982278,181456
3310,60.0,0.587105639,181993
3320,60.0,0.589679864,182543
3330,60.0,0.591115125,183090
3340,60.0,0.592576065,183641
3350,60.0,0.594063079,184189
3360,60.0,0.595509796,184734
3370,60.0,0.596958093,185289
3380,60.0,0.598394933,185833
3390,60.0,0.601113355,186380
3400,59.0,0.60254506,186923
3410,59.0,0.604026148,187472
3420,59.0,0.605466939,188021
3430,60.0,0.606933015,188564
3440,59.0,0.609138646,189110
3450,58.0,0.610641857,189654
3460,59.0,0.613931144,190196
3470,59.0,0.615374305,190742
3480,59.0,0.616815492,191290
3490,59.0,0.618980037,191842
3500,59.0,0.620402655,192395
3510,59.0,0.621843842,192942
3520,59.0,0.62368009,193487
3530,60.0,0.625085326,194023
3540,59.0,0.62857649,194579
3550,60.0,0.630034269,195129
3560,59.0,0.631478616,195674
3570,60.0,0.633252049,196221
3580,58.0,0.634769087,196771
3590,59.0,0.637157632,197319
3600,59.0,0.638700744,197866
3610,59.0,0.640243462,198422
3620,58.0,0.642852057,198967
3630,59.0,0.644313786,199501
3640,59.0,0.645790923,200047
3650,59.0,0.647228159,200594
3660,59.0,0.648676061,201147
3670,59.0,0.650592506,201691
3680,60.0,0.652047124,202240
3690,59.0,0.653510828,202789
3700,59.0,0.65709009,203325
3710,59.0,0.658606733,203875
3720,60.0,0.660058586,204419
3730,59.0,0.661534932,204967
3740,61.0,0.663439526,205513
3750,60.0,0.664991725,206058
3760,60.0,0.666481899,206610
3770,60.0,0.668293259,207160
3780,60.0,0.671176421,207714
3790,61.0,0.672612471,208264
3800,61.0,0.674050497,208809
3810,61.0,0.675585708,209359
3820,61.0,0.67699608,209909
3830,61.0,0.67884102,210456
3840,61.0,0.680868479,211007
3850,61.0,0.682407641,211550
3860,61.0,0.685414853,212092
3870,61.0,0.68685841,212633
3880,61.0,0.688603399,213183
3890,61.0,0.69010661,213736
3900,61.0,0.691537525,214288
3910,61.0,0.692961329,214827
3920,61.0,0.694619404,215366
3930,61.0,0.696063356,215919
3940,61.0,0.700175161,216463
3950,61.0,0.702829583,217012
3960,60.0,0.704252992,217560
3970,61.0,0.70599087,218108
3980,61.0,0.707415464,218653
3990,60.0,0.708835712,219199
4000,61.0,0.710357491,219739
4010,61.0,0.711784455,220287
4020,61.0,0.713206284,220834
4030,61.0,0.714779026,221379
4040,61.0,0.716175175,221927
4050,61.0,0.717609645,222479
4060,61.0,0.719029894,223024
4070,62.0,0.720489648,223578
4080,61.0,0.721910291,224130
4090,61.0,0.725386837,224670
4100,60.0,0.726879382,225222
4110,60.0,0.728306346,225778
4120,60.0,0.72973173,226335
4130,60.0,0.731138151,226876
4140,61.0,0.732683238,227424
4150,60.0,0.734114548,227974
4160,61.0,0.735547043,228517
4170,60.0,0.738186057,229070
4180,60.0,0.739805812,229624
4190,61.0,0.741344183,230174
4200,61.0,0.743151592,230719
4210,61.0,0.744593963,231263
4220,61.0,0.746018162,231812
4230,61.0,0.747433274,232351
4240,61.0,0.748894608,232892
4250,61.0,0.751871005,233439
4260,61.0,0.753528291,233983
4270,62.0,0.754963157,234537
4280,62.0,0.756420146,235088
4290,61.0,0.757883061,235638
4300,62.0,0.759333334,236178
4310,61.0,0.761767706,236724
4320,61.0,0.763642276,237274
4330,62.0,0.766710328,237821
4340,61.0,0.768165737,238361
4350,62.0,0.77012406,238910
4360,61.0,0.771574728,239462
4370,61.0,0.773186186,240010
4380,61.0,0.774644755,240556
4390,61.0,0.776514584,241112
4400,61.0,0.77795103,241658
4410,62.0,0.780615328,242202
4420,62.0,0.782041502,242753
4430,62.0,0.783466491,243305
4440,63.0,0.78492664,243859
4450,63.0,0.786952518,244400
4460,63.0,0.788375532,244940
4470,63.0,0.789851879,245498
4480,64.0,0.791333362,246043
4490,63.0,0.793985018,246585
4500,65.0,0.79603381,247133
4510,79.0,0.797517663,247682
4520,64.0,0.798973071,248234
4530,70.0,0.800430455,248777
4540,64.0,0.801893765,249322
4550,69.0,0.803398161,249866
4560,63.0,0.806150163,250413
4570,63.0,0.810117771,250965
4580,63.0,0.811731994,251516
4590,63.0,0.813528736,252062
4600,63.0,0.815063552,252605
4610,64.0,0.816778121,253153
4620,64.0,0.818275011,253715
4630,68.0,0.819810222,254266
4640,69.0,0.822901977,254817
4650,74.0,0.824510275,255365
4660,74.0,0.825967264,255911
4670,74.0,0.827560549,256459
4680,74.0,0.829087859,257005
4690,75.0,0.830524699,257546
4700,74.0,0.832158281,258092
4710,74.0,0.833565097,258636
4720,74.0,0.836193445,259178
4730,74.0,0.837619224,259726
4740,74.0,0.839310879,260273
4750,75.0,0.84075088,260822
4760,75.0,0.842430288,261368
4770,75.0,0.843860018,261916
4780,74.0,0.845275131,262454
4790,75.0,0.846738045,263008
4800,74.0,0.850106344,263561
4810,74.0,0.85155069,264109
4820,76.0,0.852993852,264657
4830,74.0,0.854661014,265208
4840,75.0,0.85610141,265754
4850,75.0,0.8575343,266302
4860,75.0,0.859053708,266857
4870,75.0,0.860466055,267404
4880,75.0,0.863093218,267943
4890,74.0,0.864980429,268493
4900,75.0,0.866907146,269040
4910,74.0,0.868609468,269586
4920,75.0,0.870043544,270135
4930,74.0,0.871489076,270690
4940,75.0,0.873794263,271234
4950,74.0,0.875229919,271783
4960,75.0,0.877882761,272330
4970,75.0,0.879432984,272877
4980,76.0,0.880873775,273425
4990,76.0,0.882439801,273977
5000,75.0,0.883888494,274526
