k,GMM,Kmeans
2,0.27653061224489794,0.2642857142857143
3,0.2857142857142857,0.2693877551020408
4,0.2857142857142857,0.2714285714285714
5,0.30714285714285716,0.32755102040816325
6,0.3193877551020408,0.30714285714285716
7,0.3122448979591837,0.33877551020408164
8,0.3377551020408163,0.363265306122449
9,0.3081632653061224,0.3551020408163265
10,0.36122448979591837,0.33877551020408164
15,0.363265306122449,0.38979591836734695
20,0.3806122448979592,0.39693877551020407
25,0.376530612244898,0.3989795918367347
30,0.42653061224489797,0.4346938775510204
35,0.4387755102040816,0.43673469387755104
40,0.4418367346938776,0.4479591836734694
