param_MLP__max_iter,train acc,test acc
1,0.9551823837891339,0.9507903160392756
2,0.9840863680710565,0.982191733446906
4,0.9900286263319522,0.9878743351476643
8,0.9929261159303862,0.990167583272426
16,0.9950967893937795,0.9919515605898372
32,0.9973658835260321,0.9914422897824872
64,0.9973658835260321,0.9914422897824872
128,0.9973658835260321,0.9914422897824872
256,0.9973658835260321,0.9914422897824872
512,0.9973658835260321,0.9914422897824872
1024,0.9973658835260321,0.9914422897824872
2048,0.9973658835260321,0.9914422897824872
2100,0.9973658835260321,0.9914422897824872
2200,0.9973658835260321,0.9914422897824872
2300,0.9973658835260321,0.9914422897824872
2400,0.9973658835260321,0.9914422897824872
2500,0.9973658835260321,0.9914422897824872
2600,0.9973658835260321,0.9914422897824872
2700,0.9973658835260321,0.9914422897824872
2800,0.9973658835260321,0.9914422897824872
2900,0.9973658835260321,0.9914422897824872
3000,0.9973658835260321,0.9914422897824872
