iterations,fitness,time,fevals
0,0.036415750392,0.00968336499864,725
10,0.0441573238453,0.0188768539992,1354
20,0.0568527769493,0.0280679719999,1985
30,0.0556777860273,0.0380571160003,2614
40,0.0635722341261,0.0487605320013,3255
50,0.0784539997203,0.0571437480012,3883
60,0.0713259178402,0.0679680530011,4522
70,0.0734825281512,0.0764117140006,5151
80,0.0797830125185,0.0845507820013,5787
90,0.0681379952312,0.093740716,6421
100,0.0816091790951,0.101749019001,7048
110,0.0799273441149,0.114670708001,7688
120,0.0879248694105,0.124414913,8329
130,0.082429730097,0.135471119,8954
140,0.0926580869815,0.143784804,9585
150,0.0817668445179,0.151899377999,10215
160,0.0845331862975,0.161431039998,10838
170,0.0963426498394,0.170498108997,11467
180,0.0809036482862,0.178562509996,12088
190,0.0892283847643,0.186605972996,12718
200,0.0872691216815,0.198540797996,13340
210,0.0797298914848,0.207872952995,13965
220,0.0881834567657,0.220461999996,14577
230,0.0917150354056,0.229954155995,15198
240,0.082642583342,0.241145472995,15820
250,0.0868734879316,0.252307159995,16459
260,0.0855647128537,0.260801388995,17094
270,0.0818875559565,0.270986482994,17729
280,0.0859451464498,0.278859278995,18357
290,0.0893144647244,0.286931186994,18997
300,0.0969125393371,0.295392625994,19633
310,0.0935325234208,0.303515101994,20263
320,0.09190397664,0.311307305994,20896
330,0.0896565644202,0.321824646995,21518
340,0.083507994049,0.329993739995,22150
350,0.0871340033542,0.339767179994,22781
360,0.0887986526569,0.348031876994,23422
370,0.0942673389708,0.356522944994,24039
380,0.0947324034161,0.363935493993,24657
390,0.0982994856516,0.376084836993,25276
400,0.10072320465,0.386016696993,25908
410,0.10124742905,0.393312701994,26534
420,0.0868236192633,0.401130189994,27166
430,0.0955788789853,0.409447825994,27801
440,0.0879430688359,0.419066400995,28436
450,0.0893263578343,0.427193221994,29075
460,0.103307271652,0.434955005994,29707
470,0.0973395387325,0.442931308995,30330
480,0.100762142184,0.450280252995,30959
490,0.097544903531,0.457876110995,31592
500,0.111761352632,0.465326585994,32224
510,0.107995073564,0.472873455996,32849
520,0.10520805977,0.483284129996,33488
530,0.117082784391,0.490800184996,34119
540,0.119431109257,0.499505376996,34750
550,0.118987754939,0.509103408996,35389
560,0.118862205234,0.518506280996,36024
570,0.113567706275,0.526743324996,36643
580,0.116093249474,0.534328120995,37270
590,0.123068744877,0.542284670995,37892
600,0.125043669675,0.549231836994,38515
610,0.122353276645,0.557848535995,39157
620,0.108965632333,0.564856540996,39780
630,0.110127716371,0.574505930996,40415
640,0.114623662249,0.582138529995,41029
650,0.105786796858,0.589852510995,41655
660,0.103401170294,0.597705553995,42289
670,0.103807325551,0.605007880995,42918
680,0.105773973769,0.613018158996,43554
690,0.106668425403,0.620403448997,44186
700,0.0984464780091,0.632791408996,44813
710,0.100625156862,0.644972751996,45447
720,0.104759315039,0.652391226997,46086
730,0.102807717527,0.661088122997,46708
740,0.104474004526,0.672883094996,47332
750,0.105450754466,0.684026609995,47961
760,0.112544388891,0.692324097996,48602
770,0.105637093068,0.699953140995,49239
780,0.104868794738,0.707225442995,49885
790,0.101492540268,0.718366981995,50523
800,0.107113824277,0.726894395995,51157
810,0.0990995371441,0.734549117995,51787
820,0.0916013397879,0.744895002996,52426
830,0.100110473807,0.752754366995,53057
840,0.100621611242,0.765051067994,53697
850,0.101735939389,0.776393298995,54320
860,0.104238986923,0.783843378995,54950
870,0.10717369475,0.790899976995,55591
880,0.102367898606,0.799716180994,56218
890,0.102888441154,0.807070655994,56855
900,0.103665420042,0.814513624995,57500
910,0.103630647924,0.821256938994,58133
920,0.104131929204,0.830050229995,58751
930,0.111660207896,0.837449741995,59385
940,0.117254390154,0.844410339996,60012
950,0.115405171568,0.851483529996,60631
960,0.115407664852,0.858313756997,61259
970,0.115704995516,0.865105268997,61884
980,0.116502918026,0.872212039996,62537
990,0.11701937886,0.879423107996,63165
1000,0.115283731777,0.886442174997,63792
1010,0.110238846972,0.896923170996,64423
1020,0.105290979165,0.904329398996,65054
1030,0.109613667669,0.912150836997,65680
1040,0.100794234521,0.919514002997,66314
1050,0.0968439562442,0.927184921997,66929
1060,0.100520494366,0.936405274997,67556
1070,0.0921318269237,0.944199058997,68186
1080,0.0998183232984,0.957144451997,68804
1090,0.103238495734,0.964497346997,69432
1100,0.101527837824,0.977189505997,70070
1110,0.101092557285,0.987670106997,70697
1120,0.10274148203,0.995952582998,71332
1130,0.107212127943,1.004675158,71951
1140,0.106528919274,1.012711115,72582
1150,0.11178277349,1.019981046,73202
1160,0.108851367345,1.027688707,73843
1170,0.103032993631,1.039723878,74473
1180,0.109748141918,1.04676309299,75103
1190,0.106398639005,1.054252284,75731
1200,0.111992651984,1.06316172399,76362
1210,0.10903885795,1.07402671999,76987
1220,0.105373741087,1.080947812,77626
1230,0.110566084636,1.089673547,78257
1240,0.106684160147,1.102167779,78890
1250,0.105743244669,1.112096478,79524
1260,0.0984377038842,1.119162558,80148
1270,0.101431855065,1.127605034,80778
1280,0.1037943782,1.134601978,81415
1290,0.108300106085,1.145822135,82041
1300,0.10658893822,1.15461582,82671
1310,0.110045409369,1.161428665,83301
1320,0.112322546155,1.1690664,83945
1330,0.10765445288,1.1758749,84584
1340,0.10724309271,1.183577029,85219
1350,0.109204820082,1.190407652,85855
1360,0.107513295824,1.198603214,86491
1370,0.10525214673,1.20536154,87117
1380,0.104459556575,1.213281744,87752
1390,0.112997288527,1.221930047,88389
1400,0.105426614119,1.229330349,89019
1410,0.100590780974,1.236992182,89654
1420,0.103677257774,1.245047102,90285
1430,0.112507267673,1.252320985,90916
1440,0.105527474357,1.259129484,91546
1450,0.108477114505,1.266285638,92184
1460,0.110173757735,1.27316090299,92804
1470,0.115482402736,1.28048416799,93417
1480,0.115115780494,1.28754669199,94039
1490,0.105419928246,1.29620763699,94683
1500,0.104815190328,1.30420803899,95314
1510,0.109774568228,1.31151471199,95949
1520,0.102144236165,1.32298375799,96595
1530,0.102944980478,1.33339403799,97225
1540,0.1062023114,1.34073350099,97857
1550,0.101690170074,1.35209548499,98497
1560,0.102034696729,1.36369055599,99135
1570,0.100204277144,1.37135554899,99751
1580,0.100452715717,1.38398607799,100385
1590,0.103869246378,1.39093008299,101019
1600,0.10938585921,1.40210836299,101651
1610,0.107789231698,1.41174748199,102279
1620,0.106911866844,1.41899568499,102911
1630,0.109682442469,1.42645169099,103546
1640,0.105411523689,1.43547174699,104183
1650,0.111426816019,1.44240350499,104806
1660,0.106064424593,1.44921318899,105429
1670,0.10848499229,1.456411615,106057
1680,0.109322871496,1.46464865799,106701
1690,0.108071218746,1.47216471299,107327
1700,0.108389204929,1.48105281799,107963
1710,0.106268848044,1.48828600899,108593
1720,0.105261270568,1.495399101,109220
1730,0.109252885813,1.504820146,109846
1740,0.104238576728,1.512084547,110476
1750,0.108724583304,1.523614433,111109
1760,0.108664833295,1.534954689,111741
1770,0.104434710067,1.543708473,112374
1780,0.109991844722,1.551311837,113007
1790,0.109905935538,1.559708881,113643
1800,0.104258352061,1.56722730699,114273
1810,0.108010448306,1.57499541199,114916
1820,0.106684039564,1.583106431,115545
1830,0.109908423996,1.59036767099,116176
1840,0.110319868282,1.59841271499,116808
1850,0.10723995584,1.61061104499,117440
1860,0.1093085661,1.618882854,118068
1870,0.107264695382,1.628021429,118678
1880,0.110454977428,1.635674571,119321
1890,0.109901859158,1.64302391,119954
1900,0.109526569076,1.650718533,120597
1910,0.107469814117,1.657942637,121227
1920,0.104103314763,1.665526643,121862
1930,0.107655416522,1.672735735,122499
1940,0.110551080983,1.68082779,123137
1950,0.106290616113,1.688420488,123769
1960,0.104291479547,1.698033138,124413
1970,0.10864081248,1.706017342,125053
1980,0.107360087526,1.713661792,125689
1990,0.110309084766,1.72174752699,126325
2000,0.106494021042,1.72903365599,126948
