k,GMM,Kmeans
2,0.2185686591182112,0.18526001280705062
3,0.380955941141636,0.29319441574859983
4,0.44822902918301705,0.3957210813500476
5,0.53116974920769,0.43736162867361084
6,0.58099607927055,0.5121287792405841
7,0.6107403733263385,0.562133310857015
8,0.6721635645511194,0.5768167136265088
9,0.7054850829618464,0.6491363534501785
10,0.7195810347064626,0.6748138723090883
15,0.7078410359260727,0.6911459187866562
20,0.6685310393258701,0.6560209823067471
25,0.6636492903551233,0.6038443266887322
30,0.6320416031805753,0.6037380230246882
35,0.6078799660203443,0.5907989511886778
40,0.6021480361047363,0.5727369607585714
