,train,test
0.1,0.0022109269506006136,0.00040580804868432406
0.2,0.003258790334878553,0.000391269754105289
0.3,0.0042782882422332715,0.00033050916426139305
0.4,0.00522857122539651,0.00031944741838604574
0.5,0.006912643022448234,0.00031399555791890575
0.6,0.00811015602592557,0.0002846819313492233
0.7,0.008565899955990053,0.0002748843850024829
0.8,0.009382651863943681,0.00022004973044895682
0.9,0.010903404884392908,0.00019942747563849171
