,train,test
0.1,0.2428907344446174,0.02169358489850452
0.2,0.35366874653826613,0.02175900722411015
0.3,0.45132705394892464,0.018285381981838177
0.4,0.5498483355628018,0.016240618256779627
0.5,0.612702913900901,0.014336733766690202
0.6,0.7004898773173377,0.013298667928759045
0.7,0.770579074495328,0.010833004773142817
0.8,1.0028787403515893,0.012868840089031863
0.9,1.0187374913382583,0.006823042880857599
