iterations,fitness,time,fevals
0,21.0,0.003582423,553
10,19.0,0.005166227,1012
20,23.0,0.006644549,1438
30,20.0,0.00818687099999,1885
40,22.0,0.00962292199999,2321
50,22.0,0.011820257,2775
60,23.0,0.014106481,3238
70,24.0,0.015668556,3697
80,24.0,0.019004065,4153
90,25.0,0.020595375,4617
100,26.0,0.02212308,5088
110,26.0,0.023546094,5544
120,27.0,0.024936712,5999
130,25.0,0.02632338,6459
140,29.0,0.027826591,6920
150,30.0,0.029205752,7348
160,31.0,0.031877557,7810
170,30.0,0.033255138,8278
180,32.0,0.034608226,8712
190,31.0,0.035994894,9161
200,31.0,0.037835093,9628
210,31.0,0.039303538,10106
220,32.0,0.040829267,10564
230,32.0,0.042265318,11007
240,34.0,0.044940283,11460
250,33.0,0.046574655,11917
260,34.0,0.048266706,12371
270,35.0,0.050496831,12823
280,36.0,0.052237869,13279
290,40.0,0.053779401,13734
300,38.0,0.055342662,14185
310,38.0,0.056849033,14645
320,37.0,0.059548887,15103
330,38.0,0.061015357,15555
340,38.0,0.062415457,16000
350,38.0,0.063836495,16450
360,38.0,0.065922027,16904
370,37.0,0.067365584,17361
380,37.0,0.069066722,17811
390,39.0,0.07045497,18259
400,41.0,0.073395417,18714
410,39.0,0.075117493,19171
420,47.0,0.076524309,19620
430,39.0,0.077914928,20064
440,40.0,0.079501892,20521
450,38.0,0.08091898,20984
460,43.0,0.08237755,21430
470,43.0,0.084314539,21884
480,43.0,0.087097356,22341
490,45.0,0.088544863,22814
500,46.0,0.089984469,23283
510,48.0,0.091385754,23719
520,49.0,0.092767286,24165
530,48.0,0.094162645,24624
540,49.0,0.095509016,25071
550,50.0,0.096856968,25524
560,49.0,0.09947465,25993
570,50.0,0.100884232,26461
580,51.0,0.102233763,26908
590,50.0,0.103867345,27381
600,50.0,0.105230309,27829
610,50.0,0.106599989,28273
620,52.0,0.108115052,28732
630,52.0,0.109480387,29176
640,52.0,0.112177081,29630
650,53.0,0.11360286,30089
660,53.0,0.114986367,30540
670,52.0,0.116355257,30997
680,53.0,0.117813431,31461
690,53.0,0.119366025,31918
700,52.0,0.121598916,32367
710,55.0,0.123078818,32824
720,54.0,0.125690178,33285
730,54.0,0.127200895,33738
740,56.0,0.128533439,34203
750,56.0,0.129864798,34658
760,55.0,0.131799812,35110
770,55.0,0.133265097,35579
780,55.0,0.13459053,36031
790,54.0,0.136146679,36501
800,54.0,0.138707867,36954
810,55.0,0.140083078,37413
820,54.0,0.141444461,37870
830,55.0,0.142793994,38328
840,55.0,0.144119032,38772
850,56.0,0.145625403,39221
860,56.0,0.146989947,39684
870,53.0,0.148338689,40113
880,55.0,0.150335333,40560
890,55.0,0.153212175,41024
900,57.0,0.154604374,41471
910,57.0,0.155990646,41931
920,57.0,0.157360721,42389
930,59.0,0.158726056,42857
940,59.0,0.160071637,43316
950,58.0,0.161376527,43769
960,56.0,0.16270512,44224
970,56.0,0.165274209,44689
980,56.0,0.16661584,45147
990,58.0,0.168465126,45607
1000,58.0,0.170028781,46039
1010,59.0,0.171373573,46486
1020,57.0,0.172754315,46955
1030,57.0,0.174099897,47411
1040,58.0,0.175560046,47853
1050,57.0,0.178508789,48315
1060,56.0,0.179869383,48779
1070,57.0,0.18121615,49233
1080,57.0,0.182567262,49693
1090,57.0,0.184053881,50153
1100,57.0,0.185425536,50616
1110,58.0,0.187104945,51064
1120,57.0,0.188442625,51514
1130,57.0,0.191048059,51979
1140,58.0,0.192412603,52452
1150,58.0,0.194140999,52912
1160,58.0,0.195472753,53363
1170,58.0,0.19682031,53822
1180,59.0,0.198246879,54298
1190,58.0,0.199613398,54768
1200,58.0,0.200976757,55224
1210,57.0,0.204405896,55683
1220,58.0,0.206942194,56149
1230,60.0,0.208331628,56606
1240,61.0,0.20974437,57051
1250,60.0,0.211266939,57497
1260,65.0,0.212620422,57965
1270,62.0,0.213936374,58414
1280,61.0,0.215638301,58861
1290,61.0,0.218824477,59316
1300,62.0,0.22017954,59775
1310,65.0,0.221613221,60230
1320,65.0,0.22325984,60676
1330,66.0,0.224637816,61132
1340,67.0,0.225969965,61584
1350,66.0,0.227396139,62037
1360,65.0,0.228734214,62499
1370,66.0,0.231710217,62945
1380,66.0,0.233196835,63399
1390,66.0,0.234798812,63864
1400,66.0,0.23612543,64318
1410,67.0,0.237491555,64763
1420,67.0,0.239635162,65212
1430,66.0,0.241039213,65660
1440,67.0,0.242413634,66132
1450,67.0,0.244857883,66578
1460,67.0,0.246193983,67050
1470,67.0,0.247918034,67499
1480,67.0,0.249264405,67957
1490,66.0,0.250609591,68415
1500,66.0,0.252378679,68861
1510,66.0,0.253772063,69323
1520,68.0,0.255133841,69785
1530,66.0,0.257669744,70245
1540,70.0,0.258998733,70697
1550,69.0,0.260344709,71161
1560,65.0,0.26168792,71608
1570,65.0,0.263002686,72069
1580,66.0,0.264345897,72514
1590,66.0,0.266314096,72961
1600,66.0,0.267647035,73402
1610,65.0,0.270580766,73849
1620,64.0,0.271927138,74305
1630,64.0,0.273288127,74781
1640,64.0,0.274735239,75239
1650,64.0,0.276085956,75694
1660,65.0,0.277446154,76167
1670,65.0,0.278832032,76619
1680,65.0,0.280164182,77078
1690,66.0,0.282673221,77544
1700,65.0,0.284496037,77999
1710,66.0,0.285810409,78455
1720,65.0,0.28712636,78900
1730,66.0,0.288641423,79337
1740,66.0,0.289993325,79800
1750,66.0,0.291647055,80255
1760,65.0,0.293006859,80711
1770,66.0,0.29549575,81158
1780,66.0,0.296808541,81609
1790,65.0,0.298562222,82060
1800,65.0,0.299889235,82518
1810,65.0,0.301351755,82975
1820,67.0,0.302717485,83422
1830,66.0,0.304125882,83888
1840,66.0,0.30548213,84356
1850,67.0,0.308117194,84824
1860,67.0,0.310310183,85282
1870,67.0,0.312514629,85740
1880,67.0,0.314333495,86209
1890,68.0,0.316862683,86665
1900,68.0,0.319543575,87128
1910,70.0,0.320876119,87580
1920,71.0,0.322208663,88040
1930,70.0,0.323507232,88480
1940,71.0,0.326004024,88940
1950,70.0,0.327323137,89391
1960,69.0,0.328655682,89856
1970,69.0,0.330013511,90314
1980,71.0,0.331354746,90773
1990,71.0,0.332693611,91226
2000,72.0,0.334008772,91677
2010,73.0,0.336364527,92147
2020,73.0,0.338794554,92605
2030,72.0,0.340221913,93051
2040,70.0,0.341548926,93502
2050,71.0,0.342862902,93957
2060,71.0,0.344326212,94416
2070,72.0,0.345644139,94873
2080,70.0,0.347478807,95317
2090,70.0,0.348831894,95774
2100,69.0,0.351998316,96237
2110,68.0,0.353379058,96692
2120,68.0,0.354924145,97145
2130,68.0,0.356267356,97605
2140,68.0,0.357601086,98059
2150,68.0,0.359201482,98522
2160,69.0,0.361045237,98974
2170,69.0,0.363032004,99420
2180,66.0,0.36625492,99877
2190,66.0,0.36762302,100332
2200,66.0,0.368973342,100789
2210,67.0,0.370321294,101247
2220,67.0,0.371720999,101716
2230,68.0,0.373950334,102172
2240,68.0,0.375402187,102638
2250,67.0,0.376733941,103100
2260,67.0,0.379295524,103556
2270,68.0,0.380640315,104028
2280,69.0,0.381966933,104494
2290,68.0,0.38329039,104957
2300,70.0,0.384603972,105422
2310,68.0,0.385907677,105877
2320,68.0,0.387841506,106324
2330,68.0,0.389471137,106768
2340,67.0,0.391957657,107224
2350,65.0,0.39331588,107690
2360,64.0,0.394687536,108155
2370,67.0,0.396135044,108617
2380,65.0,0.397464033,109068
2390,66.0,0.398810405,109535
2400,67.0,0.40024053,109992
2410,70.0,0.401836185,110443
2420,69.0,0.404377619,110905
2430,67.0,0.405709374,111357
2440,67.0,0.407045474,111826
2450,66.0,0.408355895,112277
2460,67.0,0.409680538,112734
2470,67.0,0.411010712,113189
2480,67.0,0.412814566,113647
2490,68.0,0.414157381,114107
2500,68.0,0.41676005,114550
2510,68.0,0.418131705,115016
2520,68.0,0.419541286,115476
2530,68.0,0.420867905,115933
2540,69.0,0.422180301,116390
2550,69.0,0.423498623,116848
2560,69.0,0.424814969,117317
2570,69.0,0.426326477,117779
2580,69.0,0.428756109,118234
2590,70.0,0.430080752,118685
2600,69.0,0.43140184,119148
2610,70.0,0.432746236,119613
2620,69.0,0.43467888,120068
2630,69.0,0.43601893,120531
2640,70.0,0.437349104,120976
2650,68.0,0.438687969,121444
2660,69.0,0.441133008,121890
2670,69.0,0.443064861,122337
2680,72.0,0.444666047,122783
2690,70.0,0.44605153,123241
2700,70.0,0.447408568,123698
2710,71.0,0.448748224,124153
2720,72.0,0.450098151,124618
2730,71.0,0.451513263,125070
2740,71.0,0.454254994,125531
2750,70.0,0.455593859,125991
2760,71.0,0.456939441,126448
2770,71.0,0.458278701,126894
2780,70.0,0.459604134,127349
2790,70.0,0.460948135,127811
2800,70.0,0.462264876,128264
2810,70.0,0.463636532,128715
2820,69.0,0.466930955,129160
2830,69.0,0.468424685,129618
2840,69.0,0.469786069,130066
2850,70.0,0.471152589,130537
2860,69.0,0.472728886,130996
2870,69.0,0.474272789,131452
2880,69.0,0.475580444,131912
2890,68.0,0.476910223,132370
2900,68.0,0.479392398,132823
2910,69.0,0.481818869,133266
2920,68.0,0.483168796,133728
2930,69.0,0.484867167,134185
2940,69.0,0.48622697,134653
2950,70.0,0.487593095,135120
2960,70.0,0.488906281,135565
2970,70.0,0.490291369,136012
2980,70.0,0.491616012,136465
2990,69.0,0.493630039,136930
3000,70.0,0.495064114,137384
3010,70.0,0.496397053,137842
3020,71.0,0.498094635,138299
3030,71.0,0.499551623,138755
3040,70.0,0.500858093,139221
3050,70.0,0.50227281,139680
3060,69.0,0.503783527,140143
3070,69.0,0.506183924,140592
3080,69.0,0.507510938,141049
3090,70.0,0.50883242,141507
3100,69.0,0.510163384,141974
3110,70.0,0.511496324,142436
3120,72.0,0.51319114,142896
3130,73.0,0.514520129,143352
3140,70.0,0.515834106,143805
3150,70.0,0.518378305,144260
3160,69.0,0.519705319,144715
3170,70.0,0.521262258,145176
3180,69.0,0.522958259,145617
3190,69.0,0.524269075,146063
3200,69.0,0.525601224,146535
3210,71.0,0.52694483,146984
3220,70.0,0.528258411,147434
3230,73.0,0.531303945,147889
3240,73.0,0.532623453,148345
3250,74.0,0.53391412,148801
3260,73.0,0.535251405,149273
3270,73.0,0.536575653,149730
3280,73.0,0.53789753,150186
3290,74.0,0.539439458,150651
3300,74.0,0.541063163,151103
3310,75.0,0.543542177,151567
3320,75.0,0.544869585,152036
3330,75.0,0.546181586,152488
3340,74.0,0.547479365,152937
3350,74.0,0.549407663,153393
3360,75.0,0.550850429,153850
3370,73.0,0.552170331,154307
3380,74.0,0.553458233,154752
3390,70.0,0.555975963,155206
3400,70.0,0.557276902,155650
3410,71.0,0.558597594,156102
3420,72.0,0.560113447,156557
3430,73.0,0.561427028,157008
3440,72.0,0.562895474,157470
3450,75.0,0.56462308,157923
3460,75.0,0.565945748,158377
3470,74.0,0.568429898,158835
3480,75.0,0.569844615,159279
3490,75.0,0.571147925,159736
3500,75.0,0.572595037,160182
3510,75.0,0.574259829,160628
3520,76.0,0.575593164,161092
3530,75.0,0.576900424,161534
3540,75.0,0.57821203,161985
3550,75.0,0.580681958,162447
3560,75.0,0.582552181,162897
3570,76.0,0.584779146,163346
3580,75.0,0.586087987,163809
3590,77.0,0.587529569,164266
3600,77.0,0.588859743,164704
3610,78.0,0.590427745,165151
3620,78.0,0.591723549,165597
3630,78.0,0.594059156,166054
3640,78.0,0.595389725,166524
3650,76.0,0.597195949,166981
3660,76.0,0.598576691,167445
3670,76.0,0.599935704,167912
3680,76.0,0.601809088,168358
3690,76.0,0.603384595,168810
3700,78.0,0.60500751,169279
3710,79.0,0.608075562,169733
3720,77.0,0.609393094,170192
3730,78.0,0.610697194,170654
3740,78.0,0.612240307,171113
3750,76.0,0.613571666,171577
3760,77.0,0.614889988,172040
3770,76.0,0.616256507,172493
3780,78.0,0.617600113,172950
3790,75.0,0.620084658,173405
3800,77.0,0.621497795,173858
3810,75.0,0.623825896,174311
3820,76.0,0.625110243,174754
3830,77.0,0.627202097,175207
3840,77.0,0.628508567,175660
3850,80.0,0.62996121,176107
3860,78.0,0.631657607,176562
3870,77.0,0.634409609,177012
3880,77.0,0.635712524,177464
3890,78.0,0.637179389,177907
3900,78.0,0.638468477,178351
3910,78.0,0.639782453,178811
3920,77.0,0.641393121,179263
3930,78.0,0.642893172,179721
3940,78.0,0.644195297,180177
3950,77.0,0.646655744,180638
3960,77.0,0.648791449,181102
3970,77.0,0.650159944,181557
3980,77.0,0.651599155,182004
3990,78.0,0.652911156,182462
4000,79.0,0.654219996,182924
4010,77.0,0.655536737,183379
4020,77.0,0.656836491,183840
4030,77.0,0.659558469,184296
4040,78.0,0.660863359,184749
4050,77.0,0.662403705,185208
4060,76.0,0.663795113,185644
4070,76.0,0.6650842,186085
4080,75.0,0.666483114,186553
4090,75.0,0.667808547,187015
4100,76.0,0.669154129,187492
4110,76.0,0.670464154,187945
4120,75.0,0.673088551,188406
4130,74.0,0.674379613,188858
4140,74.0,0.676094182,189317
4150,74.0,0.677432652,189762
4160,74.0,0.678748208,190210
4170,74.0,0.680070481,190665
4180,74.0,0.681424359,191124
4190,74.0,0.682762829,191586
4200,75.0,0.685178238,192037
4210,75.0,0.686568066,192493
4220,73.0,0.689988118,192952
4230,74.0,0.691296958,193404
4240,73.0,0.692601848,193869
4250,73.0,0.693932417,194320
4260,73.0,0.695341603,194769
4270,73.0,0.696877999,195229
4280,73.0,0.699538347,195691
4290,73.0,0.700860225,196142
4300,74.0,0.702843437,196596
4310,74.0,0.704616081,197050
4320,74.0,0.706196724,197509
4330,74.0,0.707529663,197975
4340,74.0,0.708840479,198433
4350,75.0,0.710632086,198892
4360,75.0,0.713457965,199343
4370,75.0,0.714749027,199780
4380,74.0,0.71619851,200233
4390,76.0,0.717653128,200684
4400,75.0,0.71906666,201137
4410,74.0,0.720390118,201576
4420,73.0,0.722211355,202026
4430,73.0,0.723547455,202484
4440,75.0,0.726038321,202927
4450,75.0,0.727347557,203375
4460,74.0,0.728808496,203829
4470,73.0,0.730302225,204283
4480,74.0,0.731592103,204735
4490,73.0,0.732937289,205178
4500,75.0,0.734256401,205640
4510,74.0,0.735552994,206086
4520,74.0,0.738026477,206542
4530,73.0,0.739652157,206992
4540,72.0,0.741112701,207439
4550,71.0,0.742444455,207902
4560,76.0,0.74378016,208362
4570,70.0,0.745079519,208817
4580,76.0,0.746434582,209268
4590,73.0,0.747797941,209722
4600,74.0,0.750291573,210185
4610,74.0,0.75161108,210641
4620,74.0,0.752910044,211088
4630,75.0,0.754284859,211553
4640,75.0,0.755810194,212015
4650,73.0,0.757484071,212482
4660,73.0,0.758818986,212928
4670,74.0,0.760143233,213385
4680,74.0,0.762725754,213844
4690,75.0,0.764018792,214295
4700,75.0,0.765358447,214722
4710,75.0,0.766727732,215167
4720,75.0,0.76805277,215626
4730,75.0,0.769364771,216069
4740,75.0,0.77069376,216529
4750,74.0,0.772016823,216984
4760,75.0,0.774581961,217440
4770,75.0,0.776433617,217886
4780,76.0,0.777779199,218351
4790,76.0,0.779304928,218821
4800,76.0,0.780745324,219273
4810,77.0,0.782371004,219737
4820,78.0,0.783667202,220189
4830,76.0,0.784983549,220646
4840,77.0,0.787451502,221093
4850,77.0,0.789170811,221550
4860,79.0,0.790512837,222006
4870,77.0,0.791837084,222476
4880,77.0,0.793422073,222942
4890,77.0,0.794731703,223402
4900,77.0,0.796575853,223863
4910,77.0,0.797863755,224311
4920,79.0,0.800329732,224757
4930,77.0,0.801739709,225213
4940,76.0,0.803058426,225678
4950,76.0,0.804832649,226137
4960,78.0,0.806139119,226585
4970,75.0,0.807444799,227039
4980,76.0,0.808725986,227493
4990,76.0,0.810173493,227948
5000,78.0,0.813104853,228395
