k,Pen Digits Data BIC
2,115334.9160910699
3,107458.07145198737
4,101995.94483326041
5,99112.25617841467
6,97260.06875459281
7,93520.48797066635
8,91401.10791390744
9,90724.76494753864
10,84470.09851242014
15,81437.7202537784
20,77262.2916032154
25,77119.3910236503
30,77609.65226696177
35,77117.1090163443
40,76602.40462277288
