step,reward,mean,median,std,max,min
0,-0.060714285714285735,-0.060714285714285735,-0.060714285714285735,0.0,-0.060714285714285735,-0.060714285714285735
1,-0.060714285714285735,-0.060714285714285735,-0.060714285714285735,0.0,-0.060714285714285735,-0.060714285714285735
2,-0.060714285714285735,-0.06071428571428574,-0.060714285714285735,6.938893903907228e-18,-0.060714285714285735,-0.060714285714285735
3,-0.060714285714285735,-0.060714285714285735,-0.060714285714285735,0.0,-0.060714285714285735,-0.060714285714285735
4,-0.060714285714285735,-0.060714285714285735,-0.060714285714285735,0.0,-0.060714285714285735,-0.060714285714285735
5,-0.060714285714285735,-0.06071428571428573,-0.060714285714285735,6.938893903907228e-18,-0.060714285714285735,-0.060714285714285735
6,-0.060714285714285735,-0.06071428571428573,-0.060714285714285735,6.938893903907228e-18,-0.060714285714285735,-0.060714285714285735
7,-0.060714285714285735,-0.060714285714285735,-0.060714285714285735,0.0,-0.060714285714285735,-0.060714285714285735
8,-0.060714285714285735,-0.060714285714285735,-0.060714285714285735,0.0,-0.060714285714285735,-0.060714285714285735
9,-0.060714285714285735,-0.060714285714285735,-0.060714285714285735,0.0,-0.060714285714285735,-0.060714285714285735
10,-0.060714285714285735,-0.06071428571428573,-0.060714285714285735,6.938893903907228e-18,-0.060714285714285735,-0.060714285714285735
11,-0.060714285714285735,-0.06071428571428573,-0.060714285714285735,6.938893903907228e-18,-0.060714285714285735,-0.060714285714285735
12,-0.060714285714285735,-0.06071428571428573,-0.060714285714285735,6.938893903907228e-18,-0.060714285714285735,-0.060714285714285735
13,-0.060714285714285735,-0.06071428571428573,-0.060714285714285735,6.938893903907228e-18,-0.060714285714285735,-0.060714285714285735
14,-0.060714285714285735,-0.06071428571428573,-0.060714285714285735,6.938893903907228e-18,-0.060714285714285735,-0.060714285714285735
15,-0.060714285714285735,-0.060714285714285735,-0.060714285714285735,0.0,-0.060714285714285735,-0.060714285714285735
16,-0.060714285714285735,-0.060714285714285735,-0.060714285714285735,0.0,-0.060714285714285735,-0.060714285714285735
17,-0.060714285714285735,-0.060714285714285735,-0.060714285714285735,0.0,-0.060714285714285735,-0.060714285714285735
18,-0.060714285714285735,-0.060714285714285735,-0.060714285714285735,0.0,-0.060714285714285735,-0.060714285714285735
19,-0.060714285714285735,-0.060714285714285735,-0.060714285714285735,0.0,-0.060714285714285735,-0.060714285714285735
20,-0.060714285714285735,-0.060714285714285735,-0.060714285714285735,0.0,-0.060714285714285735,-0.060714285714285735
21,-0.060714285714285735,-0.06071428571428573,-0.060714285714285735,6.938893903907228e-18,-0.060714285714285735,-0.060714285714285735
22,-0.060714285714285735,-0.06071428571428573,-0.060714285714285735,6.938893903907228e-18,-0.060714285714285735,-0.060714285714285735
23,-0.060714285714285735,-0.06071428571428574,-0.060714285714285735,6.938893903907228e-18,-0.060714285714285735,-0.060714285714285735
24,-0.060714285714285735,-0.06071428571428574,-0.060714285714285735,6.938893903907228e-18,-0.060714285714285735,-0.060714285714285735
25,-0.060714285714285735,-0.060714285714285735,-0.060714285714285735,0.0,-0.060714285714285735,-0.060714285714285735
26,-0.060714285714285735,-0.060714285714285735,-0.060714285714285735,0.0,-0.060714285714285735,-0.060714285714285735
27,-0.060714285714285735,-0.060714285714285735,-0.060714285714285735,0.0,-0.060714285714285735,-0.060714285714285735
28,-0.060714285714285735,-0.060714285714285735,-0.060714285714285735,0.0,-0.060714285714285735,-0.060714285714285735
29,-0.060714285714285735,-0.060714285714285735,-0.060714285714285735,0.0,-0.060714285714285735,-0.060714285714285735
30,-0.060714285714285735,-0.060714285714285735,-0.060714285714285735,0.0,-0.060714285714285735,-0.060714285714285735
31,-0.060714285714285735,-0.060714285714285735,-0.060714285714285735,0.0,-0.060714285714285735,-0.060714285714285735
32,-0.060714285714285735,-0.06071428571428574,-0.060714285714285735,6.938893903907228e-18,-0.060714285714285735,-0.060714285714285735
33,-0.060714285714285735,-0.06071428571428575,-0.060714285714285735,1.3877787807814457e-17,-0.060714285714285735,-0.060714285714285735
34,-0.060714285714285735,-0.060714285714285755,-0.060714285714285735,2.0816681711721685e-17,-0.060714285714285735,-0.060714285714285735
35,-0.060714285714285735,-0.060714285714285755,-0.060714285714285735,2.0816681711721685e-17,-0.060714285714285735,-0.060714285714285735
36,-0.060714285714285735,-0.06071428571428576,-0.060714285714285735,2.7755575615628914e-17,-0.060714285714285735,-0.060714285714285735
37,-0.060714285714285735,-0.06071428571428577,-0.060714285714285735,3.469446951953614e-17,-0.060714285714285735,-0.060714285714285735
38,-0.060714285714285735,-0.06071428571428577,-0.060714285714285735,3.469446951953614e-17,-0.060714285714285735,-0.060714285714285735
39,-0.060714285714285735,-0.060714285714285735,-0.060714285714285735,0.0,-0.060714285714285735,-0.060714285714285735
40,-0.060714285714285735,-0.060714285714285735,-0.060714285714285735,0.0,-0.060714285714285735,-0.060714285714285735
41,-0.060714285714285735,-0.06071428571428574,-0.060714285714285735,6.938893903907228e-18,-0.060714285714285735,-0.060714285714285735
42,-0.060714285714285735,-0.06071428571428575,-0.060714285714285735,1.3877787807814457e-17,-0.060714285714285735,-0.060714285714285735
43,-0.060714285714285735,-0.06071428571428575,-0.060714285714285735,1.3877787807814457e-17,-0.060714285714285735,-0.060714285714285735
44,-0.060714285714285735,-0.060714285714285755,-0.060714285714285735,2.0816681711721685e-17,-0.060714285714285735,-0.060714285714285735
45,-0.060714285714285735,-0.06071428571428576,-0.060714285714285735,2.7755575615628914e-17,-0.060714285714285735,-0.060714285714285735
46,-0.060714285714285735,-0.06071428571428576,-0.060714285714285735,2.7755575615628914e-17,-0.060714285714285735,-0.060714285714285735
47,-0.060714285714285735,-0.06071428571428573,-0.060714285714285735,6.938893903907228e-18,-0.060714285714285735,-0.060714285714285735
48,-0.060714285714285735,-0.060714285714285735,-0.060714285714285735,0.0,-0.060714285714285735,-0.060714285714285735
49,-0.060714285714285735,-0.06071428571428574,-0.060714285714285735,6.938893903907228e-18,-0.060714285714285735,-0.060714285714285735
50,-0.060714285714285735,-0.06071428571428574,-0.060714285714285735,6.938893903907228e-18,-0.060714285714285735,-0.060714285714285735
51,-0.060714285714285735,-0.06071428571428575,-0.060714285714285735,1.3877787807814457e-17,-0.060714285714285735,-0.060714285714285735
52,-0.060714285714285735,-0.06071428571428575,-0.060714285714285735,1.3877787807814457e-17,-0.060714285714285735,-0.060714285714285735
53,-0.060714285714285735,-0.060714285714285755,-0.060714285714285735,2.0816681711721685e-17,-0.060714285714285735,-0.060714285714285735
54,-0.060714285714285735,-0.060714285714285755,-0.060714285714285735,2.0816681711721685e-17,-0.060714285714285735,-0.060714285714285735
55,-0.060714285714285735,-0.06071428571428573,-0.060714285714285735,6.938893903907228e-18,-0.060714285714285735,-0.060714285714285735
56,-0.060714285714285735,-0.060714285714285735,-0.060714285714285735,0.0,-0.060714285714285735,-0.060714285714285735
57,-0.060714285714285735,-0.060714285714285735,-0.060714285714285735,0.0,-0.060714285714285735,-0.060714285714285735
58,-0.060714285714285735,-0.06071428571428574,-0.060714285714285735,6.938893903907228e-18,-0.060714285714285735,-0.060714285714285735
59,-0.060714285714285735,-0.06071428571428574,-0.060714285714285735,6.938893903907228e-18,-0.060714285714285735,-0.060714285714285735
60,-0.060714285714285735,-0.06071428571428575,-0.060714285714285735,1.3877787807814457e-17,-0.060714285714285735,-0.060714285714285735
61,-0.060714285714285735,-0.06071428571428575,-0.060714285714285735,1.3877787807814457e-17,-0.060714285714285735,-0.060714285714285735
62,-0.060714285714285735,-0.060714285714285755,-0.060714285714285735,2.0816681711721685e-17,-0.060714285714285735,-0.060714285714285735
63,-0.060714285714285735,-0.06071428571428573,-0.060714285714285735,6.938893903907228e-18,-0.060714285714285735,-0.060714285714285735
64,-0.060714285714285735,-0.06071428571428573,-0.060714285714285735,6.938893903907228e-18,-0.060714285714285735,-0.060714285714285735
65,-0.060714285714285735,-0.06071428571428573,-0.060714285714285735,6.938893903907228e-18,-0.060714285714285735,-0.060714285714285735
66,-0.060714285714285735,-0.06071428571428573,-0.060714285714285735,6.938893903907228e-18,-0.060714285714285735,-0.060714285714285735
67,-0.060714285714285735,-0.060714285714285735,-0.060714285714285735,0.0,-0.060714285714285735,-0.060714285714285735
68,-0.060714285714285735,-0.060714285714285735,-0.060714285714285735,0.0,-0.060714285714285735,-0.060714285714285735
69,-0.060714285714285735,-0.06071428571428574,-0.060714285714285735,6.938893903907228e-18,-0.060714285714285735,-0.060714285714285735
70,-0.060714285714285735,-0.06071428571428574,-0.060714285714285735,6.938893903907228e-18,-0.060714285714285735,-0.060714285714285735
71,-0.060714285714285735,-0.060714285714285735,-0.060714285714285735,0.0,-0.060714285714285735,-0.060714285714285735
72,-0.060714285714285735,-0.060714285714285735,-0.060714285714285735,0.0,-0.060714285714285735,-0.060714285714285735
73,-0.060714285714285735,-0.06071428571428574,-0.060714285714285735,6.938893903907228e-18,-0.060714285714285735,-0.060714285714285735
74,-0.060714285714285735,-0.06071428571428574,-0.060714285714285735,6.938893903907228e-18,-0.060714285714285735,-0.060714285714285735
75,-0.060714285714285735,-0.06071428571428574,-0.060714285714285735,6.938893903907228e-18,-0.060714285714285735,-0.060714285714285735
76,-0.060714285714285735,-0.06071428571428575,-0.060714285714285735,1.3877787807814457e-17,-0.060714285714285735,-0.060714285714285735
77,-0.060714285714285735,-0.06071428571428575,-0.060714285714285735,1.3877787807814457e-17,-0.060714285714285735,-0.060714285714285735
78,-0.060714285714285735,-0.06071428571428575,-0.060714285714285735,1.3877787807814457e-17,-0.060714285714285735,-0.060714285714285735
79,-0.060714285714285735,-0.060714285714285735,-0.060714285714285735,0.0,-0.060714285714285735,-0.060714285714285735
80,-0.060714285714285735,-0.060714285714285735,-0.060714285714285735,0.0,-0.060714285714285735,-0.060714285714285735
81,-0.060714285714285735,-0.060714285714285735,-0.060714285714285735,0.0,-0.060714285714285735,-0.060714285714285735
82,-0.060714285714285735,-0.06071428571428574,-0.060714285714285735,6.938893903907228e-18,-0.060714285714285735,-0.060714285714285735
83,-0.060714285714285735,-0.06071428571428574,-0.060714285714285735,6.938893903907228e-18,-0.060714285714285735,-0.060714285714285735
84,-0.060714285714285735,-0.06071428571428574,-0.060714285714285735,6.938893903907228e-18,-0.060714285714285735,-0.060714285714285735
85,-0.060714285714285735,-0.06071428571428575,-0.060714285714285735,1.3877787807814457e-17,-0.060714285714285735,-0.060714285714285735
86,-0.060714285714285735,-0.06071428571428575,-0.060714285714285735,1.3877787807814457e-17,-0.060714285714285735,-0.060714285714285735
87,-0.060714285714285735,-0.06071428571428573,-0.060714285714285735,6.938893903907228e-18,-0.060714285714285735,-0.060714285714285735
88,-0.060714285714285735,-0.060714285714285735,-0.060714285714285735,0.0,-0.060714285714285735,-0.060714285714285735
89,-0.060714285714285735,-0.060714285714285735,-0.060714285714285735,0.0,-0.060714285714285735,-0.060714285714285735
90,-0.060714285714285735,-0.060714285714285735,-0.060714285714285735,0.0,-0.060714285714285735,-0.060714285714285735
91,-0.060714285714285735,-0.06071428571428574,-0.060714285714285735,6.938893903907228e-18,-0.060714285714285735,-0.060714285714285735
92,-0.060714285714285735,-0.06071428571428574,-0.060714285714285735,6.938893903907228e-18,-0.060714285714285735,-0.060714285714285735
93,-0.060714285714285735,-0.06071428571428574,-0.060714285714285735,6.938893903907228e-18,-0.060714285714285735,-0.060714285714285735
94,-0.060714285714285735,-0.06071428571428575,-0.060714285714285735,1.3877787807814457e-17,-0.060714285714285735,-0.060714285714285735
95,-0.060714285714285735,-0.06071428571428573,-0.060714285714285735,6.938893903907228e-18,-0.060714285714285735,-0.060714285714285735
96,-0.060714285714285735,-0.060714285714285735,-0.060714285714285735,0.0,-0.060714285714285735,-0.060714285714285735
97,-0.060714285714285735,-0.060714285714285735,-0.060714285714285735,0.0,-0.060714285714285735,-0.060714285714285735
98,-0.060714285714285735,-0.060714285714285735,-0.060714285714285735,0.0,-0.060714285714285735,-0.060714285714285735
99,-0.060714285714285735,-0.06071428571428574,-0.060714285714285735,6.938893903907228e-18,-0.060714285714285735,-0.060714285714285735
100,-0.060714285714285735,-0.06071428571428574,-0.060714285714285735,6.938893903907228e-18,-0.060714285714285735,-0.060714285714285735
101,-0.060714285714285735,-0.06071428571428574,-0.060714285714285735,6.938893903907228e-18,-0.060714285714285735,-0.060714285714285735
102,-0.060714285714285735,-0.06071428571428574,-0.060714285714285735,6.938893903907228e-18,-0.060714285714285735,-0.060714285714285735
103,-0.060714285714285735,-0.06071428571428573,-0.060714285714285735,6.938893903907228e-18,-0.060714285714285735,-0.060714285714285735
104,-0.060714285714285735,-0.060714285714285735,-0.060714285714285735,0.0,-0.060714285714285735,-0.060714285714285735
105,-0.060714285714285735,-0.060714285714285735,-0.060714285714285735,0.0,-0.060714285714285735,-0.060714285714285735
106,-0.060714285714285735,-0.060714285714285735,-0.060714285714285735,0.0,-0.060714285714285735,-0.060714285714285735
107,-0.060714285714285735,-0.060714285714285735,-0.060714285714285735,0.0,-0.060714285714285735,-0.060714285714285735
108,-0.060714285714285735,-0.06071428571428574,-0.060714285714285735,6.938893903907228e-18,-0.060714285714285735,-0.060714285714285735
109,-0.060714285714285735,-0.06071428571428574,-0.060714285714285735,6.938893903907228e-18,-0.060714285714285735,-0.060714285714285735
110,-0.060714285714285735,-0.06071428571428574,-0.060714285714285735,6.938893903907228e-18,-0.060714285714285735,-0.060714285714285735
111,-0.060714285714285735,-0.06071428571428573,-0.060714285714285735,6.938893903907228e-18,-0.060714285714285735,-0.060714285714285735
112,-0.060714285714285735,-0.06071428571428573,-0.060714285714285735,6.938893903907228e-18,-0.060714285714285735,-0.060714285714285735
113,-0.060714285714285735,-0.060714285714285735,-0.060714285714285735,0.0,-0.060714285714285735,-0.060714285714285735
114,-0.060714285714285735,-0.060714285714285735,-0.060714285714285735,0.0,-0.060714285714285735,-0.060714285714285735
115,-0.060714285714285735,-0.060714285714285735,-0.060714285714285735,0.0,-0.060714285714285735,-0.060714285714285735
116,-0.060714285714285735,-0.060714285714285735,-0.060714285714285735,0.0,-0.060714285714285735,-0.060714285714285735
117,-0.060714285714285735,-0.06071428571428574,-0.060714285714285735,6.938893903907228e-18,-0.060714285714285735,-0.060714285714285735
118,-0.060714285714285735,-0.06071428571428574,-0.060714285714285735,6.938893903907228e-18,-0.060714285714285735,-0.060714285714285735
119,-0.060714285714285735,-0.06071428571428573,-0.060714285714285735,6.938893903907228e-18,-0.060714285714285735,-0.060714285714285735
120,-0.060714285714285735,-0.06071428571428573,-0.060714285714285735,6.938893903907228e-18,-0.060714285714285735,-0.060714285714285735
121,-0.060714285714285735,-0.060714285714285735,-0.060714285714285735,0.0,-0.060714285714285735,-0.060714285714285735
122,-0.060714285714285735,-0.060714285714285735,-0.060714285714285735,0.0,-0.060714285714285735,-0.060714285714285735
123,-0.060714285714285735,-0.060714285714285735,-0.060714285714285735,0.0,-0.060714285714285735,-0.060714285714285735
124,-0.060714285714285735,-0.060714285714285735,-0.060714285714285735,0.0,-0.060714285714285735,-0.060714285714285735
125,-0.060714285714285735,-0.06071428571428574,-0.060714285714285735,6.938893903907228e-18,-0.060714285714285735,-0.060714285714285735
126,-0.060714285714285735,-0.06071428571428574,-0.060714285714285735,6.938893903907228e-18,-0.060714285714285735,-0.060714285714285735
127,-0.060714285714285735,-0.06071428571428573,-0.060714285714285735,6.938893903907228e-18,-0.060714285714285735,-0.060714285714285735
128,-0.060714285714285735,-0.06071428571428573,-0.060714285714285735,6.938893903907228e-18,-0.060714285714285735,-0.060714285714285735
129,-0.060714285714285735,-0.06071428571428572,-0.060714285714285735,1.3877787807814457e-17,-0.060714285714285735,-0.060714285714285735
130,-0.060714285714285735,-0.060714285714285735,-0.060714285714285735,0.0,-0.060714285714285735,-0.060714285714285735
131,-0.060714285714285735,-0.06071428571428573,-0.060714285714285735,6.938893903907228e-18,-0.060714285714285735,-0.060714285714285735
132,-0.060714285714285735,-0.060714285714285735,-0.060714285714285735,0.0,-0.060714285714285735,-0.060714285714285735
133,-0.060714285714285735,-0.06071428571428573,-0.060714285714285735,6.938893903907228e-18,-0.060714285714285735,-0.060714285714285735
134,-0.060714285714285735,-0.06071428571428574,-0.060714285714285735,6.938893903907228e-18,-0.060714285714285735,-0.060714285714285735
135,-0.060714285714285735,-0.060714285714285735,-0.060714285714285735,0.0,-0.060714285714285735,-0.060714285714285735
136,-0.060714285714285735,-0.06071428571428573,-0.060714285714285735,6.938893903907228e-18,-0.060714285714285735,-0.060714285714285735
137,-0.060714285714285735,-0.060714285714285735,-0.060714285714285735,0.0,-0.060714285714285735,-0.060714285714285735
138,-0.060714285714285735,-0.060714285714285735,-0.060714285714285735,0.0,-0.060714285714285735,-0.060714285714285735
139,-0.060714285714285735,-0.06071428571428574,-0.060714285714285735,6.938893903907228e-18,-0.060714285714285735,-0.060714285714285735
140,-0.060714285714285735,-0.060714285714285735,-0.060714285714285735,0.0,-0.060714285714285735,-0.060714285714285735
141,-0.060714285714285735,-0.06071428571428574,-0.060714285714285735,6.938893903907228e-18,-0.060714285714285735,-0.060714285714285735
142,-0.060714285714285735,-0.060714285714285735,-0.060714285714285735,0.0,-0.060714285714285735,-0.060714285714285735
143,-0.060714285714285735,-0.060714285714285735,-0.060714285714285735,0.0,-0.060714285714285735,-0.060714285714285735
144,-0.060714285714285735,-0.06071428571428573,-0.060714285714285735,6.938893903907228e-18,-0.060714285714285735,-0.060714285714285735
145,-0.060714285714285735,-0.060714285714285735,-0.060714285714285735,0.0,-0.060714285714285735,-0.060714285714285735
146,-0.060714285714285735,-0.06071428571428574,-0.060714285714285735,6.938893903907228e-18,-0.060714285714285735,-0.060714285714285735
147,-0.060714285714285735,-0.06071428571428574,-0.060714285714285735,6.938893903907228e-18,-0.060714285714285735,-0.060714285714285735
148,-0.060714285714285735,-0.060714285714285735,-0.060714285714285735,0.0,-0.060714285714285735,-0.060714285714285735
149,-0.060714285714285735,-0.06071428571428574,-0.060714285714285735,6.938893903907228e-18,-0.060714285714285735,-0.060714285714285735
