iterations,fitness,time,fevals
0,0.0256650114955,0.00453965700035,423
10,0.0271226439332,0.00920217900057,757
20,0.031618630684,0.0125846999999,1098
30,0.0342065416922,0.0157361099991,1425
40,0.035457868931,0.018682087999,1765
50,0.0362389123007,0.0218880159991,2105
60,0.0392169854749,0.0247352279985,2436
70,0.0415402533654,0.0279557739977,2771
80,0.0426513492444,0.0309459979962,3100
90,0.0434558625211,0.0359391869952,3432
100,0.0449534921827,0.0407652649956,3774
110,0.0462500160964,0.0461167749963,4109
120,0.0458213550576,0.0507476919975,4445
130,0.0456225641717,0.0538797439986,4778
140,0.0463717078198,0.0583573769982,5116
150,0.0515181339839,0.0612053789973,5452
160,0.0514603302401,0.0639060229969,5795
170,0.0501533441125,0.0672391609969,6132
180,0.0505668738736,0.0705861259958,6477
190,0.0539537862055,0.0736913129967,6823
200,0.057745329214,0.0777296369979,7151
210,0.0548859350974,0.0806756139973,7485
220,0.0573995345027,0.0835485059979,7816
230,0.0519930401555,0.0862305819992,8140
240,0.059769295684,0.0914438199998,8474
250,0.0570282937887,0.0942685129994,8804
260,0.0574644001716,0.0972121199993,9147
270,0.0578456500375,0.100090541999,9487
280,0.0615916873797,0.105010644,9833
290,0.064069091771,0.107831780999,10170
300,0.0647366522153,0.110650152999,10500
310,0.0638727210253,0.115710897,10846
320,0.0625254811659,0.118594060001,11192
330,0.0595306829259,0.121464976,11534
340,0.0582705857996,0.125001572002,11878
350,0.0610580442269,0.128004439002,12210
360,0.0636222854045,0.130996639002,12535
370,0.0564852465055,0.133879801002,12861
380,0.0582098510695,0.137141828003,13201
390,0.057474639969,0.140315756002,13544
400,0.0587893597155,0.143210375001,13886
410,0.0588836222215,0.145861636001,14217
420,0.0582499318543,0.149044650001,14549
430,0.0609145586771,0.151892257001,14879
440,0.0629649615351,0.154688506002,15223
450,0.0596802629242,0.157470138001,15547
460,0.0615753039415,0.160399523002,15890
470,0.0713161288887,0.163486932002,16214
480,0.0669427661292,0.166244070002,16549
490,0.0611777850089,0.170161110002,16882
500,0.0588730411885,0.173127631,17212
510,0.0623658731329,0.177581560001,17546
520,0.0607534276679,0.182350748002,17880
530,0.055733088759,0.185440133002,18215
540,0.0600663130427,0.190195100002,18558
550,0.0655458709458,0.194725277002,18893
560,0.0659280748939,0.200143158001,19232
570,0.0605989421627,0.204354124,19561
580,0.0561674632222,0.207174076999,19890
590,0.0568004411037,0.210448350999,20228
600,0.0538080995735,0.213183365,20556
610,0.0561752274441,0.215998972,20884
620,0.0588834738377,0.218728850999,21226
630,0.0570191042197,0.221885397001,21567
640,0.0568074198798,0.224780017001,21902
650,0.0571846963672,0.227627624001,22246
660,0.0623044527766,0.230521058002,22580
670,0.0602331117055,0.233410541001,22899
680,0.0590876553363,0.236767778002,23245
690,0.0602717137649,0.239577064003,23577
700,0.0580275504206,0.242374498004,23909
710,0.0565454828487,0.246609168003,24238
720,0.0648554555734,0.251374011003,24572
730,0.0649256832562,0.254233470001,24904
740,0.0729215618382,0.258215301001,25234
750,0.0742693461566,0.263178859999,25572
760,0.0697245108614,0.267878912999,25915
770,0.0712221290623,0.271345186999,26235
780,0.073337352843,0.274135904998,26577
790,0.0754897748687,0.276947561999,26913
800,0.0734504687113,0.279831908998,27246
810,0.073298081766,0.282614725998,27568
820,0.0723893638778,0.285374233999,27906
830,0.0646425432139,0.288343124999,28245
840,0.0646484784395,0.291451867999,28584
850,0.0700400788776,0.297401502999,28938
860,0.0649062519006,0.300155481,29286
870,0.0648629252978,0.302954495999,29619
880,0.0666447167519,0.305918251001,29951
890,0.0658623168715,0.308662747,30287
900,0.0583219330942,0.311501266999,30631
910,0.0618173731716,0.314693368999,30963
920,0.0601755333932,0.317958556998,31295
930,0.0646463484854,0.322334264998,31632
940,0.0656583275238,0.325769724997,31968
950,0.0654565623373,0.328909282996,32299
960,0.065385643517,0.333686767995,32635
970,0.062600498322,0.338178622995,32966
980,0.062600498322,0.342793341995,33292
990,0.0580784613546,0.346073541996,33633
1000,0.0649503620253,0.350357989997,33972
1010,0.0649503620253,0.353132115997,34305
1020,0.0660580187227,0.357988613998,34644
1030,0.061959784756,0.362800074998,34985
1040,0.0608094557669,0.367552275997,35318
1050,0.0601472819992,0.372017661997,35656
1060,0.0577204225592,0.376747738997,35991
1070,0.0612028620639,0.381699051997,36319
1080,0.0623234950865,0.384543892997,36646
1090,0.0627412543609,0.387372536996,36977
1100,0.0573769797122,0.390589922996,37308
1110,0.0538340612538,0.395103900995,37641
1120,0.0591101984039,0.398576495994,37982
1130,0.0601621706837,0.402041979994,38315
1140,0.0612946794445,0.406676057995,38650
1150,0.0680587168554,0.409849195994,38982
1160,0.0680587168554,0.412548259994,39317
1170,0.0685511076469,0.415420360994,39647
1180,0.0680587168554,0.418203573994,39968
1190,0.0676823504482,0.421917552994,40306
1200,0.0659443684323,0.424603579995,40642
1210,0.0660501189371,0.427475680995,40994
1220,0.0644554832686,0.431201510995,41322
1230,0.0638091241406,0.434072031996,41657
1240,0.0637877857936,0.436977317997,41988
1250,0.0623929987447,0.439589467996,42322
1260,0.0611464957289,0.444383150998,42651
1270,0.0599019745743,0.447136338998,42990
1280,0.0638680244414,0.451208638999,43327
1290,0.0668065599365,0.456375655998,43665
1300,0.0631159937757,0.459380102997,44007
1310,0.0644500202055,0.462167660997,44341
1320,0.064559601551,0.464900699997,44680
1330,0.0673719729284,0.468364208997,45015
1340,0.0722970001124,0.471252112997,45349
1350,0.063540552924,0.474121843996,45680
1360,0.06596484609,0.478131723996,46018
1370,0.0666303622632,0.481263775995,46361
1380,0.0665049615317,0.484069506996,46687
1390,0.0672692019863,0.487649163997,47016
1400,0.0618931516876,0.490623585996,47344
1410,0.0619269120425,0.493457365998,47682
1420,0.065454949087,0.496276133998,48016
1430,0.0632494137466,0.499383296998,48357
1440,0.0612125282375,0.502168089997,48692
1450,0.0602422320232,0.504957622998,49025
1460,0.0593825650402,0.509233379997,49370
1470,0.0601961059115,0.512759308996,49712
1480,0.0601961059115,0.515663409997,50046
1490,0.0607906781054,0.518776498997,50367
1500,0.0577294861905,0.521908945997,50694
1510,0.0577294861905,0.524939466997,51028
1520,0.0556353715902,0.527881493997,51361
1530,0.0607897056067,0.531111125998,51700
1540,0.060964279331,0.534019967998,52031
1550,0.062189613745,0.536860858998,52367
1560,0.0650053309471,0.541305701998,52705
1570,0.0604346995349,0.546063038997,53024
1580,0.0617732945098,0.548818596997,53370
1590,0.0604304674622,0.552287636998,53706
1600,0.0612450902987,0.555142750996,54039
1610,0.0628287030051,0.558110061997,54380
1620,0.0571694268419,0.560957273998,54708
1630,0.0630375954288,0.564124880997,55035
1640,0.0694176435456,0.567076389998,55367
1650,0.0620722468829,0.571250614999,55708
1660,0.0633347501662,0.574129432,56045
1670,0.0631333736217,0.578776547,56384
1680,0.0624426437875,0.581626525,56725
1690,0.0658982198287,0.584549194,57064
1700,0.06103064267,0.587844012,57392
1710,0.0663043882853,0.592205892,57728
1720,0.0595669978348,0.595083128999,58046
1730,0.0688294236346,0.599950688,58371
1740,0.0688294236346,0.602862296,58709
1750,0.0688294236346,0.605633261001,59032
1760,0.066007543902,0.608993264001,59368
1770,0.0633614841455,0.611803341,59696
1780,0.0652066559602,0.614730356001,60039
1790,0.0667340616831,0.617586259001,60371
1800,0.0666121241129,0.621310509001,60709
1810,0.0644289471045,0.624226857,61039
1820,0.0687266129096,0.627198119002,61381
1830,0.0641919863015,0.630144491002,61718
1840,0.064115958296,0.633487901003,62045
1850,0.0680119775528,0.638471214002,62382
1860,0.0680119775528,0.641963958004,62723
1870,0.0719921354285,0.644998825004,63064
1880,0.0680449438088,0.647904506004,63385
1890,0.0667960751563,0.650850878004,63718
1900,0.0748445718341,0.655289401004,64040
1910,0.0692821554385,0.658150046005,64369
1920,0.0780104345059,0.662740667005,64701
1930,0.0780104345059,0.665585113005,65026
1940,0.0780104345059,0.669213363006,65358
1950,0.0821753149418,0.672397563007,65691
1960,0.0780340591732,0.675244775008,66020
1970,0.0743057878827,0.679802606008,66356
1980,0.0760161647436,0.682640732008,66691
1990,0.0691123653522,0.685637277009,67018
2000,0.0701963541441,0.690575947008,67362
