mean_fit_time,std_fit_time,mean_score_time,std_score_time,param_DT__class_weight,param_DT__criterion,param_DT__max_depth,params,split0_test_score,split1_test_score,split2_test_score,split3_test_score,split4_test_score,mean_test_score,std_test_score,rank_test_score,split0_train_score,split1_train_score,split2_train_score,split3_train_score,split4_train_score,mean_train_score,std_train_score
0.03355560302734375,0.00649247953914867,0.003196430206298828,0.0015982159105158817,balanced,gini,1,"{'DT__class_weight': 'balanced', 'DT__criterion': 'gini', 'DT__max_depth': 1}",0.19467455621301777,0.19467455621301774,0.19112426035502963,0.18994082840236692,0.1904761904761905,0.1921794331840785,0.002072805098139343,199,0.19274074074074077,0.19274074074074077,0.19362962962962965,0.19392592592592595,0.19038461538461543,0.1926843304843305,0.0012433988490108824
0.03675127029418945,0.00298834278458813,0.0015981197357177734,0.0019572890213427146,balanced,gini,2,"{'DT__class_weight': 'balanced', 'DT__criterion': 'gini', 'DT__max_depth': 2}",0.3575710544184693,0.3548388139813108,0.35047046270249305,0.3467358618682705,0.34530189755599594,0.3509881412537038,0.004664838997074981,195,0.35138063734834385,0.35220143078199634,0.35237227741522326,0.3540933089803041,0.3484770588805899,0.35170494268129154,0.0018395943813418573
0.043940067291259766,0.003572332481106349,0.003994941711425781,0.002526473217854184,balanced,gini,3,"{'DT__class_weight': 'balanced', 'DT__criterion': 'gini', 'DT__max_depth': 3}",0.5672519158017267,0.5574643515374915,0.5664338603808972,0.5576454230930903,0.5572311988137966,0.5612085136986042,0.004612636145581878,191,0.5648289776051243,0.5654452655190024,0.5667672111272252,0.5669507948034453,0.570383483687393,0.5668751465484381,0.001926508203830457
0.05512700080871582,0.006873174258399461,0.003196239471435547,0.0015981197748436028,balanced,gini,4,"{'DT__class_weight': 'balanced', 'DT__criterion': 'gini', 'DT__max_depth': 4}",0.7303391858246839,0.7153587480195298,0.7251042778155012,0.72196139295761,0.7137478116671055,0.7213082972795324,0.006146119510160538,188,0.7235191409581344,0.7255125220738461,0.7288548355191262,0.7276808449630442,0.7254445953374075,0.7262023877703118,0.0018692935690533023
0.0655125617980957,0.0074083458901146705,0.0031952857971191406,0.0015976430515516372,balanced,gini,5,"{'DT__class_weight': 'balanced', 'DT__criterion': 'gini', 'DT__max_depth': 5}",0.8212726743622079,0.8154428169560577,0.80856856468458,0.8089307077957772,0.8139941290319599,0.8136414980642104,0.00468223982128793,184,0.8214012043265635,0.8204159690029622,0.8252124343547171,0.8211362040918592,0.825438936851295,0.8227209497254794,0.0021522561393217668
0.08149018287658691,0.017792855093693105,0.002397441864013672,0.0019575031217225584,balanced,gini,6,"{'DT__class_weight': 'balanced', 'DT__criterion': 'gini', 'DT__max_depth': 6}",0.8676108254922883,0.8679729686034856,0.8534064086397001,0.8585475474504478,0.865430980326945,0.8625914874150298,0.005710228632982948,180,0.875095782932899,0.8792555266071274,0.879745588070281,0.8754374183968601,0.883212080059495,0.8785492792133326,0.0030093841992505327
0.08069086074829102,0.00991503476841752,0.0015984058380126953,0.001957639365574946,balanced,gini,7,"{'DT__class_weight': 'balanced', 'DT__criterion': 'gini', 'DT__max_depth': 7}",0.9113137388042811,0.9068516183270281,0.8922850583632427,0.9064409739062955,0.9010226270156914,0.903584841408393,0.006526231790929721,176,0.9204280265508902,0.9252381349423354,0.9301460117707617,0.9249660463802072,0.9195646199114043,0.9240685679111198,0.0038117651420245062
0.07909317016601562,0.004657676938501021,0.002396965026855469,0.0019571138419732697,balanced,gini,8,"{'DT__class_weight': 'balanced', 'DT__criterion': 'gini', 'DT__max_depth': 8}",0.9378116209137647,0.9368997962944998,0.9152326446147381,0.9276134122287968,0.9227293303585864,0.9280616024621595,0.008562373434676838,172,0.9525387134395729,0.9549566317150066,0.9583873434794524,0.9537708229352371,0.9530733663142239,0.9545453755766987,0.002084384080387632
0.0950742244720459,0.010836905116001001,0.0015977859497070313,0.0019568801707236113,balanced,gini,9,"{'DT__class_weight': 'balanced', 'DT__criterion': 'gini', 'DT__max_depth': 9}",0.9544734374494778,0.9536068807191127,0.9361722766514697,0.9407702007954215,0.9392003173371396,0.9448491159530596,0.007658542844178075,168,0.9756031302214871,0.9748965684127987,0.9764015260615004,0.9743175504710102,0.9742643968053806,0.9750966343944354,0.0008122681634756146
0.09507336616516113,0.0052983364932755106,0.003993463516235351,1.132425507262985e-06,balanced,gini,10,"{'DT__class_weight': 'balanced', 'DT__criterion': 'gini', 'DT__max_depth': 10}",0.9556116015132409,0.955472564425906,0.9481909011543314,0.9505577650596566,0.942576990054922,0.950488257495257,0.004874594875215995,165,0.9835912676715788,0.9860521378289606,0.9871354312556709,0.9849367300527694,0.9856234034985613,0.9854677940615082,0.00117898821201017
0.10785589218139649,0.008751608220224942,0.0023973941802978515,0.0019574641513492243,balanced,gini,11,"{'DT__class_weight': 'balanced', 'DT__criterion': 'gini', 'DT__max_depth': 11}",0.9631228376499498,0.9576130888867332,0.9505577650596567,0.9552009570925082,0.9520320316505688,0.9557082603407051,0.004448120637444206,161,0.9927513873003769,0.9933563431684611,0.9944836608384444,0.9926946410876801,0.9938193164548776,0.9934210697699679,0.0006735076798846603
0.11424741744995118,0.02030598782924188,0.0031958580017089843,0.002989578882133131,balanced,gini,12,"{'DT__class_weight': 'balanced', 'DT__criterion': 'gini', 'DT__max_depth': 12}",0.9653086299996767,0.9620752093639862,0.9501471206389241,0.959527273903062,0.956561996221517,0.958725767206899,0.005168325805983033,38,0.9963524345138571,0.9960455365100247,0.9970141365946383,0.9961929371231698,0.997199857729492,0.9965609804942364,0.00046003139519772525
0.10466065406799316,0.003914110720525155,0.0031958103179931642,0.0029895661496682708,balanced,gini,13,"{'DT__class_weight': 'balanced', 'DT__criterion': 'gini', 'DT__max_depth': 13}",0.9619394056972872,0.9621657451417854,0.9506030329485564,0.9544281695605781,0.9560115063582906,0.9570303824108869,0.004464662410935541,156,0.9984619118456887,0.9976290216344935,0.9982676191923797,0.9984613511944365,0.9987591748310538,0.9983158157396105,0.0003776508903144395
0.10625782012939453,0.007408433455680476,0.0023964881896972657,0.001956724473158766,balanced,gini,14,"{'DT__class_weight': 'balanced', 'DT__criterion': 'gini', 'DT__max_depth': 14}",0.9625763895625181,0.9598441491253596,0.9485530442655287,0.9577973938629677,0.9542328363103898,0.9566026477025966,0.00486012496204401,157,0.9992934938706283,0.9984613511944364,0.9989856614480417,0.9988830971538021,0.9994422349403435,0.9990131677214503,0.0003420110686432675
0.10705676078796386,0.006874149985522525,0.0007989883422851562,0.0015979766845703124,balanced,gini,15,"{'DT__class_weight': 'balanced', 'DT__criterion': 'gini', 'DT__max_depth': 15}",0.9613476897209557,0.9609370453002231,0.9512400168137876,0.9589808258156304,0.9554620558088402,0.9575952235298474,0.003798605464051586,119,0.9995555555555555,0.9990087337006222,0.999281957744338,0.9993050299969185,0.9995788469622013,0.999346024791927,0.00020864311345269865
0.09986586570739746,0.005650037952951268,0.0047943115234375,0.0015973095609448033,balanced,gini,16,"{'DT__class_weight': 'balanced', 'DT__criterion': 'gini', 'DT__max_depth': 16}",0.9619394056972872,0.9598894170142593,0.9489184207973616,0.9568403013548032,0.9542786238561775,0.9563749012373491,0.004551714657729267,159,1.0,0.9994416420187763,0.9997150529462431,0.9997037037037038,0.9997154589840592,0.9997151715305564,0.00017667895096175654
0.10226297378540039,0.001957775831062132,0.002396965026855469,0.001957113749030825,balanced,gini,17,"{'DT__class_weight': 'balanced', 'DT__criterion': 'gini', 'DT__max_depth': 17}",0.9619394056972872,0.9614834933876547,0.9524234487664504,0.9567497655770039,0.9560115063582907,0.9577228852814809,0.0035754782008485036,117,1.0,0.9997150529462431,1.0,1.0,0.999863387978142,0.999915688184877,0.00011341539323585613
0.11424860954284669,0.01866948754078125,0.0023967742919921873,0.0019569581327908477,balanced,gini,18,"{'DT__class_weight': 'balanced', 'DT__criterion': 'gini', 'DT__max_depth': 18}",0.9619394056972872,0.9614834933876547,0.9524234487664504,0.9567497655770039,0.9548668177136019,0.9574946765706722,0.003711373899847299,121,1.0,1.0,1.0,1.0,1.0,1.0,0.0
0.10226316452026367,0.011185315738545603,0.0031963348388671874,0.0015981674407743185,balanced,gini,19,"{'DT__class_weight': 'balanced', 'DT__criterion': 'gini', 'DT__max_depth': 19}",0.9619394056972872,0.9614834933876547,0.9524234487664504,0.9567497655770039,0.9548668177136019,0.9574946765706722,0.003711373899847299,121,1.0,1.0,1.0,1.0,1.0,1.0,0.0
0.1126488208770752,0.009915372859816671,0.00239710807800293,0.001957230764720195,balanced,gini,20,"{'DT__class_weight': 'balanced', 'DT__criterion': 'gini', 'DT__max_depth': 20}",0.9619394056972872,0.9614834933876547,0.9524234487664504,0.9567497655770039,0.9548668177136019,0.9574946765706722,0.003711373899847299,121,1.0,1.0,1.0,1.0,1.0,1.0,0.0
0.10785474777221679,0.007989812004528736,0.002396678924560547,0.0019568801532948224,balanced,gini,21,"{'DT__class_weight': 'balanced', 'DT__criterion': 'gini', 'DT__max_depth': 21}",0.9619394056972872,0.9614834933876547,0.9524234487664504,0.9567497655770039,0.9548668177136019,0.9574946765706722,0.003711373899847299,121,1.0,1.0,1.0,1.0,1.0,1.0,0.0
0.10465984344482422,0.011956712910451814,0.0031961917877197264,0.0015980959747803982,balanced,gini,22,"{'DT__class_weight': 'balanced', 'DT__criterion': 'gini', 'DT__max_depth': 22}",0.9619394056972872,0.9614834933876547,0.9524234487664504,0.9567497655770039,0.9548668177136019,0.9574946765706722,0.003711373899847299,121,1.0,1.0,1.0,1.0,1.0,1.0,0.0
0.1102515697479248,0.013976506001911634,0.00399470329284668,0.0025263215062467973,balanced,gini,23,"{'DT__class_weight': 'balanced', 'DT__criterion': 'gini', 'DT__max_depth': 23}",0.9619394056972872,0.9614834933876547,0.9524234487664504,0.9567497655770039,0.9548668177136019,0.9574946765706722,0.003711373899847299,121,1.0,1.0,1.0,1.0,1.0,1.0,0.0
0.10934233665466309,0.012842949284162592,0.0015988349914550781,0.0019581654262545113,balanced,gini,24,"{'DT__class_weight': 'balanced', 'DT__criterion': 'gini', 'DT__max_depth': 24}",0.9619394056972872,0.9614834933876547,0.9524234487664504,0.9567497655770039,0.9548668177136019,0.9574946765706722,0.003711373899847299,121,1.0,1.0,1.0,1.0,1.0,1.0,0.0
0.10661849975585938,0.018716865861471164,0.003995418548583984,1.5597750886722684e-06,balanced,gini,25,"{'DT__class_weight': 'balanced', 'DT__criterion': 'gini', 'DT__max_depth': 25}",0.9619394056972872,0.9614834933876547,0.9524234487664504,0.9567497655770039,0.9548668177136019,0.9574946765706722,0.003711373899847299,121,1.0,1.0,1.0,1.0,1.0,1.0,0.0
0.11344923973083496,0.008967721329193167,0.001598024368286133,0.001957172325131287,balanced,gini,26,"{'DT__class_weight': 'balanced', 'DT__criterion': 'gini', 'DT__max_depth': 26}",0.9619394056972872,0.9614834933876547,0.9524234487664504,0.9567497655770039,0.9548668177136019,0.9574946765706722,0.003711373899847299,121,1.0,1.0,1.0,1.0,1.0,1.0,0.0
0.10625829696655273,0.0069644890482786345,0.0031961441040039063,0.0015980722369659292,balanced,gini,27,"{'DT__class_weight': 'balanced', 'DT__criterion': 'gini', 'DT__max_depth': 27}",0.9619394056972872,0.9614834933876547,0.9524234487664504,0.9567497655770039,0.9548668177136019,0.9574946765706722,0.003711373899847299,121,1.0,1.0,1.0,1.0,1.0,1.0,0.0
0.10705709457397461,0.009914477581428828,0.003994941711425781,7.231593555499601e-07,balanced,gini,28,"{'DT__class_weight': 'balanced', 'DT__criterion': 'gini', 'DT__max_depth': 28}",0.9619394056972872,0.9614834933876547,0.9524234487664504,0.9567497655770039,0.9548668177136019,0.9574946765706722,0.003711373899847299,121,1.0,1.0,1.0,1.0,1.0,1.0,0.0
0.11424827575683594,0.007409585106046978,0.002396821975708008,0.001956997041206017,balanced,gini,29,"{'DT__class_weight': 'balanced', 'DT__criterion': 'gini', 'DT__max_depth': 29}",0.9619394056972872,0.9614834933876547,0.9524234487664504,0.9567497655770039,0.9548668177136019,0.9574946765706722,0.003711373899847299,121,1.0,1.0,1.0,1.0,1.0,1.0,0.0
0.10625863075256348,0.009653498612131606,0.0023972034454345704,0.0019573085002381504,balanced,gini,30,"{'DT__class_weight': 'balanced', 'DT__criterion': 'gini', 'DT__max_depth': 30}",0.9619394056972872,0.9614834933876547,0.9524234487664504,0.9567497655770039,0.9548668177136019,0.9574946765706722,0.003711373899847299,121,1.0,1.0,1.0,1.0,1.0,1.0,0.0
0.10546011924743652,0.005978100009818342,0.002397918701171875,0.001957896260939007,balanced,gini,31,"{'DT__class_weight': 'balanced', 'DT__criterion': 'gini', 'DT__max_depth': 31}",0.9619394056972872,0.9614834933876547,0.9524234487664504,0.9567497655770039,0.9548668177136019,0.9574946765706722,0.003711373899847299,121,1.0,1.0,1.0,1.0,1.0,1.0,0.0
0.11025304794311523,0.0054186299803964,0.003196096420288086,0.0015980485116042407,balanced,gini,32,"{'DT__class_weight': 'balanced', 'DT__criterion': 'gini', 'DT__max_depth': 32}",0.9619394056972872,0.9614834933876547,0.9524234487664504,0.9567497655770039,0.9548668177136019,0.9574946765706722,0.003711373899847299,121,1.0,1.0,1.0,1.0,1.0,1.0,0.0
0.11584553718566895,0.014291298577246661,0.0031954288482666016,0.001597714554882296,balanced,gini,33,"{'DT__class_weight': 'balanced', 'DT__criterion': 'gini', 'DT__max_depth': 33}",0.9619394056972872,0.9614834933876547,0.9524234487664504,0.9567497655770039,0.9548668177136019,0.9574946765706722,0.003711373899847299,121,1.0,1.0,1.0,1.0,1.0,1.0,0.0
0.10146450996398926,0.003194868688594403,0.003196096420288086,0.0029897063064698217,balanced,gini,34,"{'DT__class_weight': 'balanced', 'DT__criterion': 'gini', 'DT__max_depth': 34}",0.9619394056972872,0.9614834933876547,0.9524234487664504,0.9567497655770039,0.9548668177136019,0.9574946765706722,0.003711373899847299,121,1.0,1.0,1.0,1.0,1.0,1.0,0.0
0.10865464210510253,0.002989897484124406,0.0031961441040039063,0.001598072180053939,balanced,gini,35,"{'DT__class_weight': 'balanced', 'DT__criterion': 'gini', 'DT__max_depth': 35}",0.9619394056972872,0.9614834933876547,0.9524234487664504,0.9567497655770039,0.9548668177136019,0.9574946765706722,0.003711373899847299,121,1.0,1.0,1.0,1.0,1.0,1.0,0.0
0.10306253433227539,0.006391692210251033,0.0071909427642822266,0.006872969153472304,balanced,gini,36,"{'DT__class_weight': 'balanced', 'DT__criterion': 'gini', 'DT__max_depth': 36}",0.9619394056972872,0.9614834933876547,0.9524234487664504,0.9567497655770039,0.9548668177136019,0.9574946765706722,0.003711373899847299,121,1.0,1.0,1.0,1.0,1.0,1.0,0.0
0.11983966827392578,0.013605567163325965,0.003196525573730469,0.0015982631282964231,balanced,gini,37,"{'DT__class_weight': 'balanced', 'DT__criterion': 'gini', 'DT__max_depth': 37}",0.9619394056972872,0.9614834933876547,0.9524234487664504,0.9567497655770039,0.9548668177136019,0.9574946765706722,0.003711373899847299,121,1.0,1.0,1.0,1.0,1.0,1.0,0.0
0.10945439338684082,0.007408556804714483,0.00399322509765625,1.2741460052382838e-06,balanced,gini,38,"{'DT__class_weight': 'balanced', 'DT__criterion': 'gini', 'DT__max_depth': 38}",0.9619394056972872,0.9614834933876547,0.9524234487664504,0.9567497655770039,0.9548668177136019,0.9574946765706722,0.003711373899847299,121,1.0,1.0,1.0,1.0,1.0,1.0,0.0
0.10146265029907227,0.004074076047945109,0.0023967742919921873,0.001956958039841008,balanced,gini,39,"{'DT__class_weight': 'balanced', 'DT__criterion': 'gini', 'DT__max_depth': 39}",0.9619394056972872,0.9614834933876547,0.9524234487664504,0.9567497655770039,0.9548668177136019,0.9574946765706722,0.003711373899847299,121,1.0,1.0,1.0,1.0,1.0,1.0,0.0
0.11344790458679199,0.019504881081817305,0.003995180130004883,0.002526698387991952,balanced,gini,40,"{'DT__class_weight': 'balanced', 'DT__criterion': 'gini', 'DT__max_depth': 40}",0.9619394056972872,0.9614834933876547,0.9524234487664504,0.9567497655770039,0.9548668177136019,0.9574946765706722,0.003711373899847299,121,1.0,1.0,1.0,1.0,1.0,1.0,0.0
0.10785646438598633,0.004375673575491782,0.003994274139404297,0.004375281781966165,balanced,gini,41,"{'DT__class_weight': 'balanced', 'DT__criterion': 'gini', 'DT__max_depth': 41}",0.9619394056972872,0.9614834933876547,0.9524234487664504,0.9567497655770039,0.9548668177136019,0.9574946765706722,0.003711373899847299,121,1.0,1.0,1.0,1.0,1.0,1.0,0.0
0.10465950965881347,0.006872558997378244,0.003994941711425781,6.91002690610382e-07,balanced,gini,42,"{'DT__class_weight': 'balanced', 'DT__criterion': 'gini', 'DT__max_depth': 42}",0.9619394056972872,0.9614834933876547,0.9524234487664504,0.9567497655770039,0.9548668177136019,0.9574946765706722,0.003711373899847299,121,1.0,1.0,1.0,1.0,1.0,1.0,0.0
0.11105113029479981,0.009915576544772797,0.0023967742919921873,0.001956958388402884,balanced,gini,43,"{'DT__class_weight': 'balanced', 'DT__criterion': 'gini', 'DT__max_depth': 43}",0.9619394056972872,0.9614834933876547,0.9524234487664504,0.9567497655770039,0.9548668177136019,0.9574946765706722,0.003711373899847299,121,1.0,1.0,1.0,1.0,1.0,1.0,0.0
0.10865550041198731,0.0068734070622597345,0.0031957626342773438,0.001597881452320791,balanced,gini,44,"{'DT__class_weight': 'balanced', 'DT__criterion': 'gini', 'DT__max_depth': 44}",0.9619394056972872,0.9614834933876547,0.9524234487664504,0.9567497655770039,0.9548668177136019,0.9574946765706722,0.003711373899847299,121,1.0,1.0,1.0,1.0,1.0,1.0,0.0
0.10306310653686523,0.004658175732379589,0.0039947509765625,7.599533772711385e-07,balanced,gini,45,"{'DT__class_weight': 'balanced', 'DT__criterion': 'gini', 'DT__max_depth': 45}",0.9619394056972872,0.9614834933876547,0.9524234487664504,0.9567497655770039,0.9548668177136019,0.9574946765706722,0.003711373899847299,121,1.0,1.0,1.0,1.0,1.0,1.0,0.0
0.10705752372741699,0.01112774688991856,0.0031960010528564453,0.0015980005788963165,balanced,gini,46,"{'DT__class_weight': 'balanced', 'DT__criterion': 'gini', 'DT__max_depth': 46}",0.9619394056972872,0.9614834933876547,0.9524234487664504,0.9567497655770039,0.9548668177136019,0.9574946765706722,0.003711373899847299,121,1.0,1.0,1.0,1.0,1.0,1.0,0.0
0.10306200981140137,0.0029894515094090173,0.00399470329284668,1.5078914929239175e-07,balanced,gini,47,"{'DT__class_weight': 'balanced', 'DT__criterion': 'gini', 'DT__max_depth': 47}",0.9619394056972872,0.9614834933876547,0.9524234487664504,0.9567497655770039,0.9548668177136019,0.9574946765706722,0.003711373899847299,121,1.0,1.0,1.0,1.0,1.0,1.0,0.0
0.1118502140045166,0.009109471706354271,0.003995132446289062,1.5033610125002334e-06,balanced,gini,48,"{'DT__class_weight': 'balanced', 'DT__criterion': 'gini', 'DT__max_depth': 48}",0.9619394056972872,0.9614834933876547,0.9524234487664504,0.9567497655770039,0.9548668177136019,0.9574946765706722,0.003711373899847299,121,1.0,1.0,1.0,1.0,1.0,1.0,0.0
0.1102522850036621,0.01687264538398825,0.003994131088256836,0.0025266989036257263,balanced,gini,49,"{'DT__class_weight': 'balanced', 'DT__criterion': 'gini', 'DT__max_depth': 49}",0.9619394056972872,0.9614834933876547,0.9524234487664504,0.9567497655770039,0.9548668177136019,0.9574946765706722,0.003711373899847299,121,1.0,1.0,1.0,1.0,1.0,1.0,0.0
0.12143888473510742,0.02323777089545979,0.003995561599731445,1.6831743807528296e-06,balanced,gini,50,"{'DT__class_weight': 'balanced', 'DT__criterion': 'gini', 'DT__max_depth': 50}",0.9619394056972872,0.9614834933876547,0.9524234487664504,0.9567497655770039,0.9548668177136019,0.9574946765706722,0.003711373899847299,121,1.0,1.0,1.0,1.0,1.0,1.0,0.0
0.027164936065673828,0.0063914061293032344,0.0031951427459716796,0.001597571788395655,balanced,entropy,1,"{'DT__class_weight': 'balanced', 'DT__criterion': 'entropy', 'DT__max_depth': 1}",0.19881656804733727,0.1988165680473373,0.19881656804733736,0.1958579881656805,0.2,0.19846031371108142,0.0013799731109278013,197,0.19837037037037036,0.19837037037037036,0.19837037037037036,0.19911111111111113,0.19807692307692312,0.1984598290598291,0.00034490400792868217
0.03834753036499024,0.0031966807319623405,0.0023973941802978515,0.0019574645869389067,balanced,entropy,2,"{'DT__class_weight': 'balanced', 'DT__criterion': 'entropy', 'DT__max_depth': 2}",0.3668509716429011,0.3748181200892424,0.36876515665922993,0.36566753969023835,0.3685161832702816,0.36892391860530427,0.003158264966074111,193,0.3677765053070832,0.37126410494726975,0.3672983395586387,0.36836965855092835,0.3727010379280241,0.36948192925838885,0.0021190796006840076
0.05592555999755859,0.007578687841022613,0.004793500900268555,0.0015984301804062282,balanced,entropy,3,"{'DT__class_weight': 'balanced', 'DT__criterion': 'entropy', 'DT__max_depth': 3}",0.5951531024671,0.6172793998771301,0.5965661072848968,0.5929220422284737,0.6042477331411757,0.6012312775464412,0.008884485413071592,190,0.601305398235315,0.6104842490615008,0.6006335072229501,0.6019668593503259,0.6125917483105379,0.605396352436126,0.005076267082874185
0.06471319198608398,0.002989375023081635,0.003994798660278321,6.14361702286011e-07,balanced,entropy,4,"{'DT__class_weight': 'balanced', 'DT__criterion': 'entropy', 'DT__max_depth': 4}",0.7582145051249717,0.7918614802599669,0.7802437999159312,0.7671775471271058,0.7743517569021983,0.7743698322441478,0.011434204162790116,186,0.7615139038635483,0.788878418056498,0.791801016861888,0.7861070285575523,0.796334109354286,0.7849268953387545,0.012186496578852955
0.08149209022521972,0.011466786232605596,0.003995037078857422,2.4314019744838644e-07,balanced,entropy,5,"{'DT__class_weight': 'balanced', 'DT__criterion': 'entropy', 'DT__max_depth': 5}",0.8496685743848418,0.858909690561645,0.8374203770168464,0.8253112167361852,0.8542245218001839,0.8450996176534601,0.012212050497780676,182,0.8533663254392997,0.8600969636646825,0.8526123515449422,0.8411074668361945,0.8663417078927798,0.8547049630755797,0.008432679028790711
0.0886795997619629,0.003915882801563006,0.0023968696594238283,0.0019570359128310067,balanced,entropy,6,"{'DT__class_weight': 'balanced', 'DT__criterion': 'entropy', 'DT__max_depth': 6}",0.9015229411194102,0.9094933229863872,0.8772173182009249,0.880266433860381,0.8957073454078499,0.8928391908283932,0.012358687867186248,178,0.922462533439966,0.9218945434579375,0.9044515768228626,0.9016021687027461,0.9109596792446729,0.9122741003336371,0.008639060095637523
0.1006667137145996,0.004658183848300983,0.003994894027709961,1.291867941297919e-06,balanced,entropy,7,"{'DT__class_weight': 'balanced', 'DT__criterion': 'entropy', 'DT__max_depth': 7}",0.9276101788081613,0.9344423966113751,0.9116338474472147,0.9195524945840206,0.9328747072599531,0.925216633292398,0.008557130204281642,174,0.9503243345207245,0.9543817855395009,0.9440100956297791,0.9457114105143616,0.947825524622498,0.9484506301653729,0.003641477729750162
0.10945372581481934,0.0089684817176867,0.002396678924560547,0.0019568803275827047,balanced,entropy,8,"{'DT__class_weight': 'balanced', 'DT__criterion': 'entropy', 'DT__max_depth': 8}",0.9445015682090084,0.9477349888446988,0.9339864843017429,0.9357131309212016,0.9557811251379978,0.9435337172266368,0.008006947568125058,170,0.970668189023421,0.9754418411157059,0.969138459971636,0.9701795611073079,0.9756765932680181,0.9722209288972177,0.0027711257643550833
0.1134493350982666,0.001956802381007034,0.004793310165405273,0.0015981675688186614,balanced,entropy,9,"{'DT__class_weight': 'balanced', 'DT__criterion': 'entropy', 'DT__max_depth': 9}",0.9596145762602257,0.9544734374494777,0.9413619167717532,0.9444563003201087,0.9591291012476384,0.9518012374272563,0.007547542894183803,164,0.9863248762206622,0.9895753426842245,0.9839698269954823,0.9857092436458038,0.989311928088725,0.9869782435269796,0.002157722281882734
0.12303543090820312,0.00852979375799065,0.0023970603942871094,0.001957191734322348,balanced,entropy,10,"{'DT__class_weight': 'balanced', 'DT__criterion': 'entropy', 'DT__max_depth': 10}",0.9600704885698581,0.953425809163514,0.948873152908462,0.9536974164969121,0.9598134316293206,0.9551723679984525,0.004252608059447291,162,0.9942792475146537,0.9957729053878759,0.9927646527243082,0.9929231683523582,0.9965167976202024,0.9944513543198796,0.0014981647858902498
0.12383484840393066,0.004375281773131643,0.003995037078857422,1.1543005406294064e-06,balanced,entropy,11,"{'DT__class_weight': 'balanced', 'DT__criterion': 'entropy', 'DT__max_depth': 11}",0.9622110130306852,0.9551104213147087,0.9533352733857149,0.9518770006790184,0.9598159144344516,0.9564672608672147,0.003922795479538294,158,0.9984613511944364,0.9981771516756828,0.9968322822160591,0.998086310391484,0.9991576939244027,0.9981429578804131,0.0007554220531799389
0.12783050537109375,0.011013380769321148,0.003995084762573242,1.2848085007960777e-06,balanced,entropy,12,"{'DT__class_weight': 'balanced', 'DT__criterion': 'entropy', 'DT__max_depth': 12}",0.9618909043877518,0.9557926730688393,0.9550651534258093,0.956248585378472,0.962700529819067,0.9583360975084682,0.0032612038032453455,73,0.9995899770506753,0.9991565080812688,0.9989743122055023,0.9997264021887825,0.999863387978142,0.9994621175008742,0.0003401657184988934
0.11744279861450195,0.005979374466946911,0.003994369506835937,1.248912892695312e-06,balanced,entropy,13,"{'DT__class_weight': 'balanced', 'DT__criterion': 'entropy', 'DT__max_depth': 13}",0.9629838005626152,0.9585701813948975,0.9534258091635143,0.9529246289649821,0.9609178179953716,0.9577619372565976,0.004002658255528855,116,1.0,0.9997264021887824,0.9998518518518519,0.999863387978142,1.0,0.9998883284037554,0.00010306672943260208
0.12143917083740234,0.005979183803683748,0.0023969173431396484,0.0019570749335565975,balanced,entropy,14,"{'DT__class_weight': 'balanced', 'DT__criterion': 'entropy', 'DT__max_depth': 14}",0.9629838005626152,0.9585249135059978,0.9550651534258092,0.9562938532673716,0.9609178179953716,0.9587553876363747,0.0029086329915633674,1,1.0,1.0,1.0,1.0,1.0,1.0,0.0
0.12543330192565919,0.005419108085489078,0.003195524215698242,0.0015977621959019403,balanced,entropy,15,"{'DT__class_weight': 'balanced', 'DT__criterion': 'entropy', 'DT__max_depth': 15}",0.9629838005626152,0.9585249135059978,0.9550651534258092,0.9562938532673716,0.9609178179953716,0.9587553876363747,0.0029086329915633674,1,1.0,1.0,1.0,1.0,1.0,1.0,0.0
0.12942705154418946,0.011184729894440824,0.003994941711425781,1.581489939859104e-06,balanced,entropy,16,"{'DT__class_weight': 'balanced', 'DT__criterion': 'entropy', 'DT__max_depth': 16}",0.9629838005626152,0.9585249135059978,0.9550651534258092,0.9562938532673716,0.9609178179953716,0.9587553876363747,0.0029086329915633674,1,1.0,1.0,1.0,1.0,1.0,1.0,0.0
0.12543230056762694,0.00740875207836959,0.0015978336334228516,0.0019569385493239818,balanced,entropy,17,"{'DT__class_weight': 'balanced', 'DT__criterion': 'entropy', 'DT__max_depth': 17}",0.9629838005626152,0.9585249135059978,0.9550651534258092,0.9562938532673716,0.9609178179953716,0.9587553876363747,0.0029086329915633674,1,1.0,1.0,1.0,1.0,1.0,1.0,0.0
0.12623109817504882,0.00965326575777771,0.003196430206298828,0.0015982152774267919,balanced,entropy,18,"{'DT__class_weight': 'balanced', 'DT__criterion': 'entropy', 'DT__max_depth': 18}",0.9629838005626152,0.9585249135059978,0.9550651534258092,0.9562938532673716,0.9609178179953716,0.9587553876363747,0.0029086329915633674,1,1.0,1.0,1.0,1.0,1.0,1.0,0.0
0.1174431324005127,0.009653036879952734,0.003995513916015625,4.672030911985737e-07,balanced,entropy,19,"{'DT__class_weight': 'balanced', 'DT__criterion': 'entropy', 'DT__max_depth': 19}",0.9629838005626152,0.9585249135059978,0.9550651534258092,0.9562938532673716,0.9609178179953716,0.9587553876363747,0.0029086329915633674,1,1.0,1.0,1.0,1.0,1.0,1.0,0.0
0.12543187141418458,0.012274152253316118,0.002396249771118164,0.0031952381614364323,balanced,entropy,20,"{'DT__class_weight': 'balanced', 'DT__criterion': 'entropy', 'DT__max_depth': 20}",0.9629838005626152,0.9585249135059978,0.9550651534258092,0.9562938532673716,0.9609178179953716,0.9587553876363747,0.0029086329915633674,1,1.0,1.0,1.0,1.0,1.0,1.0,0.0
0.11904139518737793,0.0058699786650194185,0.001599264144897461,0.0019586911993794945,balanced,entropy,21,"{'DT__class_weight': 'balanced', 'DT__criterion': 'entropy', 'DT__max_depth': 21}",0.9629838005626152,0.9585249135059978,0.9550651534258092,0.9562938532673716,0.9609178179953716,0.9587553876363747,0.0029086329915633674,1,1.0,1.0,1.0,1.0,1.0,1.0,0.0
0.12623171806335448,0.01374530636858139,0.003994560241699219,0.002526623141227978,balanced,entropy,22,"{'DT__class_weight': 'balanced', 'DT__criterion': 'entropy', 'DT__max_depth': 22}",0.9629838005626152,0.9585249135059978,0.9550651534258092,0.9562938532673716,0.9609178179953716,0.9587553876363747,0.0029086329915633674,1,1.0,1.0,1.0,1.0,1.0,1.0,0.0
0.1198399543762207,0.006684559685726815,0.00239715576171875,0.0019572694969475866,balanced,entropy,23,"{'DT__class_weight': 'balanced', 'DT__criterion': 'entropy', 'DT__max_depth': 23}",0.9629838005626152,0.9585249135059978,0.9550651534258092,0.9562938532673716,0.9609178179953716,0.9587553876363747,0.0029086329915633674,1,1.0,1.0,1.0,1.0,1.0,1.0,0.0
0.12143855094909668,0.006965211295647274,0.0031949520111083985,0.001597477246520233,balanced,entropy,24,"{'DT__class_weight': 'balanced', 'DT__criterion': 'entropy', 'DT__max_depth': 24}",0.9629838005626152,0.9585249135059978,0.9550651534258092,0.9562938532673716,0.9609178179953716,0.9587553876363747,0.0029086329915633674,1,1.0,1.0,1.0,1.0,1.0,1.0,0.0
0.1230349063873291,0.011129048819200096,0.0023965358734130858,0.001956763648829446,balanced,entropy,25,"{'DT__class_weight': 'balanced', 'DT__criterion': 'entropy', 'DT__max_depth': 25}",0.9629838005626152,0.9585249135059978,0.9550651534258092,0.9562938532673716,0.9609178179953716,0.9587553876363747,0.0029086329915633674,1,1.0,1.0,1.0,1.0,1.0,1.0,0.0
0.12303605079650878,0.010837632590067342,0.002396821975708008,0.001956996954067275,balanced,entropy,26,"{'DT__class_weight': 'balanced', 'DT__criterion': 'entropy', 'DT__max_depth': 26}",0.9629838005626152,0.9585249135059978,0.9550651534258092,0.9562938532673716,0.9609178179953716,0.9587553876363747,0.0029086329915633674,1,1.0,1.0,1.0,1.0,1.0,1.0,0.0
0.11983981132507324,0.0035722782667950686,0.003195524215698242,0.0015977621176327679,balanced,entropy,27,"{'DT__class_weight': 'balanced', 'DT__criterion': 'entropy', 'DT__max_depth': 27}",0.9629838005626152,0.9585249135059978,0.9550651534258092,0.9562938532673716,0.9609178179953716,0.9587553876363747,0.0029086329915633674,1,1.0,1.0,1.0,1.0,1.0,1.0,0.0
0.11504664421081542,0.004659468226151628,0.00319671630859375,0.0015983582823259398,balanced,entropy,28,"{'DT__class_weight': 'balanced', 'DT__criterion': 'entropy', 'DT__max_depth': 28}",0.9629838005626152,0.9585249135059978,0.9550651534258092,0.9562938532673716,0.9609178179953716,0.9587553876363747,0.0029086329915633674,1,1.0,1.0,1.0,1.0,1.0,1.0,0.0
0.11744256019592285,0.0019562573688764874,0.0015982627868652345,0.0019574641513492243,balanced,entropy,29,"{'DT__class_weight': 'balanced', 'DT__criterion': 'entropy', 'DT__max_depth': 29}",0.9629838005626152,0.9585249135059978,0.9550651534258092,0.9562938532673716,0.9609178179953716,0.9587553876363747,0.0029086329915633674,1,1.0,1.0,1.0,1.0,1.0,1.0,0.0
0.11584548950195313,0.002525944601574936,0.0015978813171386719,0.0019569969482580254,balanced,entropy,30,"{'DT__class_weight': 'balanced', 'DT__criterion': 'entropy', 'DT__max_depth': 30}",0.9629838005626152,0.9585249135059978,0.9550651534258092,0.9562938532673716,0.9609178179953716,0.9587553876363747,0.0029086329915633674,1,1.0,1.0,1.0,1.0,1.0,1.0,0.0
0.1150442123413086,0.0029898978225349378,0.0031967639923095705,0.0015983819988220178,balanced,entropy,31,"{'DT__class_weight': 'balanced', 'DT__criterion': 'entropy', 'DT__max_depth': 31}",0.9629838005626152,0.9585249135059978,0.9550651534258092,0.9562938532673716,0.9609178179953716,0.9587553876363747,0.0029086329915633674,1,1.0,1.0,1.0,1.0,1.0,1.0,0.0
0.11653122901916504,0.006480706841646092,0.0007991313934326172,0.0015982627868652347,balanced,entropy,32,"{'DT__class_weight': 'balanced', 'DT__criterion': 'entropy', 'DT__max_depth': 32}",0.9629838005626152,0.9585249135059978,0.9550651534258092,0.9562938532673716,0.9609178179953716,0.9587553876363747,0.0029086329915633674,1,1.0,1.0,1.0,1.0,1.0,1.0,0.0
0.11550650596618653,0.00832835382260641,0.0031948089599609375,0.0015974068356966328,balanced,entropy,33,"{'DT__class_weight': 'balanced', 'DT__criterion': 'entropy', 'DT__max_depth': 33}",0.9629838005626152,0.9585249135059978,0.9550651534258092,0.9562938532673716,0.9609178179953716,0.9587553876363747,0.0029086329915633674,1,1.0,1.0,1.0,1.0,1.0,1.0,0.0
0.1179013729095459,0.00478306966338632,0.0015977859497070313,0.001956880147485226,balanced,entropy,34,"{'DT__class_weight': 'balanced', 'DT__criterion': 'entropy', 'DT__max_depth': 34}",0.9629838005626152,0.9585249135059978,0.9550651534258092,0.9562938532673716,0.9609178179953716,0.9587553876363747,0.0029086329915633674,1,1.0,1.0,1.0,1.0,1.0,1.0,0.0
0.11493430137634278,0.006164264878138256,0.001598024368286133,0.001957172220574161,balanced,entropy,35,"{'DT__class_weight': 'balanced', 'DT__criterion': 'entropy', 'DT__max_depth': 35}",0.9629838005626152,0.9585249135059978,0.9550651534258092,0.9562938532673716,0.9609178179953716,0.9587553876363747,0.0029086329915633674,1,1.0,1.0,1.0,1.0,1.0,1.0,0.0
0.11265077590942382,0.0029902161700300052,0.0015975475311279298,0.001956588147005843,balanced,entropy,36,"{'DT__class_weight': 'balanced', 'DT__criterion': 'entropy', 'DT__max_depth': 36}",0.9629838005626152,0.9585249135059978,0.9550651534258092,0.9562938532673716,0.9609178179953716,0.9587553876363747,0.0029086329915633674,1,1.0,1.0,1.0,1.0,1.0,1.0,0.0
0.11824240684509277,0.013030082251800187,0.002396965026855469,0.0019571137896931454,balanced,entropy,37,"{'DT__class_weight': 'balanced', 'DT__criterion': 'entropy', 'DT__max_depth': 37}",0.9629838005626152,0.9585249135059978,0.9550651534258092,0.9562938532673716,0.9609178179953716,0.9587553876363747,0.0029086329915633674,1,1.0,1.0,1.0,1.0,1.0,1.0,0.0
0.11984024047851563,0.009108823225363816,0.002396821975708008,0.0019569969889227726,balanced,entropy,38,"{'DT__class_weight': 'balanced', 'DT__criterion': 'entropy', 'DT__max_depth': 38}",0.9629838005626152,0.9585249135059978,0.9550651534258092,0.9562938532673716,0.9609178179953716,0.9587553876363747,0.0029086329915633674,1,1.0,1.0,1.0,1.0,1.0,1.0,0.0
0.11664319038391113,0.002989107352304633,0.00319671630859375,0.001598358381904094,balanced,entropy,39,"{'DT__class_weight': 'balanced', 'DT__criterion': 'entropy', 'DT__max_depth': 39}",0.9629838005626152,0.9585249135059978,0.9550651534258092,0.9562938532673716,0.9609178179953716,0.9587553876363747,0.0029086329915633674,1,1.0,1.0,1.0,1.0,1.0,1.0,0.0
0.11424822807312011,0.001957542049505128,0.0023963451385498047,0.0019566076259063063,balanced,entropy,40,"{'DT__class_weight': 'balanced', 'DT__criterion': 'entropy', 'DT__max_depth': 40}",0.9629838005626152,0.9585249135059978,0.9550651534258092,0.9562938532673716,0.9609178179953716,0.9587553876363747,0.0029086329915633674,1,1.0,1.0,1.0,1.0,1.0,1.0,0.0
0.11504664421081542,0.002990101774454214,0.004792642593383789,0.0015982633203514343,balanced,entropy,41,"{'DT__class_weight': 'balanced', 'DT__criterion': 'entropy', 'DT__max_depth': 41}",0.9629838005626152,0.9585249135059978,0.9550651534258092,0.9562938532673716,0.9609178179953716,0.9587553876363747,0.0029086329915633674,1,1.0,1.0,1.0,1.0,1.0,1.0,0.0
0.11344647407531738,0.0059803186957194466,0.003996372222900391,3.8355021576290525e-06,balanced,entropy,42,"{'DT__class_weight': 'balanced', 'DT__criterion': 'entropy', 'DT__max_depth': 42}",0.9629838005626152,0.9585249135059978,0.9550651534258092,0.9562938532673716,0.9609178179953716,0.9587553876363747,0.0029086329915633674,1,1.0,1.0,1.0,1.0,1.0,1.0,0.0
0.11265034675598144,0.0015976672767711354,0.0039940357208251955,8.44957597096889e-07,balanced,entropy,43,"{'DT__class_weight': 'balanced', 'DT__criterion': 'entropy', 'DT__max_depth': 43}",0.9629838005626152,0.9585249135059978,0.9550651534258092,0.9562938532673716,0.9609178179953716,0.9587553876363747,0.0029086329915633674,1,1.0,1.0,1.0,1.0,1.0,1.0,0.0
0.12223806381225585,0.008967071546422185,0.0031958580017089843,0.0015979290755581722,balanced,entropy,44,"{'DT__class_weight': 'balanced', 'DT__criterion': 'entropy', 'DT__max_depth': 44}",0.9629838005626152,0.9585249135059978,0.9550651534258092,0.9562938532673716,0.9609178179953716,0.9587553876363747,0.0029086329915633674,1,1.0,1.0,1.0,1.0,1.0,1.0,0.0
0.11664619445800781,0.005875903135261221,0.0023944854736328127,0.001955095746012621,balanced,entropy,45,"{'DT__class_weight': 'balanced', 'DT__criterion': 'entropy', 'DT__max_depth': 45}",0.9629838005626152,0.9585249135059978,0.9550651534258092,0.9562938532673716,0.9609178179953716,0.9587553876363747,0.0029086329915633674,1,1.0,1.0,1.0,1.0,1.0,1.0,0.0
0.11504616737365722,0.0029893367917342263,0.003995323181152343,0.002526773795389335,balanced,entropy,46,"{'DT__class_weight': 'balanced', 'DT__criterion': 'entropy', 'DT__max_depth': 46}",0.9629838005626152,0.9585249135059978,0.9550651534258092,0.9562938532673716,0.9609178179953716,0.9587553876363747,0.0029086329915633674,1,1.0,1.0,1.0,1.0,1.0,1.0,0.0
0.11504564285278321,0.003914597383390505,0.0023978710174560546,0.001957853518227666,balanced,entropy,47,"{'DT__class_weight': 'balanced', 'DT__criterion': 'entropy', 'DT__max_depth': 47}",0.9629838005626152,0.9585249135059978,0.9550651534258092,0.9562938532673716,0.9609178179953716,0.9587553876363747,0.0029086329915633674,1,1.0,1.0,1.0,1.0,1.0,1.0,0.0
0.11824169158935546,0.006963422905834179,0.0023962020874023437,0.001956490836755821,balanced,entropy,48,"{'DT__class_weight': 'balanced', 'DT__criterion': 'entropy', 'DT__max_depth': 48}",0.9629838005626152,0.9585249135059978,0.9550651534258092,0.9562938532673716,0.9609178179953716,0.9587553876363747,0.0029086329915633674,1,1.0,1.0,1.0,1.0,1.0,1.0,0.0
0.11265053749084472,0.004658314759815475,0.002397012710571289,0.0019571527194107447,balanced,entropy,49,"{'DT__class_weight': 'balanced', 'DT__criterion': 'entropy', 'DT__max_depth': 49}",0.9629838005626152,0.9585249135059978,0.9550651534258092,0.9562938532673716,0.9609178179953716,0.9587553876363747,0.0029086329915633674,1,1.0,1.0,1.0,1.0,1.0,1.0,0.0
0.1190406322479248,0.008147104371135057,0.003995943069458008,9.702200865447905e-07,balanced,entropy,50,"{'DT__class_weight': 'balanced', 'DT__criterion': 'entropy', 'DT__max_depth': 50}",0.9629838005626152,0.9585249135059978,0.9550651534258092,0.9562938532673716,0.9609178179953716,0.9587553876363747,0.0029086329915633674,1,1.0,1.0,1.0,1.0,1.0,1.0,0.0
0.022369909286499023,0.0019570359302584087,0.0015979290008544921,0.0019570553500966943,,gini,1,"{'DT__class_weight': None, 'DT__criterion': 'gini', 'DT__max_depth': 1}",0.1939890710382514,0.18415300546448088,0.1967213114754099,0.18360655737704917,0.1824175824175824,0.1881820909590764,0.005950572583474178,200,0.1975376196990424,0.1874145006839945,0.19658002735978114,0.18755129958960332,0.18401639344262294,0.19061996815500887,0.005416182346693333
0.03675127029418945,0.004658339392837353,0.0023965358734130858,0.001956763631399619,,gini,2,"{'DT__class_weight': None, 'DT__criterion': 'gini', 'DT__max_depth': 2}",0.3480583309082679,0.34992078119442555,0.3425065476767874,0.3440488893200117,0.3409303128565424,0.3450962862336661,0.0033818646262510593,196,0.34655690693272273,0.34880920248812874,0.34734229710861764,0.3506895445601463,0.3454942283441654,0.3477784358867561,0.0018131181766095213
0.039147138595581055,0.0015972860135801904,0.0031959056854248048,0.0015979538058416391,,gini,3,"{'DT__class_weight': None, 'DT__criterion': 'gini', 'DT__max_depth': 3}",0.57012319332622,0.5514986904646425,0.5673036505318978,0.5560966146085946,0.5536012222330002,0.5597295490382843,0.007536219284181703,192,0.5706535161891435,0.5620433225924693,0.5703345708748282,0.5645749607827951,0.5669447408413362,0.5669102222561144,0.0033129975233623064
0.05432825088500977,0.0040744406570773556,0.0015977859497070313,0.0019568801997715923,,gini,4,"{'DT__class_weight': None, 'DT__criterion': 'gini', 'DT__max_depth': 4}",0.7303391858246839,0.7165421799721926,0.730203382157985,0.723600737219905,0.7137478116671055,0.722893934693509,0.006829473077552473,187,0.7345238163742829,0.7255125220738461,0.7354918730043892,0.7287530983740879,0.7254445953374075,0.7299451810328026,0.004314035037668029
0.05592570304870605,0.006188229180471534,0.0015979290008544921,0.0019570553849511518,,gini,5,"{'DT__class_weight': None, 'DT__criterion': 'gini', 'DT__max_depth': 5}",0.8261422058395579,0.8154880848449574,0.8031525851197985,0.8117082161218354,0.8134446784825095,0.8139875859399365,0.007390397258462463,183,0.8289560634114727,0.8204159690029622,0.827609202771219,0.823813416260866,0.8254276198790702,0.8252444542651179,0.0029921152147273323
0.06391410827636719,0.002525718315464389,0.0031958580017089843,0.0015979292676533334,,gini,6,"{'DT__class_weight': None, 'DT__criterion': 'gini', 'DT__max_depth': 6}",0.86815727357972,0.8719339088822063,0.8552268244575939,0.8612797878876063,0.8644166100818055,0.8642027108306547,0.005739278423740991,179,0.8811150420492371,0.8789950681562458,0.8832902800353113,0.8783878546095827,0.8829388560157791,0.8809454201732312,0.001992282129342553
0.06950807571411133,0.004793842688735997,0.0031951427459716796,0.001597571525095228,,gini,7,"{'DT__class_weight': None, 'DT__criterion': 'gini', 'DT__max_depth': 7}",0.9124066349791445,0.9085814983671225,0.9003427425873832,0.9099039674071201,0.901663652656717,0.9065836128041603,0.004734368622170862,175,0.9288419171509757,0.925215468727571,0.9343398233870164,0.9251505570342349,0.9195646199114043,0.9266224772422404,0.004867091887119053
0.07589874267578126,0.0025268496162581737,0.00399470329284668,0.00252677382418478,,gini,8,"{'DT__class_weight': None, 'DT__criterion': 'gini', 'DT__max_depth': 8}",0.9391308565331264,0.9386296763345942,0.9146861965273064,0.9292980243799918,0.9272502875434779,0.929801037269163,0.008949869885390566,171,0.9578812908271266,0.9549566317150066,0.9591041353513514,0.9559235191728451,0.9530733663142239,0.9561877886761107,0.002128766776663662
0.08148841857910157,0.0031971723881558988,0.0023969173431396484,0.001957074910320525,,gini,9,"{'DT__class_weight': None, 'DT__criterion': 'gini', 'DT__max_depth': 9}",0.9547903126717755,0.951922268567918,0.9323018721505483,0.9475539172891001,0.9414836897024791,0.945613697309688,0.008027738408650141,167,0.9767291569019599,0.9748965684127987,0.9771530553935283,0.9757425866312345,0.9740938338668479,0.9757230402412738,0.0011309257469596355
0.08548650741577149,0.004073215533990502,0.003994178771972656,0.002526246053847174,,gini,10,"{'DT__class_weight': None, 'DT__criterion': 'gini', 'DT__max_depth': 10}",0.9605264008794905,0.9606622045461893,0.946732628447635,0.9504219613929575,0.9472901048090202,0.9531313064254352,0.006226131863981075,163,0.9869427086716069,0.9860521378289606,0.9877055445172501,0.9863945036311795,0.9856120865263363,0.9865413962350666,0.0007267545189946005
0.08948144912719727,0.0019573084944298257,0.0007988929748535157,0.0015977859497070313,,gini,11,"{'DT__class_weight': None, 'DT__criterion': 'gini', 'DT__max_depth': 11}",0.964897985578944,0.9604358651016911,0.9478707925113979,0.9608012416335241,0.9587513106901505,0.9585512799878101,0.005712041567396343,72,0.994780704669744,0.9933449939259217,0.9944724984796557,0.9927182312625893,0.9938079994826527,0.9938248855641125,0.0007467606736165074
0.08948087692260742,0.004073440004585632,0.003994512557983399,8.844011779304222e-07,,gini,12,"{'DT__class_weight': None, 'DT__criterion': 'gini', 'DT__max_depth': 12}",0.9603905972127913,0.9598441491253596,0.9503734600834225,0.9546545090050765,0.9616711472638332,0.9573833617996592,0.004244241399638064,154,0.9973104328909347,0.9960455365100247,0.9969912512258086,0.9963185736699899,0.9973025188346751,0.9967936626262865,0.0005196979130474311
0.0910792350769043,0.004658789067682016,0.00399484634399414,1.328314616888439e-06,,gini,13,"{'DT__class_weight': None, 'DT__criterion': 'gini', 'DT__max_depth': 13}",0.9626669253403175,0.9627574611181169,0.9488278850195624,0.9591166294823295,0.9583019229614437,0.9583341904516757,0.005087709833189595,74,0.9988602117849724,0.9976290216344935,0.9980967725591527,0.9983359015313671,0.9988844698806867,0.9983612754781344,0.00047528331424412905
0.09587459564208985,0.007149674714302359,0.0023967742919921873,0.0019569580514597383,,gini,14,"{'DT__class_weight': None, 'DT__criterion': 'gini', 'DT__max_depth': 14}",0.9621657451417855,0.9611181168558217,0.9465515568920363,0.9586154492837975,0.9581585554000435,0.957321218651374,0.005592302729570906,155,0.999430105892486,0.9984500019518968,0.9989856614480417,0.9988715610275118,0.9995675299899763,0.9990609720619826,0.00040191875378118994
0.09187960624694824,0.005054265056201159,0.0031958580017089843,0.0015979292889972388,,gini,15,"{'DT__class_weight': None, 'DT__criterion': 'gini', 'DT__max_depth': 15}",0.9603905972127913,0.961574029165454,0.9488278850195623,0.9581142690852653,0.9587895343412368,0.9575382676390761,0.00452253220555964,120,0.9995555555555555,0.9990087337006222,0.9992592592592593,0.9993050299969186,0.9997154589840592,0.9993688074992828,0.0002452605209165601
0.09507455825805664,0.004658077538226126,0.002396965026855469,0.0019571138013109507,,gini,16,"{'DT__class_weight': None, 'DT__criterion': 'gini', 'DT__max_depth': 16}",0.9604811329905908,0.9598894170142593,0.9506030329485564,0.9626216574514179,0.9576614169773059,0.9582518011001603,0.004139234617861015,76,1.0,0.9994187566499467,0.9997037037037036,0.9997037037037038,0.9998520710059172,0.9997356470126542,0.0001928197604376916
0.09427437782287598,0.001956880368249875,0.003196382522583008,0.00298952802724447,,gini,17,"{'DT__class_weight': None, 'DT__criterion': 'gini', 'DT__max_depth': 17}",0.9604811329905908,0.9609370453002231,0.9499660490833254,0.9614382254987551,0.9587537934952814,0.9583149001539318,0.004272965351717351,75,1.0,0.9997150529462431,1.0,1.0,1.0,0.9999430105892486,0.00011397882150276928
0.0958716869354248,0.005053396780483326,0.003996133804321289,0.0025269246358262175,,gini,18,"{'DT__class_weight': None, 'DT__criterion': 'gini', 'DT__max_depth': 18}",0.9604811329905908,0.9627574611181168,0.9499660490833254,0.9614382254987551,0.9587537934952814,0.9586792731596743,0.004549687177139123,39,1.0,1.0,1.0,1.0,1.0,1.0,0.0
0.09826970100402832,0.006964456228247554,0.002396821975708008,0.0019569969889227726,,gini,19,"{'DT__class_weight': None, 'DT__criterion': 'gini', 'DT__max_depth': 19}",0.9604811329905908,0.9627574611181168,0.9499660490833254,0.9614382254987551,0.9587537934952814,0.9586792731596743,0.004549687177139123,39,1.0,1.0,1.0,1.0,1.0,1.0,0.0
0.10146369934082031,0.010896146848294116,0.0023973941802978515,0.0019574641687728138,,gini,20,"{'DT__class_weight': None, 'DT__criterion': 'gini', 'DT__max_depth': 20}",0.9604811329905908,0.9627574611181168,0.9499660490833254,0.9614382254987551,0.9587537934952814,0.9586792731596743,0.004549687177139123,39,1.0,1.0,1.0,1.0,1.0,1.0,0.0
0.09107842445373535,0.0029885084994981342,0.0023964405059814452,0.001956685527948679,,gini,21,"{'DT__class_weight': None, 'DT__criterion': 'gini', 'DT__max_depth': 21}",0.9604811329905908,0.9627574611181168,0.9499660490833254,0.9614382254987551,0.9587537934952814,0.9586792731596743,0.004549687177139123,39,1.0,1.0,1.0,1.0,1.0,1.0,0.0
0.09187722206115723,0.0050530576881219385,0.002396678924560547,0.0019568803624402794,,gini,22,"{'DT__class_weight': None, 'DT__criterion': 'gini', 'DT__max_depth': 22}",0.9604811329905908,0.9627574611181168,0.9499660490833254,0.9614382254987551,0.9587537934952814,0.9586792731596743,0.004549687177139123,39,1.0,1.0,1.0,1.0,1.0,1.0,0.0
0.09507255554199219,0.002989757290654542,0.0023973941802978515,0.0019574641745806766,,gini,23,"{'DT__class_weight': None, 'DT__criterion': 'gini', 'DT__max_depth': 23}",0.9604811329905908,0.9627574611181168,0.9499660490833254,0.9614382254987551,0.9587537934952814,0.9586792731596743,0.004549687177139123,39,1.0,1.0,1.0,1.0,1.0,1.0,0.0
0.09347596168518066,0.004792960489698275,0.0031958580017089843,0.0015979291609338022,,gini,24,"{'DT__class_weight': None, 'DT__criterion': 'gini', 'DT__max_depth': 24}",0.9604811329905908,0.9627574611181168,0.9499660490833254,0.9614382254987551,0.9587537934952814,0.9586792731596743,0.004549687177139123,39,1.0,1.0,1.0,1.0,1.0,1.0,0.0
0.09667224884033203,0.0029895027413226996,0.002397298812866211,0.001957386297719577,,gini,25,"{'DT__class_weight': None, 'DT__criterion': 'gini', 'DT__max_depth': 25}",0.9604811329905908,0.9627574611181168,0.9499660490833254,0.9614382254987551,0.9587537934952814,0.9586792731596743,0.004549687177139123,39,1.0,1.0,1.0,1.0,1.0,1.0,0.0
0.0966714859008789,0.003914597534407707,0.0023964405059814452,0.001956685655772507,,gini,26,"{'DT__class_weight': None, 'DT__criterion': 'gini', 'DT__max_depth': 26}",0.9604811329905908,0.9627574611181168,0.9499660490833254,0.9614382254987551,0.9587537934952814,0.9586792731596743,0.004549687177139123,39,1.0,1.0,1.0,1.0,1.0,1.0,0.0
0.09187850952148438,0.0025266986921528996,0.0031954765319824217,0.0029894770148112025,,gini,27,"{'DT__class_weight': None, 'DT__criterion': 'gini', 'DT__max_depth': 27}",0.9604811329905908,0.9627574611181168,0.9499660490833254,0.9614382254987551,0.9587537934952814,0.9586792731596743,0.004549687177139123,39,1.0,1.0,1.0,1.0,1.0,1.0,0.0
0.09667105674743652,0.004658633621131398,0.0024003505706787108,0.0019598862033030646,,gini,28,"{'DT__class_weight': None, 'DT__criterion': 'gini', 'DT__max_depth': 28}",0.9604811329905908,0.9627574611181168,0.9499660490833254,0.9614382254987551,0.9587537934952814,0.9586792731596743,0.004549687177139123,39,1.0,1.0,1.0,1.0,1.0,1.0,0.0
0.09427394866943359,0.0047928573251748395,0.003197050094604492,0.0015985274680417993,,gini,29,"{'DT__class_weight': None, 'DT__criterion': 'gini', 'DT__max_depth': 29}",0.9604811329905908,0.9627574611181168,0.9499660490833254,0.9614382254987551,0.9587537934952814,0.9586792731596743,0.004549687177139123,39,1.0,1.0,1.0,1.0,1.0,1.0,0.0
0.09107866287231445,0.002990101477889935,0.003994178771972656,1.1424206305228175e-06,,gini,30,"{'DT__class_weight': None, 'DT__criterion': 'gini', 'DT__max_depth': 30}",0.9604811329905908,0.9627574611181168,0.9499660490833254,0.9614382254987551,0.9587537934952814,0.9586792731596743,0.004549687177139123,39,1.0,1.0,1.0,1.0,1.0,1.0,0.0
0.09746971130371093,0.0074090143543096175,0.0015980720520019532,0.001957230602080631,,gini,31,"{'DT__class_weight': None, 'DT__criterion': 'gini', 'DT__max_depth': 31}",0.9604811329905908,0.9627574611181168,0.9499660490833254,0.9614382254987551,0.9587537934952814,0.9586792731596743,0.004549687177139123,39,1.0,1.0,1.0,1.0,1.0,1.0,0.0
0.09747176170349121,0.004795099272963464,0.002397775650024414,0.001957775674274787,,gini,32,"{'DT__class_weight': None, 'DT__criterion': 'gini', 'DT__max_depth': 32}",0.9604811329905908,0.9627574611181168,0.9499660490833254,0.9614382254987551,0.9587537934952814,0.9586792731596743,0.004549687177139123,39,1.0,1.0,1.0,1.0,1.0,1.0,0.0
0.10146489143371581,0.009653198684981433,0.005594682693481445,0.003193881930180032,,gini,33,"{'DT__class_weight': None, 'DT__criterion': 'gini', 'DT__max_depth': 33}",0.9604811329905908,0.9627574611181168,0.9499660490833254,0.9614382254987551,0.9587537934952814,0.9586792731596743,0.004549687177139123,39,1.0,1.0,1.0,1.0,1.0,1.0,0.0
0.09747099876403809,0.005417906055990909,0.0023965835571289062,0.0019568024681544407,,gini,34,"{'DT__class_weight': None, 'DT__criterion': 'gini', 'DT__max_depth': 34}",0.9604811329905908,0.9627574611181168,0.9499660490833254,0.9614382254987551,0.9587537934952814,0.9586792731596743,0.004549687177139123,39,1.0,1.0,1.0,1.0,1.0,1.0,0.0
0.0966721534729004,0.004658609257128757,0.0015974998474121093,0.001956529838137014,,gini,35,"{'DT__class_weight': None, 'DT__criterion': 'gini', 'DT__max_depth': 35}",0.9604811329905908,0.9627574611181168,0.9499660490833254,0.9614382254987551,0.9587537934952814,0.9586792731596743,0.004549687177139123,39,1.0,1.0,1.0,1.0,1.0,1.0,0.0
0.09267582893371581,0.001597453177834277,0.0031958580017089843,0.0015979292605386981,,gini,36,"{'DT__class_weight': None, 'DT__criterion': 'gini', 'DT__max_depth': 36}",0.9604811329905908,0.9627574611181168,0.9499660490833254,0.9614382254987551,0.9587537934952814,0.9586792731596743,0.004549687177139123,39,1.0,1.0,1.0,1.0,1.0,1.0,0.0
0.09107780456542969,0.0029891075576866516,0.002396678924560547,0.001956880217200381,,gini,37,"{'DT__class_weight': None, 'DT__criterion': 'gini', 'DT__max_depth': 37}",0.9604811329905908,0.9627574611181168,0.9499660490833254,0.9614382254987551,0.9587537934952814,0.9586792731596743,0.004549687177139123,39,1.0,1.0,1.0,1.0,1.0,1.0,0.0
0.09507298469543457,0.003914091296087862,0.001598358154296875,0.0019575809579295404,,gini,38,"{'DT__class_weight': None, 'DT__criterion': 'gini', 'DT__max_depth': 38}",0.9604811329905908,0.9627574611181168,0.9499660490833254,0.9614382254987551,0.9587537934952814,0.9586792731596743,0.004549687177139123,39,1.0,1.0,1.0,1.0,1.0,1.0,0.0
0.09507379531860352,0.004659337198694907,0.0031945228576660155,0.0015972622082111026,,gini,39,"{'DT__class_weight': None, 'DT__criterion': 'gini', 'DT__max_depth': 39}",0.9604811329905908,0.9627574611181168,0.9499660490833254,0.9614382254987551,0.9587537934952814,0.9586792731596743,0.004549687177139123,39,1.0,1.0,1.0,1.0,1.0,1.0,0.0
0.09108119010925293,0.0029860007930619346,0.0015976905822753906,0.0019567635558703678,,gini,40,"{'DT__class_weight': None, 'DT__criterion': 'gini', 'DT__max_depth': 40}",0.9604811329905908,0.9627574611181168,0.9499660490833254,0.9614382254987551,0.9587537934952814,0.9586792731596743,0.004549687177139123,39,1.0,1.0,1.0,1.0,1.0,1.0,0.0
0.09826865196228027,0.004073870138346478,0.0023972511291503905,0.0019573475132062877,,gini,41,"{'DT__class_weight': None, 'DT__criterion': 'gini', 'DT__max_depth': 41}",0.9604811329905908,0.9627574611181168,0.9499660490833254,0.9614382254987551,0.9587537934952814,0.9586792731596743,0.004549687177139123,39,1.0,1.0,1.0,1.0,1.0,1.0,0.0
0.09586896896362304,0.010417334410268488,0.0023969173431396484,0.001957074869657397,,gini,42,"{'DT__class_weight': None, 'DT__criterion': 'gini', 'DT__max_depth': 42}",0.9604811329905908,0.9627574611181168,0.9499660490833254,0.9614382254987551,0.9587537934952814,0.9586792731596743,0.004549687177139123,39,1.0,1.0,1.0,1.0,1.0,1.0,0.0
0.09427347183227539,0.003196847480931203,0.0031959056854248048,0.0015979533931990823,,gini,43,"{'DT__class_weight': None, 'DT__criterion': 'gini', 'DT__max_depth': 43}",0.9604811329905908,0.9627574611181168,0.9499660490833254,0.9614382254987551,0.9587537934952814,0.9586792731596743,0.004549687177139123,39,1.0,1.0,1.0,1.0,1.0,1.0,0.0
0.09267649650573731,0.004658936263655703,0.0007994174957275391,0.0015988349914550781,,gini,44,"{'DT__class_weight': None, 'DT__criterion': 'gini', 'DT__max_depth': 44}",0.9604811329905908,0.9627574611181168,0.9499660490833254,0.9614382254987551,0.9587537934952814,0.9586792731596743,0.004549687177139123,39,1.0,1.0,1.0,1.0,1.0,1.0,0.0
0.09347591400146485,0.0031947613563122522,0.0015977859497070313,0.0019568801997715923,,gini,45,"{'DT__class_weight': None, 'DT__criterion': 'gini', 'DT__max_depth': 45}",0.9604811329905908,0.9627574611181168,0.9499660490833254,0.9614382254987551,0.9587537934952814,0.9586792731596743,0.004549687177139123,39,1.0,1.0,1.0,1.0,1.0,1.0,0.0
0.09347600936889648,0.001957036162623751,0.00239715576171875,0.001957269961622786,,gini,46,"{'DT__class_weight': None, 'DT__criterion': 'gini', 'DT__max_depth': 46}",0.9604811329905908,0.9627574611181168,0.9499660490833254,0.9614382254987551,0.9587537934952814,0.9586792731596743,0.004549687177139123,39,1.0,1.0,1.0,1.0,1.0,1.0,0.0
0.0982696533203125,0.011184668568779976,0.003997135162353516,4.942572982730842e-06,,gini,47,"{'DT__class_weight': None, 'DT__criterion': 'gini', 'DT__max_depth': 47}",0.9604811329905908,0.9627574611181168,0.9499660490833254,0.9614382254987551,0.9587537934952814,0.9586792731596743,0.004549687177139123,39,1.0,1.0,1.0,1.0,1.0,1.0,0.0
0.0990682601928711,0.008896121392820502,0.003196382522583008,0.002989846630852478,,gini,48,"{'DT__class_weight': None, 'DT__criterion': 'gini', 'DT__max_depth': 48}",0.9604811329905908,0.9627574611181168,0.9499660490833254,0.9614382254987551,0.9587537934952814,0.9586792731596743,0.004549687177139123,39,1.0,1.0,1.0,1.0,1.0,1.0,0.0
0.09347710609436036,0.0031954177397410396,0.0031948089599609375,0.0015974057254501725,,gini,49,"{'DT__class_weight': None, 'DT__criterion': 'gini', 'DT__max_depth': 49}",0.9604811329905908,0.9627574611181168,0.9499660490833254,0.9614382254987551,0.9587537934952814,0.9586792731596743,0.004549687177139123,39,1.0,1.0,1.0,1.0,1.0,1.0,0.0
0.09826860427856446,0.001956490964592369,0.0015979766845703124,0.001957113754839728,,gini,50,"{'DT__class_weight': None, 'DT__criterion': 'gini', 'DT__max_depth': 50}",0.9604811329905908,0.9627574611181168,0.9499660490833254,0.9614382254987551,0.9587537934952814,0.9586792731596743,0.004549687177139123,39,1.0,1.0,1.0,1.0,1.0,1.0,0.0
0.023967981338500977,0.004375412433766937,0.000800180435180664,0.001600360870361328,,entropy,1,"{'DT__class_weight': None, 'DT__criterion': 'entropy', 'DT__max_depth': 1}",0.19672131147540983,0.19672131147540983,0.1972677595628416,0.1950819672131148,0.1945054945054945,0.19606080602607273,0.001067830062837933,198,0.19589603283173734,0.19589603283173734,0.1957592339261286,0.19630642954856364,0.19644808743169398,0.1960611633139722,0.00026666957317072717
0.0343536376953125,0.0031964898441757253,0.0031957149505615233,0.0015978574921787793,,entropy,2,"{'DT__class_weight': None, 'DT__criterion': 'entropy', 'DT__max_depth': 2}",0.3672131147540984,0.36885245901639346,0.36876515665922993,0.3666666666666667,0.3648862066894854,0.36727862381625287,0.0014679908913351276,194,0.36868239480313664,0.3678621620207366,0.3672983395586387,0.3688195674762471,0.3692622950819673,0.3683849517881453,0.000707266523588701
0.0479334831237793,0.0035757464731295424,0.0015983104705810547,0.001957522588033685,,entropy,3,"{'DT__class_weight': None, 'DT__criterion': 'entropy', 'DT__max_depth': 3}",0.6053965790409676,0.6172793998771301,0.5965661072848968,0.6076729071684936,0.6042477331411757,0.606234125387274,0.006668540580370709,189,0.6102790710059615,0.6104842490615008,0.6006335072229501,0.6110119404193667,0.6125917483105379,0.6090001032040634,0.004261121435194347
0.055124855041503905,0.0029880561842894637,0.0031954765319824217,0.0015977383905122057,,entropy,4,"{'DT__class_weight': None, 'DT__criterion': 'entropy', 'DT__max_depth': 4}",0.7833026158372943,0.7918614802599669,0.7802437999159312,0.7816180036860997,0.7743517569021984,0.7822818393404194,0.005659846049882274,185,0.7922503798458311,0.7888786372105635,0.791801016861888,0.7936262829581783,0.7964820383483688,0.792607671044966,0.0024792068708193765
0.06758933067321778,0.002368642098614317,0.001598024368286133,0.0019571722205741614,,entropy,5,"{'DT__class_weight': None, 'DT__criterion': 'entropy', 'DT__max_depth': 5}",0.859685711514211,0.858909690561645,0.8403789568985032,0.8491221262974101,0.8553234228990849,0.8526818804071887,0.007197625801286994,181,0.8728525838906167,0.8602451118128308,0.855279018211609,0.8668201410877219,0.8685962104310151,0.8647586130867587,0.006240574127367092
0.08607511520385742,0.005284163460629649,0.0031958580017089843,0.001597929210736251,,entropy,6,"{'DT__class_weight': None, 'DT__criterion': 'entropy', 'DT__max_depth': 6}",0.9015682090083098,0.9089016070100558,0.8754421702719308,0.8943835483558056,0.8943397239582612,0.8949275192853374,0.011137199623792959,177,0.9170841518976774,0.9218945434579375,0.904896021267307,0.923485006593126,0.910696963818023,0.9156113374068141,0.006965796365106279
0.09976181983947754,0.006623972720025111,0.0007991313934326172,0.0015982627868652347,,entropy,7,"{'DT__class_weight': None, 'DT__criterion': 'entropy', 'DT__max_depth': 7}",0.9389045170886281,0.9362175445403692,0.9087205354544574,0.9219225919099817,0.9331494325346784,0.9277786520939086,0.011151055047665575,173,0.9489788830945342,0.9543706554510268,0.9437135801794175,0.9575740039822238,0.9474633815113007,0.9504201008437005,0.0049514024084575115
0.09826903343200684,0.0031954289425481924,0.0039947509765625,0.004376413522396892,,entropy,8,"{'DT__class_weight': None, 'DT__criterion': 'entropy', 'DT__max_depth': 8}",0.952287645099751,0.9499660490833253,0.931073172308986,0.9361237753419341,0.9541785610354337,0.9447183153784771,0.009320679503440905,169,0.9761969409275281,0.975396289532112,0.9689904987072387,0.9755116554099741,0.9742652051605394,0.9740721179474784,0.002615366435612731
0.10705757141113281,0.0029893624753371496,0.0023973941802978515,0.0019574643313929716,,entropy,9,"{'DT__class_weight': None, 'DT__criterion': 'entropy', 'DT__max_depth': 9}",0.9559284767355386,0.952287645099751,0.9373104407152327,0.9444563003201087,0.9594103511032893,0.949871054718114,0.008006398236788592,166,0.9887296404307977,0.9897008246176086,0.9838105487588602,0.9868149992067824,0.9896643709380153,0.987744076790413,0.002228163157994269
0.11344985961914063,0.008225449330422406,0.0007988929748535157,0.0015977859497070311,,entropy,10,"{'DT__class_weight': None, 'DT__criterion': 'entropy', 'DT__max_depth': 10}",0.9620752093639863,0.9556116015132409,0.9487826171306627,0.9541533288065446,0.9594073486412704,0.9560033133357844,0.004565227648410777,160,0.9953853617695647,0.9957615561453365,0.9926040340311157,0.993413804645847,0.9965054806479774,0.9947340474479682,0.0014763440156889665
0.11025233268737793,0.001956860835129726,0.002397012710571289,0.0019571527426458938,,entropy,11,"{'DT__class_weight': None, 'DT__criterion': 'entropy', 'DT__max_depth': 11}",0.9627121932292173,0.9574772852200343,0.9550651534258093,0.9552914928703076,0.9593640439006138,0.9579809335277636,0.0028393941551890056,79,0.9988490494261837,0.9981658024331432,0.9971285785123554,0.9983024144550013,0.9991576939244027,0.9983207077502172,0.0006964471557861939
0.11105241775512695,0.0029894006865805044,0.001598215103149414,0.0019574057640309064,,entropy,12,"{'DT__class_weight': None, 'DT__criterion': 'entropy', 'DT__max_depth': 12}",0.9644420732693115,0.9557474051799398,0.9510136773692891,0.9557021372910404,0.9616021483770536,0.9576983830294367,0.004758629965070262,118,1.0,0.9991565080812688,0.9994074074074073,0.999281957744338,0.9997041420118343,0.9995100030489696,0.0003050495591680724
0.11025385856628418,0.004794613733838385,0.0023965835571289062,0.0019568022822399685,,entropy,13,"{'DT__class_weight': None, 'DT__criterion': 'entropy', 'DT__max_depth': 13}",0.9644420732693115,0.9586154492837972,0.9526077537426845,0.9546545090050765,0.9598164340913394,0.9580258195259468,0.004135183317204628,78,1.0,0.9997037037037036,1.0,0.9995555555555556,1.0,0.999851851851852,0.00018739423171366306
0.11584553718566895,0.011011927885419244,0.0031958580017089843,0.0015979294455192028,,entropy,14,"{'DT__class_weight': None, 'DT__criterion': 'entropy', 'DT__max_depth': 14}",0.9644420732693115,0.9562938532673715,0.9526077537426845,0.9575678209978337,0.9598164340913394,0.9581442569327866,0.00392218995606978,77,1.0,1.0,1.0,0.9998518518518519,1.0,0.9999703703703704,5.9259259259247794e-05
0.11025300025939941,0.001956433199054039,0.0023962020874023437,0.001956491417830972,,entropy,15,"{'DT__class_weight': None, 'DT__criterion': 'entropy', 'DT__max_depth': 15}",0.9644420732693115,0.9562938532673715,0.9526077537426845,0.9557021372910404,0.9598164340913394,0.9577708231418215,0.004046152729137358,80,1.0,1.0,1.0,1.0,1.0,1.0,0.0
0.1134488582611084,0.003195762993577182,0.002396821975708008,0.001956997023778269,,entropy,16,"{'DT__class_weight': None, 'DT__criterion': 'entropy', 'DT__max_depth': 16}",0.9644420732693115,0.9562938532673715,0.9526077537426845,0.9557021372910404,0.9598164340913394,0.9577708231418215,0.004046152729137358,80,1.0,1.0,1.0,1.0,1.0,1.0,0.0
0.11185059547424317,0.005649161283212079,0.0023969173431396484,0.0019570750148828497,,entropy,17,"{'DT__class_weight': None, 'DT__criterion': 'entropy', 'DT__max_depth': 17}",0.9644420732693115,0.9562938532673715,0.9526077537426845,0.9557021372910404,0.9598164340913394,0.9577708231418215,0.004046152729137358,80,1.0,1.0,1.0,1.0,1.0,1.0,0.0
0.111049222946167,0.00587223233682353,0.003198385238647461,0.0015991999300399692,,entropy,18,"{'DT__class_weight': None, 'DT__criterion': 'entropy', 'DT__max_depth': 18}",0.9644420732693115,0.9562938532673715,0.9526077537426845,0.9557021372910404,0.9598164340913394,0.9577708231418215,0.004046152729137358,80,1.0,1.0,1.0,1.0,1.0,1.0,0.0
0.11025266647338867,0.0019564523738456407,0.0023968696594238283,0.0019570359128310067,,entropy,19,"{'DT__class_weight': None, 'DT__criterion': 'entropy', 'DT__max_depth': 19}",0.9644420732693115,0.9562938532673715,0.9526077537426845,0.9557021372910404,0.9598164340913394,0.9577708231418215,0.004046152729137358,80,1.0,1.0,1.0,1.0,1.0,1.0,0.0
0.11105141639709473,0.001598406054944355,0.002397298812866211,0.0019573863558005173,,entropy,20,"{'DT__class_weight': None, 'DT__criterion': 'entropy', 'DT__max_depth': 20}",0.9644420732693115,0.9562938532673715,0.9526077537426845,0.9557021372910404,0.9598164340913394,0.9577708231418215,0.004046152729137358,80,1.0,1.0,1.0,1.0,1.0,1.0,0.0
0.11105227470397949,0.0029894896807249297,0.0023973941802978515,0.0019574641687728133,,entropy,21,"{'DT__class_weight': None, 'DT__criterion': 'entropy', 'DT__max_depth': 21}",0.9644420732693115,0.9562938532673715,0.9526077537426845,0.9557021372910404,0.9598164340913394,0.9577708231418215,0.004046152729137358,80,1.0,1.0,1.0,1.0,1.0,1.0,0.0
0.11424775123596191,0.010895111918344188,0.0023968696594238283,0.0019570362846155443,,entropy,22,"{'DT__class_weight': None, 'DT__criterion': 'entropy', 'DT__max_depth': 22}",0.9644420732693115,0.9562938532673715,0.9526077537426845,0.9557021372910404,0.9598164340913394,0.9577708231418215,0.004046152729137358,80,1.0,1.0,1.0,1.0,1.0,1.0,0.0
0.11824321746826172,0.0152839369126573,0.002396821975708008,0.001956997058633765,,entropy,23,"{'DT__class_weight': None, 'DT__criterion': 'entropy', 'DT__max_depth': 23}",0.9644420732693115,0.9562938532673715,0.9526077537426845,0.9557021372910404,0.9598164340913394,0.9577708231418215,0.004046152729137358,80,1.0,1.0,1.0,1.0,1.0,1.0,0.0
0.12303652763366699,0.014156465384496308,0.0023966312408447267,0.001956841332025099,,entropy,24,"{'DT__class_weight': None, 'DT__criterion': 'entropy', 'DT__max_depth': 24}",0.9644420732693115,0.9562938532673715,0.9526077537426845,0.9557021372910404,0.9598164340913394,0.9577708231418215,0.004046152729137358,80,1.0,1.0,1.0,1.0,1.0,1.0,0.0
0.12383475303649902,0.013839021706307745,0.003995132446289062,7.136645101116068e-07,,entropy,25,"{'DT__class_weight': None, 'DT__criterion': 'entropy', 'DT__max_depth': 25}",0.9644420732693115,0.9562938532673715,0.9526077537426845,0.9557021372910404,0.9598164340913394,0.9577708231418215,0.004046152729137358,80,1.0,1.0,1.0,1.0,1.0,1.0,0.0
0.11344809532165527,0.008605305851497574,0.0023972034454345704,0.0019573086338296195,,entropy,26,"{'DT__class_weight': None, 'DT__criterion': 'entropy', 'DT__max_depth': 26}",0.9644420732693115,0.9562938532673715,0.9526077537426845,0.9557021372910404,0.9598164340913394,0.9577708231418215,0.004046152729137358,80,1.0,1.0,1.0,1.0,1.0,1.0,0.0
0.11344923973083496,0.0019562962249798552,0.0023968696594238283,0.0019570358837853368,,entropy,27,"{'DT__class_weight': None, 'DT__criterion': 'entropy', 'DT__max_depth': 27}",0.9644420732693115,0.9562938532673715,0.9526077537426845,0.9557021372910404,0.9598164340913394,0.9577708231418215,0.004046152729137358,80,1.0,1.0,1.0,1.0,1.0,1.0,0.0
0.11664342880249023,0.005871477566132881,0.0031957626342773438,0.0015978817084553011,,entropy,28,"{'DT__class_weight': None, 'DT__criterion': 'entropy', 'DT__max_depth': 28}",0.9644420732693115,0.9562938532673715,0.9526077537426845,0.9557021372910404,0.9598164340913394,0.9577708231418215,0.004046152729137358,80,1.0,1.0,1.0,1.0,1.0,1.0,0.0
0.11344881057739258,0.004793461324950053,0.003995370864868164,0.002526924889570917,,entropy,29,"{'DT__class_weight': None, 'DT__criterion': 'entropy', 'DT__max_depth': 29}",0.9644420732693115,0.9562938532673715,0.9526077537426845,0.9557021372910404,0.9598164340913394,0.9577708231418215,0.004046152729137358,80,1.0,1.0,1.0,1.0,1.0,1.0,0.0
0.10945339202880859,0.004073973384386315,0.002396678924560547,0.001956880164914015,,entropy,30,"{'DT__class_weight': None, 'DT__criterion': 'entropy', 'DT__max_depth': 30}",0.9644420732693115,0.9562938532673715,0.9526077537426845,0.9557021372910404,0.9598164340913394,0.9577708231418215,0.004046152729137358,80,1.0,1.0,1.0,1.0,1.0,1.0,0.0
0.1118504524230957,0.006188690916798367,0.003196573257446289,0.001598286674068802,,entropy,31,"{'DT__class_weight': None, 'DT__criterion': 'entropy', 'DT__max_depth': 31}",0.9644420732693115,0.9562938532673715,0.9526077537426845,0.9557021372910404,0.9598164340913394,0.9577708231418215,0.004046152729137358,80,1.0,1.0,1.0,1.0,1.0,1.0,0.0
0.11105184555053711,0.004658306705623228,0.0031964778900146484,0.0015982392677713112,,entropy,32,"{'DT__class_weight': None, 'DT__criterion': 'entropy', 'DT__max_depth': 32}",0.9644420732693115,0.9562938532673715,0.9526077537426845,0.9557021372910404,0.9598164340913394,0.9577708231418215,0.004046152729137358,80,1.0,1.0,1.0,1.0,1.0,1.0,0.0
0.11185035705566407,0.006189060345275329,0.002396965026855469,0.001957114080138264,,entropy,33,"{'DT__class_weight': None, 'DT__criterion': 'entropy', 'DT__max_depth': 33}",0.9644420732693115,0.9562938532673715,0.9526077537426845,0.9557021372910404,0.9598164340913394,0.9577708231418215,0.004046152729137358,80,1.0,1.0,1.0,1.0,1.0,1.0,0.0
0.11424751281738281,0.004073514874488037,0.0015978813171386719,0.0019569970005412713,,entropy,34,"{'DT__class_weight': None, 'DT__criterion': 'entropy', 'DT__max_depth': 34}",0.9644420732693115,0.9562938532673715,0.9526077537426845,0.9557021372910404,0.9598164340913394,0.9577708231418215,0.004046152729137358,80,1.0,1.0,1.0,1.0,1.0,1.0,0.0
0.10945358276367187,0.004793675775079858,0.00239710807800293,0.001957230555612181,,entropy,35,"{'DT__class_weight': None, 'DT__criterion': 'entropy', 'DT__max_depth': 35}",0.9644420732693115,0.9562938532673715,0.9526077537426845,0.9557021372910404,0.9598164340913394,0.9577708231418215,0.004046152729137358,80,1.0,1.0,1.0,1.0,1.0,1.0,0.0
0.11584625244140626,0.005649903075792838,0.0007988929748535157,0.0015977859497070311,,entropy,36,"{'DT__class_weight': None, 'DT__criterion': 'entropy', 'DT__max_depth': 36}",0.9644420732693115,0.9562938532673715,0.9526077537426845,0.9557021372910404,0.9598164340913394,0.9577708231418215,0.004046152729137358,80,1.0,1.0,1.0,1.0,1.0,1.0,0.0
0.11424746513366699,0.009316948310261754,0.0031954765319824217,0.001597738340703809,,entropy,37,"{'DT__class_weight': None, 'DT__criterion': 'entropy', 'DT__max_depth': 37}",0.9644420732693115,0.9562938532673715,0.9526077537426845,0.9557021372910404,0.9598164340913394,0.9577708231418215,0.004046152729137358,80,1.0,1.0,1.0,1.0,1.0,1.0,0.0
0.10785646438598633,0.00437619606470261,0.0031958103179931642,0.0015979055529754002,,entropy,38,"{'DT__class_weight': None, 'DT__criterion': 'entropy', 'DT__max_depth': 38}",0.9644420732693115,0.9562938532673715,0.9526077537426845,0.9557021372910404,0.9598164340913394,0.9577708231418215,0.004046152729137358,80,1.0,1.0,1.0,1.0,1.0,1.0,0.0
0.11504645347595215,0.004658453864124865,0.003196048736572266,0.0015980245141274676,,entropy,39,"{'DT__class_weight': None, 'DT__criterion': 'entropy', 'DT__max_depth': 39}",0.9644420732693115,0.9562938532673715,0.9526077537426845,0.9557021372910404,0.9598164340913394,0.9577708231418215,0.004046152729137358,80,1.0,1.0,1.0,1.0,1.0,1.0,0.0
0.11664247512817383,0.007322829471456399,0.0023973464965820314,0.001957425277774069,,entropy,40,"{'DT__class_weight': None, 'DT__criterion': 'entropy', 'DT__max_depth': 40}",0.9644420732693115,0.9562938532673715,0.9526077537426845,0.9557021372910404,0.9598164340913394,0.9577708231418215,0.004046152729137358,80,1.0,1.0,1.0,1.0,1.0,1.0,0.0
0.11185030937194824,0.006684160852499916,0.002397012710571289,0.0019571529227182883,,entropy,41,"{'DT__class_weight': None, 'DT__criterion': 'entropy', 'DT__max_depth': 41}",0.9644420732693115,0.9562938532673715,0.9526077537426845,0.9557021372910404,0.9598164340913394,0.9577708231418215,0.004046152729137358,80,1.0,1.0,1.0,1.0,1.0,1.0,0.0
0.11584620475769043,0.0075786627415415616,0.0023969173431396484,0.0019570748406123055,,entropy,42,"{'DT__class_weight': None, 'DT__criterion': 'entropy', 'DT__max_depth': 42}",0.9644420732693115,0.9562938532673715,0.9526077537426845,0.9557021372910404,0.9598164340913394,0.9577708231418215,0.004046152729137358,80,1.0,1.0,1.0,1.0,1.0,1.0,0.0
0.11185111999511718,0.005053321429441544,0.0015977859497070313,0.0019568801532948224,,entropy,43,"{'DT__class_weight': None, 'DT__criterion': 'entropy', 'DT__max_depth': 43}",0.9644420732693115,0.9562938532673715,0.9526077537426845,0.9557021372910404,0.9598164340913394,0.9577708231418215,0.004046152729137358,80,1.0,1.0,1.0,1.0,1.0,1.0,0.0
0.11025280952453613,0.006490290168001941,0.0015979766845703124,0.001957113754839728,,entropy,44,"{'DT__class_weight': None, 'DT__criterion': 'entropy', 'DT__max_depth': 44}",0.9644420732693115,0.9562938532673715,0.9526077537426845,0.9557021372910404,0.9598164340913394,0.9577708231418215,0.004046152729137358,80,1.0,1.0,1.0,1.0,1.0,1.0,0.0
0.11265058517456054,0.0015980246848685254,0.003994607925415039,7.776978697919889e-07,,entropy,45,"{'DT__class_weight': None, 'DT__criterion': 'entropy', 'DT__max_depth': 45}",0.9644420732693115,0.9562938532673715,0.9526077537426845,0.9557021372910404,0.9598164340913394,0.9577708231418215,0.004046152729137358,80,1.0,1.0,1.0,1.0,1.0,1.0,0.0
0.11344842910766602,0.008225403095102835,0.003195953369140625,0.0015979771612366536,,entropy,46,"{'DT__class_weight': None, 'DT__criterion': 'entropy', 'DT__max_depth': 46}",0.9644420732693115,0.9562938532673715,0.9526077537426845,0.9557021372910404,0.9598164340913394,0.9577708231418215,0.004046152729137358,80,1.0,1.0,1.0,1.0,1.0,1.0,0.0
0.11185126304626465,0.0035728115963089718,0.000798797607421875,0.00159759521484375,,entropy,47,"{'DT__class_weight': None, 'DT__criterion': 'entropy', 'DT__max_depth': 47}",0.9644420732693115,0.9562938532673715,0.9526077537426845,0.9557021372910404,0.9598164340913394,0.9577708231418215,0.004046152729137358,80,1.0,1.0,1.0,1.0,1.0,1.0,0.0
0.1118506908416748,0.0071463157224657655,0.0023972511291503905,0.0019573473680010536,,entropy,48,"{'DT__class_weight': None, 'DT__criterion': 'entropy', 'DT__max_depth': 48}",0.9644420732693115,0.9562938532673715,0.9526077537426845,0.9557021372910404,0.9598164340913394,0.9577708231418215,0.004046152729137358,80,1.0,1.0,1.0,1.0,1.0,1.0,0.0
0.1038637638092041,0.007575773256959058,0.003196430206298828,0.0015982325770294713,,entropy,49,"{'DT__class_weight': None, 'DT__criterion': 'entropy', 'DT__max_depth': 49}",0.9644420732693115,0.9562938532673715,0.9526077537426845,0.9557021372910404,0.9598164340913394,0.9577708231418215,0.004046152729137358,80,1.0,1.0,1.0,1.0,1.0,1.0,0.0
0.09746894836425782,0.014425423529469357,0.0007991790771484375,0.001598358154296875,,entropy,50,"{'DT__class_weight': None, 'DT__criterion': 'entropy', 'DT__max_depth': 50}",0.9644420732693115,0.9562938532673715,0.9526077537426845,0.9557021372910404,0.9598164340913394,0.9577708231418215,0.004046152729137358,80,1.0,1.0,1.0,1.0,1.0,1.0,0.0
