steps,time,reward,delta,converged
1,0.0016454353489905316,-3.4599999999999964,1.0,False
2,0.0010943231492888117,-3.4060000000000046,0.9,False
3,0.0011002490869032044,0.36859999999999005,0.81,False
4,0.0010820762115031357,7.775240000000011,0.7290000000000002,False
5,0.001063903336103067,16.60634599999999,0.6561000000000003,False
6,0.0009856809593600246,28.73272459999999,0.5904900000000004,False
7,0.0010224217726886309,44.21154353,0.5314410000000005,False
8,0.0017145712880619612,61.770489107,0.4782969000000006,False
9,0.001303706278918071,80.58333917120001,0.43046721000000066,False
10,0.0015921019103188883,100.38181584758004,0.3874204890000006,False
11,0.0010168908975742852,120.19023802966103,0.3486784401000005,False
12,0.001060742836045847,139.10885525941703,0.3138105960900006,False
13,0.0010413847731172154,156.7847825286566,0.28242953648100055,False
14,0.0010631132110745511,172.9764678551124,0.25418658283290063,False
15,0.001564052472218691,187.54898464892256,0.2287679245496106,False
16,0.0010101748349313766,200.66424976335168,0.20589113209465015,False
17,0.0010982737743745474,212.4679883663379,0.18530201888518505,False
18,0.0010161007725457694,223.09135310902553,0.16677181699666654,False
19,0.0010097797724029078,232.65238137744436,0.15009463529700007,False
20,0.0010761502738603212,241.25730681902132,0.13508517176730006,False
21,0.0010864218991173402,249.00173971644062,0.12157665459057032,False
22,0.0010714095237744914,255.97289275489965,0.10941898913151338,False
23,0.0010477057732316553,262.2567781985345,0.09847709021836204,False
24,0.0015032128458472016,267.92019565699246,0.08862938119652597,False
25,0.0010492860232602652,273.0172713696046,0.07976644307687408,False
26,0.0012235085896463715,277.60463951095556,0.07178979876918667,False
27,0.001050471210788828,281.73327083817145,0.06461081889226783,False
28,0.0010188662101029422,285.44903903266584,0.05814973700304105,False
29,0.0010220267101601621,288.79323040771044,0.05233476330273712,False
30,0.0015071634709329373,291.80300264525084,0.04710128697246363,False
31,0.001052051460817438,294.5117976590372,0.04239115827521722,False
32,0.0010441502106743883,296.9497131714449,0.03815204244769532,False
33,0.0010081995223458762,299.1438371326118,0.03433683820292632,False
34,0.0014277559066613321,301.118548697662,0.03090315438263369,False
35,0.0010662737111601928,302.8957891062073,0.027812838944370366,False
36,0.0010789157114459158,304.495305473898,0.025031555049933374,False
37,0.0010579773984886742,305.93487020481956,0.02252839954494057,False
38,0.0012345703399034846,307.23047846264905,0.02027555959044669,False
39,0.0011658294633605237,308.39652589469557,0.018248003631401666,False
40,0.0013080519665038537,309.4459685835375,0.01642320326826141,False
41,0.0012156073394749,310.3904670034951,0.014780882941435536,False
42,0.0013120025916180111,311.2405155814569,0.01330279464729145,False
43,0.0018394110408053166,312.00555930162267,0.011972515182562926,False
44,0.0013372865921610355,312.6940986497717,0.010775263664306589,False
45,0.0011701751509463065,313.3137840631061,0.009697737297876152,False
46,0.001147261525460408,313.87150093510684,0.008727963568088803,False
47,0.0010753601488602271,314.3734461199076,0.007855167211279657,False
48,0.0009967427096171377,314.8251967862283,0.0070696504901519575,False
49,0.0010141254600171123,315.2317723859168,0.006362685441136495,False
50,0.0010512613358457656,315.5976904256365,0.005726416897022801,False
51,0.0011144713372459591,315.9270166613844,0.005153775207320521,False
52,0.0010141254600171123,316.22341027355736,0.004638397686588469,False
53,0.0010149155850172065,316.490164524513,0.0041745579179299774,False
54,0.0010117550849315649,316.73024335037303,0.003757102126137113,False
55,0.0011140762747174904,316.9463142936472,0.0033813919135239345,False
56,0.0016853366623763577,317.14077814259406,0.003043252722171541,False
57,0.0010678539611888027,317.3157956066459,0.002738927449954076,False
58,0.0010449403356744824,317.4733113242928,0.002465034704958846,False
59,0.0010812860865030416,317.61507547017493,0.0022185312344635832,False
60,0.0012424715900749561,317.7426632014687,0.001996678111017225,False
61,0.0010081995223742979,317.85749215963347,0.0017970102999154136,False
62,0.0010307180853601494,317.96083822198153,0.0016173092699238723,False
63,0.0010362489605029168,318.0538496780949,0.0014555783429317515,False
64,0.0010224217726886309,318.1375599885967,0.0013100205086384875,False
65,0.0010188662101029422,318.21289926804843,0.0011790184577749052,False
66,0.0010662737111601928,318.2807046195551,0.0010611166119973703,False
67,0.0010164958350458164,318.34172943591085,0.0009550049507975888,False
68,0.0010255822727458508,318.3966517706312,0.0008595044557182518,False
69,0.0013404470922466771,318.4460818718794,0.0007735540101467819,False
70,0.0015186202836900975,318.4905689630029,0.0006961986091322814,False
71,0.0010571872734317367,318.53060734501406,0.0006265787482195861,False
72,0.001021631647660115,318.5666418888241,0.0005639208733976275,False
73,0.0010350637729459322,318.59907297825305,0.0005075287860583089,False
74,0.0010947182117888588,318.6282609587392,0.00045677590745274443,False
75,0.001062718148574504,318.6545301411766,0.00041109831670738117,False
76,0.001062718148574504,318.67817240537033,0.00036998848503655424,False
77,0.0012282493397606231,318.69945044314477,0.0003329896365329432,False
78,0.001078520648917447,318.7186006771418,0.00029969067287982654,False
79,0.0015541759094901408,318.73583588773886,0.0002697216055917995,False
80,0.0010583724609887213,318.7513475772765,0.00024274944503233087,False
81,0.0010481008357317023,318.7653080978602,0.00021847450052980832,False
82,0.0010567922109601113,318.77787256638555,0.00019662705047629458,False
83,0.001049286023288687,318.7891805880584,0.0001769643454290204,False
84,0.0010714095237744914,318.7993578075639,0.0001592679108863848,False
85,0.001108150337074676,318.80851730511915,0.00014334111979774633,False
86,0.001142520775374578,318.8167608529185,0.00012900700781770524,False
87,0.0010595576485172842,318.8241800459381,0.00011610630703628999,False
88,0.001004643959817031,318.83085731965565,0.0001044956763331939,False
89,0.0017390651636048915,318.8368668660015,9.404610870067387e-05,False
90,0.0010528415858459539,318.84227545771273,8.46414978301624e-05,False
91,0.0010473107107316082,318.84714319025284,7.617734804732379e-05,False
92,0.001049681085788734,318.85152414953916,6.855961324259141e-05,False
93,0.0010698292737458814,318.85546701289655,6.170365191859872e-05,False
94,0.0011717554010033382,318.8590155899184,5.55332867264724e-05,False
95,0.0010856317740888244,318.86220930923787,4.997995805400279e-05,False
96,0.0010714095237744914,318.86508365662553,4.498196224833606e-05,False
97,0.0010603477735458,318.86767056927425,4.0483766023946544e-05,False
98,0.0010441502106743883,318.86999879065837,3.643538942199598e-05,False
99,0.001678225537233402,318.8720941899038,3.27918504798852e-05,False
100,0.0010966935243175158,318.8739800492249,2.9512665431941087e-05,False
101,0.0009603969588170003,318.8756773226139,2.6561398888791388e-05,False
102,0.0011097305871317076,318.87720486866385,2.390525899986784e-05,False
103,0.0019113124174054974,318.878579660109,2.1514733099969874e-05,False
104,0.0010816811490030886,318.8798169724094,1.936325979023934e-05,False
105,0.001120792337360399,318.88093055347986,1.7426933811570677e-05,False
106,0.0010591625859888154,318.88193277644336,1.568424043041361e-05,False
107,0.00107496508636018,318.8828347771104,1.4115816387771929e-05,False
108,0.0011279034625033546,318.88364657771086,1.2704234748639465e-05,False
109,0.0010038538347600934,318.8843771982511,1.1433811273775518e-05,False
110,0.0010030637097599993,318.8850347567374,1.029043014666442e-05,False
111,0.0011520022755746595,318.88562655937505,9.261387131864751e-06,True
