iterations,fitness,time,fevals
0,22.0,0.001984792,565
10,22.0,0.00355674400001,1017
20,23.0,0.00504454700001,1474
30,24.0,0.00645689400001,1929
40,25.0,0.007884648,2386
50,25.0,0.00939497,2856
60,25.0,0.012820553,3316
70,26.0,0.015026184,3766
80,26.0,0.016832803,4224
90,26.0,0.018432014,4690
100,26.0,0.019879916,5157
110,27.0,0.021364954,5628
120,27.0,0.022893844,6080
130,29.0,0.024281697,6527
140,29.0,0.027542935,6990
150,29.0,0.028950146,7442
160,29.0,0.030355776,7921
170,29.0,0.031981456,8391
180,31.0,0.033406444,8842
190,31.0,0.035500272,9299
200,32.0,0.037402891,9767
210,33.0,0.03883341,10221
220,33.0,0.041466104,10673
230,35.0,0.04300487,11114
240,34.0,0.044397069,11575
250,34.0,0.04586986,12036
260,35.0,0.047294454,12499
270,38.0,0.048738801,12960
280,39.0,0.050155099,13417
290,40.0,0.051582458,13885
300,42.0,0.055231646,14348
310,40.0,0.056805969,14807
320,40.0,0.05821792,15257
330,42.0,0.05984518,15716
340,42.0,0.061674713,16180
350,44.0,0.063359653,16637
360,43.0,0.064779506,17103
370,44.0,0.066545829,17545
380,43.0,0.068162819,17999
390,43.0,0.071111167,18456
400,45.0,0.072609242,18911
410,43.0,0.074131417,19376
420,43.0,0.075528356,19839
430,43.0,0.076898826,20289
440,43.0,0.078314728,20756
450,43.0,0.079716803,21199
460,43.0,0.081101495,21654
470,44.0,0.083988608,22088
480,43.0,0.085392658,22536
490,43.0,0.086794338,22988
500,43.0,0.088764512,23457
510,42.0,0.090195032,23914
520,42.0,0.091634638,24371
530,43.0,0.093593356,24822
540,46.0,0.095027826,25273
550,46.0,0.098072964,25723
560,45.0,0.099628323,26173
570,45.0,0.101033953,26638
580,45.0,0.102591683,27083
590,44.0,0.10403524,27535
600,44.0,0.105445612,27987
610,45.0,0.106889563,28446
620,46.0,0.108520774,28910
630,43.0,0.111220233,29351
640,44.0,0.112592284,29812
650,44.0,0.1139671,30257
660,44.0,0.11536483,30721
670,44.0,0.116738856,31176
680,44.0,0.118116043,31634
690,45.0,0.119471896,32101
700,44.0,0.121052539,32549
710,44.0,0.124149825,33013
720,47.0,0.125527406,33459
730,43.0,0.126913679,33916
740,45.0,0.128311014,34386
750,46.0,0.129766422,34824
760,47.0,0.131921485,35284
770,48.0,0.133266672,35737
780,51.0,0.134640698,36200
790,51.0,0.137189243,36656
800,52.0,0.138551417,37108
810,53.0,0.140648012,37570
820,54.0,0.142007421,38013
830,53.0,0.143363274,38468
840,55.0,0.145006732,38929
850,54.0,0.146392214,39393
860,53.0,0.147761894,39841
870,54.0,0.150306884,40294
880,54.0,0.151644169,40747
890,53.0,0.153438541,41209
900,53.0,0.154820468,41680
910,54.0,0.156173161,42137
920,54.0,0.157897212,42596
930,53.0,0.159802991,43052
940,54.0,0.161154893,43493
950,54.0,0.163724377,43952
960,55.0,0.165064823,44403
970,54.0,0.16698601,44854
980,55.0,0.168427197,45303
990,56.0,0.169826902,45753
1000,57.0,0.17121041,46201
1010,58.0,0.172610905,46673
1020,57.0,0.174240141,47132
1030,57.0,0.176839254,47584
1040,57.0,0.178205378,48041
1050,57.0,0.179540688,48495
1060,58.0,0.180879948,48951
1070,58.0,0.182235011,49408
1080,58.0,0.184569037,49867
1090,58.0,0.185930421,50334
1100,58.0,0.187725188,50781
1110,58.0,0.190403314,51236
1120,58.0,0.19212855,51686
1130,59.0,0.193458329,52132
1140,59.0,0.194815367,52589
1150,59.0,0.196182281,53039
1160,59.0,0.197535368,53499
1170,60.0,0.199403221,53947
1180,59.0,0.201055766,54398
1190,59.0,0.203940114,54855
1200,60.0,0.20531967,55320
1210,60.0,0.20671898,55789
1220,60.0,0.208067326,56243
1230,60.0,0.209408562,56703
1240,59.0,0.210752958,57151
1250,60.0,0.212841651,57594
1260,60.0,0.215561258,58051
1270,60.0,0.21825163,58508
1280,60.0,0.219577853,58959
1290,61.0,0.220932521,59416
1300,60.0,0.222410843,59874
1310,58.0,0.223762745,60331
1320,60.0,0.225110696,60783
1330,59.0,0.226939438,61248
1340,59.0,0.228423291,61701
1350,59.0,0.231021614,62152
1360,58.0,0.23236048,62599
1370,59.0,0.23376216,63047
1380,59.0,0.235394162,63506
1390,59.0,0.236736978,63958
1400,59.0,0.238063201,64410
1410,59.0,0.239399301,64862
1420,58.0,0.240736586,65317
1430,61.0,0.24209955,65772
1440,61.0,0.245230022,66233
1450,60.0,0.246624196,66702
1460,61.0,0.247975308,67156
1470,61.0,0.249334717,67614
1480,61.0,0.251215608,68073
1490,59.0,0.252715659,68526
1500,60.0,0.254071512,68989
1510,59.0,0.256158625,69432
1520,60.0,0.259138578,69888
1530,60.0,0.261553198,70339
1540,59.0,0.262853742,70791
1550,59.0,0.264187866,71238
1560,59.0,0.265538583,71693
1570,59.0,0.267014535,72151
1580,60.0,0.268772166,72613
1590,59.0,0.270419969,73073
1600,60.0,0.272902538,73532
1610,60.0,0.274239823,73994
1620,60.0,0.275583429,74456
1630,60.0,0.276946788,74919
1640,60.0,0.278780666,75368
1650,59.0,0.28010847,75826
1660,60.0,0.281465508,76287
1670,60.0,0.282822941,76746
1680,61.0,0.285390449,77200
1690,60.0,0.287669167,77656
1700,61.0,0.289038057,78107
1710,62.0,0.290376132,78553
1720,66.0,0.292109664,79003
1730,61.0,0.293480135,79458
1740,62.0,0.294813074,79900
1750,62.0,0.296144828,80363
1760,62.0,0.298664533,80821
1770,62.0,0.300531201,81275
1780,62.0,0.301841622,81738
1790,62.0,0.303188783,82188
1800,61.0,0.30549397,82646
1810,61.0,0.306937132,83090
1820,63.0,0.308265726,83541
1830,69.0,0.309615653,84007
1840,69.0,0.312100989,84459
1850,62.0,0.31354494,84919
1860,63.0,0.315171805,85377
1870,66.0,0.316553732,85853
1880,65.0,0.318205091,86325
1890,64.0,0.319555808,86778
1900,64.0,0.321081537,87224
1910,65.0,0.322406971,87681
1920,66.0,0.324872948,88135
1930,65.0,0.326218529,88594
1940,67.0,0.327895173,89059
1950,66.0,0.329218631,89516
1960,67.0,0.330679571,89958
1970,66.0,0.331975769,90409
1980,67.0,0.333322535,90863
1990,66.0,0.334991672,91317
2000,66.0,0.337588415,91778
2010,68.0,0.339127972,92232
2020,68.0,0.340469998,92689
2030,68.0,0.341800172,93148
2040,69.0,0.343118099,93598
2050,69.0,0.344773014,94042
2060,70.0,0.346070003,94489
2070,70.0,0.347487881,94953
2080,70.0,0.34995939,95411
2090,70.0,0.351256774,95864
2100,70.0,0.352581812,96316
2110,71.0,0.35400285,96764
2120,71.0,0.355322752,97221
2130,73.0,0.35709421,97675
2140,73.0,0.35881273,98124
2150,73.0,0.36031199,98577
2160,73.0,0.363131153,99025
2170,74.0,0.364447895,99477
2180,74.0,0.366144687,99935
2190,74.0,0.367683849,100385
2200,74.0,0.368995455,100842
2210,74.0,0.370287703,101295
2220,74.0,0.371609975,101740
2230,74.0,0.372913285,102203
2240,74.0,0.375433781,102659
2250,73.0,0.376946869,103117
2260,73.0,0.378471018,103584
2270,73.0,0.379782624,104025
2280,72.0,0.381174032,104476
2290,72.0,0.382472206,104923
2300,72.0,0.383801985,105387
2310,70.0,0.385388554,105831
2320,70.0,0.387897593,106288
2330,70.0,0.389256211,106752
2340,69.0,0.390572953,107203
2350,70.0,0.392038238,107669
2360,69.0,0.39335893,108128
2370,69.0,0.394651969,108577
2380,69.0,0.395952909,109027
2390,68.0,0.397272811,109473
2400,70.0,0.399766048,109943
2410,69.0,0.401068962,110400
2420,69.0,0.402412963,110864
2430,69.0,0.403929211,111322
2440,69.0,0.405304422,111774
2450,69.0,0.406646447,112227
2460,70.0,0.407969115,112679
2470,70.0,0.409295338,113144
2480,71.0,0.410596277,113585
2490,71.0,0.411903932,114031
2500,71.0,0.413349464,114484
2510,71.0,0.414910749,114928
2520,71.0,0.417772578,115376
2530,72.0,0.419190455,115837
2540,72.0,0.420485864,116275
2550,70.0,0.421808532,116739
2560,70.0,0.423274607,117196
2570,70.0,0.426079548,117654
2580,71.0,0.427511648,118113
2590,69.0,0.428838266,118566
2600,72.0,0.430152637,119029
2610,72.0,0.431465428,119487
2620,72.0,0.432788096,119936
2630,70.0,0.434111554,120394
2640,70.0,0.435414864,120832
2650,70.0,0.438799361,121299
2660,72.0,0.440139807,121749
2670,72.0,0.441501981,122213
2680,69.0,0.442842427,122670
2690,69.0,0.444178922,123132
2700,71.0,0.445999368,123593
2710,72.0,0.447328356,124044
2720,72.0,0.448653,124496
2730,70.0,0.451213002,124957
2740,71.0,0.452552263,125420
2750,70.0,0.453901795,125874
2760,71.0,0.455214586,126334
2770,72.0,0.456528167,126783
2780,69.0,0.457832267,127228
2790,69.0,0.45915375,127682
2800,69.0,0.460934295,128140
2810,68.0,0.46342279,128595
2820,71.0,0.464752569,129047
2830,69.0,0.466082743,129503
2840,69.0,0.467410941,129964
2850,70.0,0.468783781,130426
2860,71.0,0.470127782,130884
2870,73.0,0.47145203,131333
2880,73.0,0.472782994,131794
2890,71.0,0.475281761,132259
2900,72.0,0.476707145,132702
2910,73.0,0.478066554,133165
2920,73.0,0.47934774,133618
2930,74.0,0.480671988,134069
2940,74.0,0.481999792,134536
2950,75.0,0.483311398,135003
2960,75.0,0.484604832,135455
2970,76.0,0.488163946,135902
2980,76.0,0.489797922,136352
2990,75.0,0.491233972,136800
3000,75.0,0.492698467,137271
3010,73.0,0.49418469,137733
3020,74.0,0.496216889,138186
3030,78.0,0.497773434,138629
3040,75.0,0.499324842,139090
3050,74.0,0.501847313,139535
3060,74.0,0.503176301,139982
3070,74.0,0.504555463,140440
3080,74.0,0.506357341,140896
3090,73.0,0.508347268,141362
3100,74.0,0.509682578,141822
3110,74.0,0.511023814,142284
3120,76.0,0.512425889,142738
3130,76.0,0.514975619,143189
3140,80.0,0.516285645,143647
3150,80.0,0.518062634,144105
3160,81.0,0.519370289,144563
3170,81.0,0.520634487,145020
3180,80.0,0.521909747,145484
3190,81.0,0.523202786,145942
3200,81.0,0.524508861,146407
3210,83.0,0.527403085,146862
3220,83.0,0.528700073,147330
3230,84.0,0.530000222,147768
3240,85.0,0.531276273,148216
3250,81.0,0.532578003,148679
3260,81.0,0.533876177,149135
3270,76.0,0.535751931,149589
3280,75.0,0.537272525,150042
3290,75.0,0.539742453,150497
3300,75.0,0.541088034,150960
3310,75.0,0.542390158,151421
3320,77.0,0.543683986,151874
3330,78.0,0.545523395,152329
3340,78.0,0.546830655,152780
3350,78.0,0.548135545,153225
3360,79.0,0.549431349,153677
3370,79.0,0.551908388,154125
3380,79.0,0.553309673,154569
3390,79.0,0.554927452,155026
3400,80.0,0.556209823,155481
3410,80.0,0.557966664,155933
3420,78.0,0.559446566,156390
3430,79.0,0.560766468,156855
3440,79.0,0.562033827,157294
3450,80.0,0.565931904,157746
3460,80.0,0.567949881,158208
3470,80.0,0.569357092,158646
3480,80.0,0.570682525,159104
3490,80.0,0.572342576,159549
3500,80.0,0.573651812,160010
3510,79.0,0.575069295,160475
3520,80.0,0.576430284,160926
3530,80.0,0.578941694,161374
3540,80.0,0.580270683,161813
3550,80.0,0.581630487,162263
3560,79.0,0.582945648,162736
3570,80.0,0.584274637,163190
3580,79.0,0.586408763,163646
3590,79.0,0.58788511,164107
3600,79.0,0.589258741,164545
3610,80.0,0.590599977,164991
3620,80.0,0.593047386,165440
3630,79.0,0.594374794,165901
3640,80.0,0.595701412,166363
3650,82.0,0.597159191,166807
3660,82.0,0.598467241,167264
3670,84.0,0.599895785,167717
3680,85.0,0.601221614,168175
3690,84.0,0.602504381,168634
3700,85.0,0.604909913,169096
3710,85.0,0.606677025,169548
3720,86.0,0.607958606,170018
3730,86.0,0.609238606,170469
3740,86.0,0.610520187,170923
3750,86.0,0.611808879,171379
3760,87.0,0.613080979,171820
3770,85.0,0.61451703,172262
3780,86.0,0.616954562,172717
3790,86.0,0.618255501,173176
3800,85.0,0.619910417,173626
3810,86.0,0.621343702,174094
3820,86.0,0.623031802,174546
3830,85.0,0.624992099,175006
3840,85.0,0.626328989,175462
3850,85.0,0.627609385,175912
3860,86.0,0.630309239,176374
3870,85.0,0.631583709,176808
3880,85.0,0.632939957,177259
3890,84.0,0.63426223,177728
3900,84.0,0.635536701,178182
3910,80.0,0.636847912,178654
3920,83.0,0.638626876,179114
3930,80.0,0.639970087,179563
3940,80.0,0.642577496,180019
3950,81.0,0.643899769,180480
3960,80.0,0.645191227,180935
3970,79.0,0.646503228,181384
3980,79.0,0.647778488,181833
3990,79.0,0.649050983,182288
4000,79.0,0.650329009,182733
4010,79.0,0.652507776,183176
4020,81.0,0.655268865,183637
4030,79.0,0.65657573,184091
4040,80.0,0.658006645,184557
4050,76.0,0.659351436,185030
4060,76.0,0.660675684,185489
4070,81.0,0.662185216,185960
4080,83.0,0.66351697,186430
4090,85.0,0.664970008,186886
4100,83.0,0.668320529,187331
4110,84.0,0.669639246,187807
4120,84.0,0.671110062,188263
4130,83.0,0.672407841,188725
4140,84.0,0.673763299,189187
4150,82.0,0.675057917,189645
4160,83.0,0.676351745,190109
4170,83.0,0.677649919,190565
4180,83.0,0.680441427,191014
4190,83.0,0.682148885,191461
4200,83.0,0.683475108,191924
4210,81.0,0.684771702,192375
4220,83.0,0.686075407,192829
4230,87.0,0.68737121,193282
4240,82.0,0.688670174,193730
4250,83.0,0.689977039,194188
4260,84.0,0.693343363,194629
4270,85.0,0.694632845,195072
4280,84.0,0.695942081,195541
4290,84.0,0.697242625,196006
4300,86.0,0.698539614,196466
4310,87.0,0.700155813,196921
4320,87.0,0.701945839,197378
4330,85.0,0.703270087,197835
4340,87.0,0.706045002,198287
4350,87.0,0.707420213,198728
4360,86.0,0.708690338,199168
4370,87.0,0.709997994,199631
4380,82.0,0.711304069,200085
4390,84.0,0.71261212,200536
4400,86.0,0.713941109,201007
4410,86.0,0.716481753,201474
4420,86.0,0.718948915,201925
4430,86.0,0.720234842,202371
4440,87.0,0.721521164,202829
4450,87.0,0.722818942,203280
4460,85.0,0.724447783,203733
4470,83.0,0.725750302,204181
4480,85.0,0.727048871,204644
4490,83.0,0.728521268,205111
4500,84.0,0.731590505,205572
4510,83.0,0.732870506,206020
4520,87.0,0.734205025,206475
4530,84.0,0.735507545,206922
4540,84.0,0.736869719,207374
4550,84.0,0.738256782,207825
4560,84.0,0.739570364,208288
4570,83.0,0.741296785,208745
4580,82.0,0.743787256,209199
4590,82.0,0.745083059,209651
4600,83.0,0.746498567,210107
4610,84.0,0.747818864,210565
4620,84.0,0.74919052,211027
4630,83.0,0.750890077,211476
4640,84.0,0.752407115,211923
4650,83.0,0.753716746,212380
4660,84.0,0.7550805,212838
4670,83.0,0.757475761,213280
4680,83.0,0.758763664,213727
4690,83.0,0.760070924,214186
4700,83.0,0.761474185,214650
4710,83.0,0.762788556,215114
4720,82.0,0.764337595,215570
4730,82.0,0.765660657,216018
4740,83.0,0.767005843,216472
4750,82.0,0.769490783,216926
4760,82.0,0.771237352,217385
4770,81.0,0.772691576,217839
4780,82.0,0.773986984,218286
4790,83.0,0.775266986,218728
4800,83.0,0.776592024,219187
4810,82.0,0.778138297,219642
4820,82.0,0.779902644,220103
4830,83.0,0.782785806,220542
4840,83.0,0.784083585,220999
4850,85.0,0.785394401,221456
4860,82.0,0.787125168,221912
4870,87.0,0.788536725,222367
4880,83.0,0.789815146,222817
4890,83.0,0.791920431,223290
4900,83.0,0.793380185,223756
4910,83.0,0.796125076,224209
4920,85.0,0.797401916,224648
4930,83.0,0.798717078,225101
4940,89.0,0.8000674,225561
4950,88.0,0.80137229,226031
4960,88.0,0.802673229,226485
4970,84.0,0.804083601,226940
4980,84.0,0.80551254,227390
4990,87.0,0.808046467,227850
5000,89.0,0.809381382,228306
