iterations,fitness,time,fevals
0,529.0,0.0115607,468
10,538.0,0.024434587,835
20,538.0,0.03639272,1201
30,537.0,0.047659495,1572
40,537.0,0.05835738,1941
50,529.0,0.06963008,2311
60,547.0,0.080865249,2678
70,527.0,0.092357999,3045
80,535.0,0.103548526,3411
90,533.0,0.115311103,3776
100,535.0,0.128954571,4153
110,535.0,0.140125346,4518
120,537.0,0.151223034,4888
130,535.0,0.162803883,5251
140,533.0,0.174496534,5623
150,533.0,0.186175358,5989
160,535.0,0.196454872,6357
170,531.0,0.208276313,6721
180,537.0,0.21898526,7089
190,537.0,0.229623885,7458
200,539.0,0.242016586,7833
210,535.0,0.262846627,8206
220,541.0,0.276138884,8586
230,535.0,0.288759536,8951
240,539.0,0.299379199,9313
250,541.0,0.311865134,9670
260,541.0,0.323678675,10034
270,541.0,0.337040859,10403
280,539.0,0.349262103,10769
290,537.0,0.36044947,11133
300,535.0,0.396028362,11504
310,539.0,0.407630939,11878
320,541.0,0.418422453,12238
330,535.0,0.429691202,12612
340,539.0,0.440271754,12969
350,541.0,0.451179417,13336
360,537.0,0.462301599,13699
370,541.0,0.472948126,14069
380,539.0,0.48408532,14438
390,539.0,0.496832392,14804
400,537.0,0.509178476,15174
410,541.0,0.521157152,15543
420,539.0,0.531837259,15908
430,539.0,0.546251493,16277
440,539.0,0.557452687,16650
450,541.0,0.569148894,17012
460,539.0,0.581067126,17379
470,541.0,0.592578839,17749
480,541.0,0.602963439,18118
490,541.0,0.61335041,18484
500,541.0,0.624446517,18849
510,541.0,0.636807218,19215
520,539.0,0.6470733,19578
530,543.0,0.658696815,19946
540,543.0,0.672220974,20314
550,541.0,0.683541477,20686
560,541.0,0.694253979,21047
570,537.0,0.704670185,21413
580,535.0,0.715005799,21772
590,537.0,0.725177462,22129
600,535.0,0.735842161,22496
610,537.0,0.746777083,22862
620,535.0,0.758152105,23234
630,541.0,0.769892954,23597
640,537.0,0.780264913,23962
650,535.0,0.791128724,24323
660,539.0,0.802162806,24683
670,537.0,0.813800149,25049
680,535.0,0.825219812,25417
690,535.0,0.836707821,25783
700,537.0,0.848885608,26155
710,537.0,0.860402062,26522
720,539.0,0.872398121,26893
730,537.0,0.883681883,27262
740,537.0,0.894753892,27636
750,537.0,0.906461556,28001
760,537.0,0.917295737,28373
770,539.0,0.928370907,28737
780,537.0,0.964559775,29104
790,539.0,0.976467735,29474
800,539.0,0.987648386,29840
810,541.0,0.999094124,30198
820,539.0,1.010226183,30565
830,539.0,1.020524265,30924
840,539.0,1.034560029,31297
850,537.0,1.046023939,31664
860,541.0,1.057356294,32028
870,539.0,1.069561736,32400
880,539.0,1.08598328,32768
890,537.0,1.096240671,33135
900,537.0,1.106984383,33504
910,539.0,1.117798021,33876
920,537.0,1.128795363,34238
930,539.0,1.1395371,34603
940,535.0,1.151703826,34972
950,537.0,1.163006155,35331
960,535.0,1.174529719,35698
970,539.0,1.185253283,36066
980,535.0,1.196151069,36437
990,537.0,1.208404708,36810
1000,535.0,1.219190691,37183
1010,537.0,1.22978665,37545
1020,535.0,1.240231695,37911
1030,535.0,1.251445926,38280
1040,537.0,1.262309737,38641
1050,533.0,1.272601894,39006
1060,533.0,1.284758743,39368
1070,535.0,1.29629811,39743
1080,535.0,1.307512736,40111
1090,533.0,1.318445287,40481
1100,533.0,1.328935764,40844
1110,537.0,1.339762834,41217
1120,535.0,1.350783089,41582
1130,537.0,1.362265172,41946
1140,539.0,1.373243946,42312
1150,537.0,1.385925438,42673
1160,539.0,1.397565546,43036
1170,539.0,1.408496913,43403
1180,541.0,1.419929218,43766
1190,541.0,1.433260191,44137
1200,541.0,1.444046965,44506
1210,541.0,1.454949098,44873
1220,539.0,1.465778144,45246
1230,537.0,1.477826351,45617
1240,535.0,1.514878824,45990
1250,537.0,1.527739278,46355
1260,535.0,1.539224126,46722
1270,535.0,1.550216332,47088
1280,535.0,1.562944441,47457
1290,535.0,1.573598474,47817
1300,535.0,1.584322037,48192
1310,533.0,1.594879675,48555
1320,537.0,1.605412425,48929
1330,535.0,1.616230408,49293
1340,535.0,1.627373133,49666
1350,535.0,1.638114475,50025
1360,531.0,1.64929078,50392
1370,533.0,1.660429554,50754
1380,535.0,1.670879735,51119
1390,535.0,1.682292682,51478
1400,533.0,1.693299901,51846
1410,535.0,1.705067614,52205
1420,533.0,1.715972907,52573
1430,537.0,1.727492126,52930
1440,539.0,1.740298063,53299
1450,533.0,1.751380343,53666
1460,537.0,1.762332648,54032
1470,539.0,1.773299175,54395
1480,539.0,1.784663135,54761
1490,541.0,1.79574502,55131
1500,539.0,1.806897622,55503
1510,539.0,1.817798173,55873
1520,541.0,1.828564404,56239
1530,541.0,1.839376857,56601
1540,539.0,1.849594742,56976
1550,539.0,1.859856478,57341
1560,541.0,1.870527894,57707
1570,541.0,1.882193681,58075
1580,539.0,1.893745295,58446
1590,541.0,1.904645452,58816
1600,539.0,1.917294548,59190
1610,541.0,1.930471842,59558
1620,543.0,1.94329437,59923
1630,541.0,1.953919169,60298
1640,545.0,1.965244412,60665
1650,547.0,1.974634642,61027
1660,547.0,1.98599228,61390
1670,549.0,1.996728486,61759
1680,549.0,2.007450075,62119
1690,547.0,2.018394874,62481
1700,547.0,2.031889798,62850
1710,549.0,2.051647641,63216
1720,549.0,2.063589577,63579
1730,543.0,2.074121536,63942
1740,553.0,2.085057643,64309
1750,549.0,2.096391183,64682
1760,549.0,2.107257365,65049
1770,553.0,2.119459251,65416
1780,555.0,2.130065482,65783
1790,555.0,2.140964059,66155
1800,557.0,2.152404661,66532
1810,555.0,2.163833016,66898
1820,555.0,2.198124006,67260
1830,553.0,2.208889842,67630
1840,555.0,2.219423381,67984
1850,555.0,2.230575192,68345
1860,553.0,2.24125846,68708
1870,551.0,2.252326518,69078
1880,551.0,2.263990329,69439
1890,551.0,2.277771674,69804
1900,551.0,2.28870225,70172
1910,553.0,2.299176529,70536
1920,553.0,2.309906019,70902
1930,553.0,2.320765879,71272
1940,555.0,2.331555023,71646
1950,555.0,2.343572415,72006
1960,553.0,2.355345659,72372
1970,553.0,2.366896088,72742
1980,555.0,2.378161282,73100
1990,555.0,2.388707858,73469
2000,553.0,2.399358336,73836
2010,553.0,2.411539284,74203
2020,553.0,2.422915886,74568
2030,555.0,2.434470266,74937
2040,553.0,2.447120547,75303
2050,551.0,2.458689544,75669
2060,551.0,2.469783281,76034
2070,549.0,2.480495388,76403
2080,553.0,2.492254804,76774
2090,553.0,2.511478523,77142
2100,551.0,2.523108754,77512
2110,553.0,2.534687627,77882
2120,555.0,2.546157858,78252
2130,555.0,2.557159151,78624
2140,555.0,2.568228789,78997
2150,553.0,2.578919563,79361
2160,553.0,2.59070703,79722
2170,553.0,2.602146051,80083
2180,553.0,2.613427442,80448
2190,555.0,2.624708043,80813
2200,553.0,2.635998126,81181
2210,553.0,2.646922382,81550
2220,555.0,2.657569699,81916
2230,553.0,2.669214548,82286
2240,551.0,2.680349371,82647
2250,551.0,2.692424838,83012
2260,551.0,2.702611117,83373
2270,549.0,2.713196804,83739
2280,547.0,2.723805405,84107
2290,545.0,2.735069414,84474
2300,543.0,2.746026065,84838
2310,543.0,2.756383011,85199
2320,545.0,2.791374051,85564
2330,547.0,2.80445732,85934
2340,549.0,2.81643244,86299
2350,551.0,2.82741398,86656
2360,551.0,2.838320063,87021
2370,547.0,2.85005222,87383
2380,547.0,2.861180723,87754
2390,549.0,2.872169769,88121
2400,549.0,2.882374221,88486
2410,549.0,2.892741044,88855
2420,549.0,2.903561793,89221
2430,547.0,2.914327234,89585
2440,547.0,2.926491194,89954
2450,551.0,2.939921328,90319
2460,549.0,2.955736847,90687
2470,551.0,2.966969251,91042
2480,551.0,2.977731136,91408
2490,551.0,2.990406702,91770
2500,551.0,3.001951205,92142
2510,551.0,3.013808597,92508
2520,551.0,3.025124754,92871
2530,549.0,3.036160813,93242
2540,549.0,3.046710945,93620
2550,551.0,3.059018313,93987
2560,553.0,3.070706223,94351
2570,551.0,3.082286677,94719
2580,549.0,3.0932295,95085
2590,549.0,3.104543287,95455
2600,549.0,3.115532332,95819
2610,553.0,3.126969378,96189
2620,551.0,3.138155954,96556
2630,551.0,3.150521791,96920
2640,553.0,3.161909454,97294
2650,555.0,3.17436497,97652
2660,553.0,3.185758559,98018
2670,551.0,3.197746322,98389
2680,549.0,3.208095762,98757
2690,551.0,3.219079671,99121
2700,553.0,3.230414396,99485
2710,551.0,3.241796134,99855
2720,552.0,3.252448982,100223
2730,551.0,3.262990422,100585
2740,549.0,3.275825197,100951
2750,547.0,3.286647527,101326
2760,549.0,3.296861066,101692
2770,549.0,3.307481519,102056
2780,549.0,3.318351256,102423
2790,551.0,3.329735363,102796
2800,551.0,3.346615179,103165
2810,551.0,3.358039583,103541
2820,553.0,3.372359002,103906
2830,553.0,3.386288494,104276
2840,553.0,3.401073296,104641
2850,553.0,3.436804287,105005
2860,555.0,3.447428295,105362
2870,555.0,3.458478971,105729
2880,553.0,3.469478683,106096
2890,551.0,3.48025637,106459
2900,553.0,3.49343564,106826
2910,553.0,3.504779846,107191
2920,553.0,3.516260349,107552
2930,555.0,3.528979372,107924
2940,555.0,3.541366542,108298
2950,555.0,3.552096427,108665
2960,559.0,3.563199646,109038
2970,561.0,3.574853581,109407
2980,563.0,3.585946133,109775
2990,561.0,3.597221599,110138
3000,559.0,3.607641755,110507
