k,GMM,Kmeans
2,0.20464252553389042,0.20464252553389042
3,0.30194986072423396,0.30176415970287834
4,0.40297121634168986,0.3916434540389972
5,0.4532961931290622,0.4064995357474466
6,0.5247910863509749,0.46220984215413186
7,0.5502321262766945,0.4976787372330548
8,0.6770659238625812,0.5441039925719592
9,0.683008356545961,0.6330547818012999
10,0.7000928505106778,0.6831940575673167
15,0.8239554317548746,0.725719591457753
20,0.8135561745589601,0.7652739090064995
25,0.8183844011142062,0.7910863509749304
30,0.8627669452181987,0.8012999071494893
35,0.8430826369545033,0.8235840297121634
40,0.8623955431754875,0.8382544103992572
