iterations,fitness,time,fevals
0,0.0337155897963,0.0147480609994,782
10,0.0454210820233,0.0252539459998,1477
20,0.0481614863421,0.0345659539998,2182
30,0.051786455778,0.0499670520003,2874
40,0.0655132118394,0.0590594040004,3569
50,0.0594670488847,0.0702779810017,4253
60,0.0605485088705,0.0788796660017,4961
70,0.0629688575898,0.0876089560024,5654
80,0.070979501831,0.0961201730024,6349
90,0.0790903527276,0.110103394001,7051
100,0.0835657713314,0.118374017,7757
110,0.08480609836,0.126421826,8462
120,0.08254653864,0.134628450001,9160
130,0.086167773356,0.144374236001,9850
140,0.0859507508806,0.152265600002,10550
150,0.0965885596272,0.160313409002,11244
160,0.100291460323,0.168038057001,11940
170,0.106808027804,0.176105619001,12641
180,0.103517362545,0.184771304002,13328
190,0.116095005194,0.192782372002,14026
200,0.108787490505,0.200581292002,14729
210,0.103576432527,0.208555620002,15412
220,0.0824503121087,0.217837602002,16104
230,0.0846428318183,0.226098744002,16800
240,0.0860958516439,0.236785567002,17502
250,0.0880716803039,0.245186561002,18192
260,0.0907156315712,0.253301531002,18878
270,0.107354288301,0.261786674002,19577
280,0.103089368549,0.275176907002,20281
290,0.100614867142,0.287772275002,20967
300,0.104026389951,0.295445170002,21669
310,0.0970719051736,0.303797966004,22374
320,0.0987382614692,0.316387408004,23065
330,0.0925708004652,0.324138130003,23763
340,0.0914779499658,0.332590482003,24469
350,0.0984658518552,0.340499624004,25158
360,0.0988898722065,0.354085412004,25871
370,0.0972472252733,0.367261916002,26569
380,0.0927073528408,0.376899849003,27274
390,0.0933487440719,0.385938868003,27948
400,0.0967452914303,0.399174632003,28650
410,0.0907411844677,0.410733357003,29339
420,0.0905512856467,0.419206253004,30037
430,0.0821903864879,0.429216730005,30736
440,0.0868827017379,0.438178317005,31413
450,0.089162989101,0.446549682005,32115
460,0.0922993130051,0.455224454005,32805
470,0.0876965502979,0.463156510004,33500
480,0.0859265483386,0.473773013005,34210
490,0.0882382858708,0.481679390006,34929
500,0.0932543746916,0.492360287006,35630
510,0.0963688596623,0.502323357005,36344
520,0.104889958057,0.510037733004,37043
530,0.0987621501757,0.518642184004,37745
540,0.0998833727612,0.526776907005,38441
550,0.103346347332,0.535718346006,39140
560,0.103715182505,0.543821068004,39833
570,0.097402781708,0.551345814005,40540
580,0.0992696580916,0.559858611005,41231
590,0.0991893071558,0.567527950005,41916
600,0.10263940431,0.576467414005,42613
610,0.0964210899042,0.584736458006,43299
620,0.095101296783,0.592729748007,43985
630,0.0869655532199,0.601839879007,44682
640,0.101652270547,0.609975786007,45381
650,0.108926158265,0.618379151007,46086
660,0.104271926011,0.626327404007,46775
670,0.0981529505184,0.634177682006,47463
680,0.0974719323602,0.642483071008,48186
690,0.0891176669744,0.650201793007,48889
700,0.0909347530451,0.660932073008,49592
710,0.0934832391498,0.669288425008,50288
720,0.0962992931994,0.677547197007,50993
730,0.0926710629275,0.689059699007,51700
740,0.0974151834994,0.697177039006,52406
750,0.0993090398256,0.708531912007,53109
760,0.102100322462,0.716615672007,53813
770,0.10261920829,0.724748024008,54528
780,0.102962616303,0.732862203007,55234
790,0.10534291117,0.745706855007,55944
800,0.0988509028767,0.754009478007,56647
810,0.0968578292747,0.763002275007,57360
820,0.101353934797,0.774123271007,58038
830,0.10741105888,0.785812367007,58727
840,0.101022810622,0.794361115006,59433
850,0.100514950056,0.802843887006,60138
860,0.101519086662,0.811437672006,60825
870,0.102639678921,0.819267012006,61516
880,0.0981392369959,0.826971117007,62223
890,0.105823937017,0.837836113007,62931
900,0.10529138663,0.846630194008,63627
910,0.105577304731,0.854962053008,64336
920,0.105188282377,0.868232582008,65044
930,0.103424254454,0.875963156008,65738
940,0.102554182313,0.883299458008,66432
950,0.103791562595,0.894985788009,67126
960,0.104611687121,0.902188954009,67825
970,0.106628493862,0.909905306009,68516
980,0.0993402766746,0.921536328009,69215
990,0.10011456279,0.929192235009,69914
1000,0.0996691847872,0.93754266201,70616
1010,0.101493068389,0.94583659401,71327
1020,0.103559440465,0.958514925009,72044
1030,0.10022143698,0.970176762008,72750
1040,0.0960283889291,0.980391486009,73430
1050,0.0958281103493,0.98886991301,74119
1060,0.096562423491,0.99709075901,74819
1070,0.0932490438526,1.00867753301,75516
1080,0.0953272976087,1.01822815701,76231
1090,0.105287299793,1.02600218801,76920
1100,0.102103446686,1.03442965101,77622
1110,0.0985235068362,1.04279153401,78340
1120,0.10507283133,1.05074136701,79048
1130,0.100264790339,1.05948843501,79743
1140,0.0997504929322,1.06750384901,80433
1150,0.103092240451,1.07598899101,81136
1160,0.106333184343,1.08350781101,81826
1170,0.106363154032,1.09235483101,82515
1180,0.103778288375,1.10558071801,83220
1190,0.0979939379756,1.11381894701,83906
1200,0.108043103125,1.121845818,84596
1210,0.103072858073,1.13409471601,85285
1220,0.102260068355,1.14136938901,85964
1230,0.106284876068,1.15345275701,86667
1240,0.10293373145,1.16127775101,87371
1250,0.105036920462,1.16847973201,88080
1260,0.104098372576,1.17619608401,88771
1270,0.104489597276,1.18524419001,89462
1280,0.103465449437,1.19262236901,90156
1290,0.10539559066,1.20022612801,90843
1300,0.110202282455,1.20984944501,91537
1310,0.110315015812,1.21734416701,92228
1320,0.110927493371,1.22956027601,92922
1330,0.109631081338,1.23832630801,93626
1340,0.107600274011,1.24615683301,94340
1350,0.105479417916,1.25331772701,95044
1360,0.106267931348,1.26217659901,95750
1370,0.106850022725,1.27391902801,96448
1380,0.105247270349,1.28570412401,97147
1390,0.107872965821,1.29348803101,97845
1400,0.102258396621,1.30134581501,98548
1410,0.100983421164,1.30857466,99257
1420,0.098660801665,1.31651817301,99937
1430,0.104540042579,1.32394138901,100636
1440,0.101848962869,1.33180470401,101337
1450,0.10882465908,1.34429538001,102030
1460,0.111874200596,1.35609904401,102720
1470,0.108281837045,1.36343653101,103410
1480,0.111186946038,1.37182132801,104115
1490,0.106067224076,1.37884632101,104814
1500,0.108828721748,1.38651447601,105505
1510,0.106686500646,1.39375635801,106207
1520,0.108361314393,1.40523646601,106890
1530,0.110764932523,1.41284378001,107599
1540,0.110235559659,1.42128704601,108293
1550,0.106395948791,1.43072349801,108996
1560,0.105433979223,1.43791915801,109690
1570,0.105863557143,1.44939294501,110399
1580,0.105997977685,1.460839078,111099
1590,0.108879700482,1.46846891101,111800
1600,0.108560013837,1.47606279401,112510
1610,0.103727834775,1.48640828401,113214
1620,0.106308872089,1.49374498101,113900
1630,0.101877870962,1.50236484001,114597
1640,0.108947676906,1.50974420401,115303
1650,0.109429655867,1.51982263201,116013
1660,0.109255648526,1.52757374901,116713
1670,0.105547205067,1.53505464401,117417
1680,0.107833067888,1.54340467601,118113
1690,0.110819843866,1.55093930001,118816
1700,0.106302144728,1.55845259001,119503
1710,0.106798824168,1.56560084301,120215
1720,0.107870192069,1.57330771301,120910
1730,0.109831968736,1.58038011301,121612
1740,0.107098619452,1.58901379901,122298
1750,0.11177759906,1.59605222401,122995
1760,0.111575101996,1.60358921701,123676
1770,0.111119952636,1.61145964201,124368
1780,0.109291280586,1.61927712901,125062
1790,0.104954487389,1.62674498701,125758
1800,0.111136528527,1.63453561001,126462
1810,0.101841340131,1.64521295201,127173
1820,0.109499830129,1.65647143001,127872
1830,0.10811255018,1.66817158801,128572
1840,0.109619590867,1.67705534801,129280
1850,0.106167687778,1.68456310701,129972
1860,0.107845925178,1.69709329001,130677
1870,0.106589942734,1.70422771501,131381
1880,0.106157985978,1.71184490701,132085
1890,0.106349227226,1.71905004801,132765
1900,0.107226407801,1.72651830101,133455
1910,0.110548285151,1.73375386201,134159
1920,0.108461351176,1.74146942401,134869
1930,0.107745488043,1.75066133301,135561
1940,0.109134680439,1.75821373401,136264
1950,0.109057194812,1.76576455501,136955
1960,0.103886391992,1.77369542501,137639
1970,0.107811364028,1.78133276501,138332
1980,0.103045910718,1.78910482101,139023
1990,0.109263207997,1.79692072801,139718
2000,0.108542951987,1.80412389401,140432
