iterations,fitness,time,fevals
0,21.0,0.001511902,474
10,23.0,0.003038422,835
20,29.0,0.00434528699999,1194
30,34.0,0.00562094299998,1560
40,34.0,0.00687091999998,1922
50,35.0,0.00809758799998,2290
60,34.0,0.00933018199999,2665
70,34.0,0.011872011,3033
80,34.0,0.013570383,3392
90,34.0,0.01479626,3759
100,35.0,0.016141842,4118
110,34.0,0.017353102,4482
120,33.0,0.01905661,4851
130,33.0,0.020901155,5223
140,33.0,0.022114391,5583
150,34.0,0.02500822,5955
160,34.0,0.026322986,6324
170,34.0,0.027691876,6690
180,34.0,0.028889704,7051
190,34.0,0.0303621,7418
200,34.0,0.031804866,7792
210,34.0,0.033239731,8159
220,33.0,0.034831831,8527
230,34.0,0.037567241,8889
240,34.0,0.039006057,9255
250,34.0,0.040446454,9618
260,34.0,0.041890406,9984
270,34.0,0.043373074,10348
280,34.0,0.044868384,10711
290,35.0,0.046304435,11077
300,34.0,0.047754313,11447
310,34.0,0.050767847,11808
320,34.0,0.052268293,12176
330,34.0,0.053667208,12528
340,34.0,0.055085086,12893
350,34.0,0.056484395,13248
360,34.0,0.05772173,13625
370,34.0,0.058945237,13987
380,34.0,0.060990079,14353
390,35.0,0.063452501,14722
400,34.0,0.064644798,15088
410,34.0,0.065852897,15450
420,34.0,0.067076799,15827
430,34.0,0.068457145,16188
440,34.0,0.070062677,16559
450,34.0,0.07128816,16930
460,34.0,0.072494285,17308
470,35.0,0.074914435,17672
480,35.0,0.076132017,18038
490,35.0,0.077543573,18408
500,34.0,0.078976068,18776
510,35.0,0.0801817970001,19140
520,36.0,0.081394637,19501
530,35.0,0.082618934,19868
540,35.0,0.08384007,20230
550,35.0,0.086838196,20597
560,36.0,0.088058148,20971
570,36.0,0.089264667,21332
580,37.0,0.090471187,21700
590,37.0,0.0916942990001,22071
600,37.0,0.0931366710001,22438
610,36.0,0.0943905970001,22807
620,36.0,0.0966685250001,23169
630,36.0,0.0997219600001,23540
640,37.0,0.10099801,23911
650,37.0,0.102231789,24279
660,37.0,0.103443839,24646
670,37.0,0.105337371,25018
680,37.0,0.107110804,25387
690,36.0,0.10832167,25746
700,37.0,0.109653029,26122
710,36.0,0.11280918,26487
720,42.0,0.114082465,26858
730,42.0,0.11529333,27219
740,42.0,0.116515257,27589
750,42.0,0.117726913,27952
760,42.0,0.11974094,28324
770,43.0,0.120973533,28691
780,42.0,0.122177682,29059
790,42.0,0.124499461,29431
800,42.0,0.125705586,29803
810,42.0,0.127186673,30171
820,42.0,0.128373439,30533
830,42.0,0.129566527,30896
840,43.0,0.130755269,31259
850,43.0,0.131947171,31618
860,43.0,0.133157641,31983
870,43.0,0.136355273,32347
880,43.0,0.137709151,32708
890,43.0,0.138929103,33082
900,44.0,0.140191722,33451
910,44.0,0.141429846,33820
920,43.0,0.142623328,34177
930,43.0,0.14381918,34548
940,43.0,0.145006342,34917
950,42.0,0.148863728,35286
960,42.0,0.150042988,35650
970,43.0,0.151247137,36017
980,43.0,0.152427583,36377
990,43.0,0.153623041,36746
1000,42.0,0.154913314,37113
1010,43.0,0.156136426,37485
1020,43.0,0.157309366,37849
1030,42.0,0.158925169,38216
1040,43.0,0.160162504,38580
1050,42.0,0.161495838,38949
1060,43.0,0.16268537,39322
1070,42.0,0.163907692,39679
1080,42.0,0.165107496,40046
1090,43.0,0.166490608,40416
1100,42.0,0.169057326,40791
1110,42.0,0.17048429,41162
1120,42.0,0.171674612,41530
1130,42.0,0.172853477,41893
1140,43.0,0.174029972,42257
1150,42.0,0.175220689,42627
1160,42.0,0.176422468,42991
1170,42.0,0.177696148,43354
1180,42.0,0.180250619,43716
1190,42.0,0.181913435,44079
1200,42.0,0.18328114,44447
1210,42.0,0.184496351,44815
1220,42.0,0.185673636,45175
1230,42.0,0.186859612,45545
1240,42.0,0.188811613,45909
1250,42.0,0.189982182,46271
1260,42.0,0.192647271,46642
1270,43.0,0.193841544,47007
1280,42.0,0.195024755,47375
1290,42.0,0.196541793,47745
1300,42.0,0.197736461,48118
1310,42.0,0.198932709,48487
1320,43.0,0.200870488,48860
1330,43.0,0.202072267,49227
1340,42.0,0.204420121,49591
1350,42.0,0.205618739,49954
1360,43.0,0.206801555,50320
1370,42.0,0.208121457,50683
1380,43.0,0.209316915,51052
1390,43.0,0.210546348,51423
1400,42.0,0.212001361,51796
1410,42.0,0.213196029,52160
1420,43.0,0.21559208,52530
1430,42.0,0.216785957,52899
1440,43.0,0.218254403,53266
1450,42.0,0.219792775,53631
1460,42.0,0.220986653,53996
1470,42.0,0.222383988,54365
1480,43.0,0.223568779,54733
1490,42.0,0.224785175,55103
1500,43.0,0.227724041,55466
1510,43.0,0.228927795,55836
1520,43.0,0.230141425,56200
1530,43.0,0.23173076,56568
1540,43.0,0.23294202,56921
1550,43.0,0.234155255,57278
1560,43.0,0.235611454,57643
1570,43.0,0.236817578,58012
1580,43.0,0.239270518,58374
1590,43.0,0.240824297,58737
1600,42.0,0.242024891,59105
1610,42.0,0.24322904,59476
1620,42.0,0.244686423,59842
1630,43.0,0.245885041,60209
1640,43.0,0.247083264,60578
1650,44.0,0.248264499,60945
1660,43.0,0.25065976,61309
1670,43.0,0.251892354,61674
1680,43.0,0.253261639,62045
1690,44.0,0.254495023,62414
1700,43.0,0.256030629,62782
1710,43.0,0.25804189,63142
1720,43.0,0.259253546,63512
1730,44.0,0.260545794,63877
1740,44.0,0.263322685,64247
1750,45.0,0.264549353,64610
1760,44.0,0.265762193,64976
1770,45.0,0.267119231,65339
1780,45.0,0.26835617,65714
1790,45.0,0.269595085,66079
1800,45.0,0.271308865,66452
1810,45.0,0.272814052,66815
1820,45.0,0.275154399,67173
1830,45.0,0.276377116,67544
1840,45.0,0.277606549,67911
1850,44.0,0.278817414,68277
1860,45.0,0.280294155,68642
1870,44.0,0.2815386,69013
1880,44.0,0.282775539,69386
1890,45.0,0.284126651,69757
1900,45.0,0.286501764,70120
1910,45.0,0.287753715,70491
1920,45.0,0.289295643,70863
1930,45.0,0.290537719,71226
1940,45.0,0.291763596,71586
1950,45.0,0.293331992,71955
1960,46.0,0.294610808,72324
1970,46.0,0.295834315,72690
1980,46.0,0.298391551,73055
1990,46.0,0.299609922,73420
2000,45.0,0.301505824,73786
2010,46.0,0.302714319,74148
2020,45.0,0.303951653,74520
2030,46.0,0.30517121,74885
2040,45.0,0.306457137,75252
2050,45.0,0.307703953,75621
2060,45.0,0.311114128,75993
2070,45.0,0.312570722,76358
2080,45.0,0.314265143,76728
2090,45.0,0.315892009,77099
2100,45.0,0.317189393,77464
2110,46.0,0.318470975,77825
2120,45.0,0.319748211,78186
2130,44.0,0.321018335,78552
2140,44.0,0.323384362,78922
2150,45.0,0.324627227,79284
2160,45.0,0.326061697,79654
2170,45.0,0.327398192,80021
2180,45.0,0.328627625,80387
2190,45.0,0.329864565,80757
2200,45.0,0.331062393,81116
2210,45.0,0.332262196,81481
2220,44.0,0.334561457,81853
2230,44.0,0.335788125,82224
2240,44.0,0.338074349,82594
2250,44.0,0.339391091,82968
2260,44.0,0.340616179,83336
2270,44.0,0.34189855,83699
2280,44.0,0.343152872,84068
2290,44.0,0.344612231,84438
2300,44.0,0.347062406,84805
2310,44.0,0.348288679,85171
2320,44.0,0.349511001,85535
2330,44.0,0.350734904,85902
2340,44.0,0.351948139,86267
2350,44.0,0.353147547,86628
2360,44.0,0.354596635,87005
2370,45.0,0.355896784,87377
2380,44.0,0.35826439,87746
2390,44.0,0.359746663,88107
2400,44.0,0.361211553,88470
2410,44.0,0.362423604,88838
2420,44.0,0.363632494,89206
2430,45.0,0.364906569,89572
2440,44.0,0.366766916,89938
2450,44.0,0.368927906,90308
2460,44.0,0.371261537,90672
2470,44.0,0.372451859,91035
2480,45.0,0.373974428,91397
2490,44.0,0.375165145,91766
2500,45.0,0.376360997,92135
2510,45.0,0.37756317,92492
2520,45.0,0.378768504,92862
2530,45.0,0.379976209,93234
2540,44.0,0.382229248,93600
2550,45.0,0.383658188,93965
2560,45.0,0.384902633,94337
2570,45.0,0.386118239,94702
2580,45.0,0.387346092,95073
2590,46.0,0.38857513,95443
2600,45.0,0.389814834,95810
2610,45.0,0.391050588,96171
2620,46.0,0.394189751,96535
2630,46.0,0.395400221,96897
2640,46.0,0.396623333,97271
2650,45.0,0.397825506,97631
2660,44.0,0.399042297,98006
2670,44.0,0.400259483,98375
2680,45.0,0.401460867,98742
2690,44.0,0.402788275,99105
2700,44.0,0.405155487,99467
2710,44.0,0.406421661,99840
2720,44.0,0.407660576,100206
2730,44.0,0.408890799,100581
2740,44.0,0.410617221,100942
2750,45.0,0.41226384,101316
2760,44.0,0.413754804,101682
2770,44.0,0.41496804,102053
2780,44.0,0.417502363,102428
2790,44.0,0.418706512,102792
2800,45.0,0.419920143,103163
2810,44.0,0.421267304,103530
2820,44.0,0.422479355,103904
2830,44.0,0.423791356,104268
2840,45.0,0.425007752,104631
2850,45.0,0.426375852,104998
2860,45.0,0.429424545,105366
2870,44.0,0.43149546,105730
2880,45.0,0.43270277,106099
2890,45.0,0.433920746,106463
2900,45.0,0.435281735,106836
2910,45.0,0.436531316,107200
2920,45.0,0.437730725,107563
2930,45.0,0.440067912,107928
2940,45.0,0.44237784,108298
2950,45.0,0.443584754,108666
2960,45.0,0.444872656,109028
2970,45.0,0.44626683,109393
2980,46.0,0.447473745,109761
2990,46.0,0.44922703,110136
3000,47.0,0.450431969,110497
3010,48.0,0.451644019,110867
3020,47.0,0.453977255,111239
3030,45.0,0.455181799,111605
3040,45.0,0.456387133,111972
3050,46.0,0.457596813,112343
3060,45.0,0.45881479,112714
3070,45.0,0.460060421,113084
3080,46.0,0.461273261,113448
3090,46.0,0.462838892,113820
3100,46.0,0.465292227,114187
3110,48.0,0.466532327,114554
3120,47.0,0.467817464,114911
3130,46.0,0.469022798,115278
3140,46.0,0.47030912,115648
3150,46.0,0.47177401,116017
3160,46.0,0.472993961,116381
3170,47.0,0.474503888,116751
3180,48.0,0.476974211,117117
3190,50.0,0.478360089,117491
3200,47.0,0.479589127,117864
3210,47.0,0.481379153,118236
3220,48.0,0.482641377,118604
3230,46.0,0.483951008,118973
3240,46.0,0.485236145,119335
3250,48.0,0.486465183,119708
3260,48.0,0.489291852,120077
3270,48.0,0.490554076,120444
3280,49.0,0.491762176,120804
3290,48.0,0.493130671,121165
3300,48.0,0.494533931,121525
3310,48.0,0.495765735,121894
3320,48.0,0.497078921,122265
3330,48.0,0.498306378,122632
3340,48.0,0.500618676,123004
3350,48.0,0.501924356,123372
3360,47.0,0.503344604,123736
3370,48.0,0.504930384,124103
3380,47.0,0.506225397,124466
3390,47.0,0.507427175,124830
3400,48.0,0.508641201,125197
3410,46.0,0.509863523,125564
3420,47.0,0.512404562,125925
3430,47.0,0.513639526,126298
3440,48.0,0.514850786,126662
3450,47.0,0.516085355,127025
3460,46.0,0.517307281,127394
3470,48.0,0.518547381,127763
3480,48.0,0.519744419,128129
3490,48.0,0.52325652,128494
3500,48.0,0.524535336,128855
3510,48.0,0.525734745,129220
3520,47.0,0.527053858,129595
3530,47.0,0.528341365,129965
3540,48.0,0.529547489,130335
3550,48.0,0.530740181,130699
3560,47.0,0.531944726,131070
3570,48.0,0.534193419,131443
3580,48.0,0.536608828,131816
3590,48.0,0.537831941,132183
3600,48.0,0.539043991,132551
3610,48.0,0.540257227,132923
3620,48.0,0.541474413,133293
3630,48.0,0.542681327,133659
3640,48.0,0.544380488,134027
3650,48.0,0.546990268,134389
3660,48.0,0.54818059,134754
3670,50.0,0.549378418,135121
3680,48.0,0.550572295,135487
3690,49.0,0.551772889,135856
3700,48.0,0.552979013,136226
3710,48.0,0.555212694,136591
3720,48.0,0.556494275,136957
3730,48.0,0.558788005,137325
3740,48.0,0.559977537,137695
3750,49.0,0.561154822,138054
3760,48.0,0.562537539,138426
3770,48.0,0.563738528,138791
3780,48.0,0.564982973,139155
3790,48.0,0.566225838,139517
3800,49.0,0.567438678,139886
3810,49.0,0.569785741,140250
3820,49.0,0.571384952,140609
3830,49.0,0.572695372,140976
3840,48.0,0.573898336,141344
3850,49.0,0.575216263,141698
3860,48.0,0.576440955,142069
3870,48.0,0.577641944,142436
3880,48.0,0.57888876,142804
3890,49.0,0.581144564,143173
3900,49.0,0.582355429,143541
3910,49.0,0.583576171,143918
3920,49.0,0.585090839,144286
3930,49.0,0.586301309,144656
3940,49.0,0.587733409,145027
3950,49.0,0.588953361,145394
3960,49.0,0.590246003,145761
3970,49.0,0.592698154,146133
3980,49.0,0.593922451,146503
3990,49.0,0.595250255,146878
4000,49.0,0.596626256,147249
4010,49.0,0.597998306,147614
4020,49.0,0.599206801,147984
4030,49.0,0.600512481,148351
4040,49.0,0.601721371,148712
4050,49.0,0.60407278,149079
4060,50.0,0.605485127,149444
4070,49.0,0.606822412,149817
4080,49.0,0.608078315,150187
4090,50.0,0.609291156,150559
4100,50.0,0.610621725,150929
4110,50.0,0.611827059,151292
4120,57.0,0.613783406,151657
4130,65.0,0.616667754,152021
4140,62.0,0.617990027,152393
4150,65.0,0.61953946,152760
4160,66.0,0.620791411,153125
4170,63.0,0.622068647,153491
4180,58.0,0.623272006,153857
4190,59.0,0.624663809,154223
4200,59.0,0.625928007,154591
4210,59.0,0.628793787,154954
4220,58.0,0.629976207,155320
4230,58.0,0.63117364,155682
4240,58.0,0.632344208,156046
4250,58.0,0.633654629,156416
4260,58.0,0.634887222,156783
4270,58.0,0.63611231,157140
4280,60.0,0.637385595,157508
4290,60.0,0.639747276,157875
4300,59.0,0.640939969,158250
4310,58.0,0.642165847,158614
4320,58.0,0.643327724,158979
4330,58.0,0.644479724,159336
4340,58.0,0.645650688,159709
4350,59.0,0.646965454,160080
4360,58.0,0.648164862,160448
4370,58.0,0.650526543,160815
4380,58.0,0.652206347,161181
4390,59.0,0.653401804,161549
4400,58.0,0.654571188,161910
4410,59.0,0.655768226,162274
4420,59.0,0.656950647,162636
4430,58.0,0.658324673,163001
4440,58.0,0.659541859,163370
4450,58.0,0.66193633,163735
4460,58.0,0.663132183,164101
4470,58.0,0.664569419,164470
4480,58.0,0.665748284,164834
4490,58.0,0.667397668,165204
4500,60.0,0.668649224,165569
4510,60.0,0.66983599,165936
4520,58.0,0.671036189,166300
4530,58.0,0.673401821,166666
4540,60.0,0.674587797,167030
4550,60.0,0.676274712,167400
4560,58.0,0.677898812,167764
4570,58.0,0.679108492,168133
4580,60.0,0.680306715,168498
4590,60.0,0.681484,168854
4600,60.0,0.682645878,169215
4610,60.0,0.685633337,169585
4620,60.0,0.686819709,169950
4630,59.0,0.687979216,170309
4640,59.0,0.689152945,170681
4650,66.0,0.690549884,171053
4660,65.0,0.691733885,171423
4670,72.0,0.692904059,171784
4680,72.0,0.694274529,172147
4690,72.0,0.696657148,172513
4700,72.0,0.697812704,172867
4710,73.0,0.699065841,173235
4720,72.0,0.700226533,173598
4730,73.0,0.701383275,173962
4740,72.0,0.702672758,174325
4750,72.0,0.703838191,174690
4760,72.0,0.705015081,175056
4770,72.0,0.707817651,175420
4780,72.0,0.708996516,175788
4790,72.0,0.710154048,176146
4800,72.0,0.711328567,176513
4810,72.0,0.712519284,176880
4820,72.0,0.713710001,177256
4830,72.0,0.715110101,177624
4840,72.0,0.716296867,177990
4850,72.0,0.718664079,178355
4860,72.0,0.719872969,178721
4870,72.0,0.721060525,179079
4880,72.0,0.722795637,179445
4890,72.0,0.723983589,179812
4900,72.0,0.725387639,180185
4910,72.0,0.726581121,180556
4920,72.0,0.7277588,180921
4930,73.0,0.73065895,181283
4940,72.0,0.732104877,181648
4950,72.0,0.733273075,182020
4960,72.0,0.734536484,182387
4970,72.0,0.735713769,182755
4980,72.0,0.736901721,183122
4990,73.0,0.738374117,183485
5000,72.0,0.739552982,183851
