[
  {
    "conditions": {
      "all": [
        {
          "fact": "askForLocationOptions",
          "operator": "equal",
          "value": "AMA"
        }
      ]
    },
    "event": {
      "type": "askForLocationOptions",
      "params": {
        "classes": ["ve"]
      }
    }
  },
  {
    "conditions": {
      "all": [
        {
          "fact": "askForLocationOptions",
          "operator": "equal",
          "value": "ANZ"
        }
      ]
    },
    "event": {
      "type": "askForLocationOptions",
      "params": {
        "classes": ["ve"]
      }
    }
  },
  {
    "conditions": {
      "all": [
        {
          "fact": "askForLocationOptions",
          "operator": "equal",
          "value": "APU"
        }
      ]
    },
    "event": {
      "type": "askForLocationOptions",
      "params": {
        "classes": ["ve"]
      }
    }
  },
  {
    "conditions": {
      "all": [
        {
          "fact": "askForLocationOptions",
          "operator": "equal",
          "value": "ARA"
        }
      ]
    },
    "event": {
      "type": "askForLocationOptions",
      "params": {
        "classes": ["ve"]
      }
    }
  },
  {
    "conditions": {
      "all": [
        {
          "fact": "askForLocationOptions",
          "operator": "equal",
          "value": "BAR"
        }
      ]
    },
    "event": {
      "type": "askForLocationOptions",
      "params": {
        "classes": ["ve"]
      }
    }
  },
  {
    "conditions": {
      "all": [
        {
          "fact": "askForLocationOptions",
          "operator": "equal",
          "value": "BOL"
        }
      ]
    },
    "event": {
      "type": "askForLocationOptions",
      "params": {
        "classes": ["ve"]
      }
    }
  },
  {
    "conditions": {
      "all": [
        {
          "fact": "askForLocationOptions",
          "operator": "equal",
          "value": "CAR"
        }
      ]
    },
    "event": {
      "type": "askForLocationOptions",
      "params": {
        "classes": ["ve"]
      }
    }
  },
  {
    "conditions": {
      "all": [
        {
          "fact": "askForLocationOptions",
          "operator": "equal",
          "value": "COJ"
        }
      ]
    },
    "event": {
      "type": "askForLocationOptions",
      "params": {
        "classes": ["ve"]
      }
    }
  },
  {
    "conditions": {
      "all": [
        {
          "fact": "askForLocationOptions",
          "operator": "equal",
          "value": "DAM"
        }
      ]
    },
    "event": {
      "type": "askForLocationOptions",
      "params": {
        "classes": ["ve"]
      }
    }
  },
  {
    "conditions": {
      "all": [
        {
          "fact": "askForLocationOptions",
          "operator": "equal",
          "value": "DTC"
        }
      ]
    },
    "event": {
      "type": "askForLocationOptions",
      "params": {
        "classes": ["ve"]
      }
    }
  },
  {
    "conditions": {
      "all": [
        {
          "fact": "askForLocationOptions",
          "operator": "equal",
          "value": "FAL"
        }
      ]
    },
    "event": {
      "type": "askForLocationOptions",
      "params": {
        "classes": ["ve"]
      }
    }
  },
  {
    "conditions": {
      "all": [
        {
          "fact": "askForLocationOptions",
          "operator": "equal",
          "value": "GUA"
        }
      ]
    },
    "event": {
      "type": "askForLocationOptions",
      "params": {
        "classes": ["ve"]
      }
    }
  },
  {
    "conditions": {
      "all": [
        {
          "fact": "askForLocationOptions",
          "operator": "equal",
          "value": "LAR"
        }
      ]
    },
    "event": {
      "type": "askForLocationOptions",
      "params": {
        "classes": ["ve"]
      }
    }
  },
  {
    "conditions": {
      "all": [
        {
          "fact": "askForLocationOptions",
          "operator": "equal",
          "value": "MER"
        }
      ]
    },
    "event": {
      "type": "askForLocationOptions",
      "params": {
        "classes": ["ve"]
      }
    }
  },
  {
    "conditions": {
      "all": [
        {
          "fact": "askForLocationOptions",
          "operator": "equal",
          "value": "MIR"
        }
      ]
    },
    "event": {
      "type": "askForLocationOptions",
      "params": {
        "classes": ["ve"]
      }
    }
  },
  {
    "conditions": {
      "all": [
        {
          "fact": "askForLocationOptions",
          "operator": "equal",
          "value": "MON"
        }
      ]
    },
    "event": {
      "type": "askForLocationOptions",
      "params": {
        "classes": ["ve"]
      }
    }
  },
  {
    "conditions": {
      "all": [
        {
          "fact": "askForLocationOptions",
          "operator": "equal",
          "value": "NEP"
        }
      ]
    },
    "event": {
      "type": "askForLocationOptions",
      "params": {
        "classes": ["ve"]
      }
    }
  },
  {
    "conditions": {
      "all": [
        {
          "fact": "askForLocationOptions",
          "operator": "equal",
          "value": "POR"
        }
      ]
    },
    "event": {
      "type": "askForLocationOptions",
      "params": {
        "classes": ["ve"]
      }
    }
  },
  {
    "conditions": {
      "all": [
        {
          "fact": "askForLocationOptions",
          "operator": "equal",
          "value": "SUC"
        }
      ]
    },
    "event": {
      "type": "askForLocationOptions",
      "params": {
        "classes": ["ve"]
      }
    }
  },
  {
    "conditions": {
      "all": [
        {
          "fact": "askForLocationOptions",
          "operator": "equal",
          "value": "TAC"
        }
      ]
    },
    "event": {
      "type": "askForLocationOptions",
      "params": {
        "classes": ["ve"]
      }
    }
  },
  {
    "conditions": {
      "all": [
        {
          "fact": "askForLocationOptions",
          "operator": "equal",
          "value": "TRU"
        }
      ]
    },
    "event": {
      "type": "askForLocationOptions",
      "params": {
        "classes": ["ve"]
      }
    }
  },
  {
    "conditions": {
      "all": [
        {
          "fact": "askForLocationOptions",
          "operator": "equal",
          "value": "VAR"
        }
      ]
    },
    "event": {
      "type": "askForLocationOptions",
      "params": {
        "classes": ["ve"]
      }
    }
  },
  {
    "conditions": {
      "all": [
        {
          "fact": "askForLocationOptions",
          "operator": "equal",
          "value": "YAR"
        }
      ]
    },
    "event": {
      "type": "askForLocationOptions",
      "params": {
        "classes": ["ve"]
      }
    }
  },
  {
    "conditions": {
      "all": [
        {
          "fact": "askForLocationOptions",
          "operator": "equal",
          "value": "ZUL"
        }
      ]
    },
    "event": {
      "type": "askForLocationOptions",
      "params": {
        "classes": ["ve"]
      }
    }
  },
  {
    "conditions": {
      "any": [
        {
          "fact": "askHasRangeOptions",
          "operator": "equal",
          "value": true
        },
        {
          "fact": "askHasImmuneDecreasedOptions",
          "operator": "equal",
          "value": true
        },
        {
          "fact": "askHasImmuneDecreased2Options",
          "operator": "equal",
          "value": ["yes", "maybe"]
        },
        {
          "fact": "askHasChronicLungDiseaseOptions",
          "operator": "equal",
          "value": true
        }
      ]
    },
    "event": {
      "type": "classification",
      "params": {
        "classes": ["elevated-medical-risk"]
      }
    }
  },
  {
    "conditions": {
      "any": [
        {
          "fact": "intro4",
          "operator": "equal",
          "value": true
        }
      ]
    },
    "event": {
      "type": "classification",
      "params": {
        "classes": ["common"]
      }
    }
  },
  {
    "conditions": {
      "all": [
        {
          "any": [
            {
              "fact": "askHasFeverOptions",
              "operator": "equal",
              "value": true
            },
            {
              "fact": "askHasCoughOptions",
              "operator": "equal",
              "value": true
            },
            {
              "fact": "askHasDifficultyBreathingOptions",
              "operator": "equal",
              "value": true
            }
          ]
        },
        {
          "any": [
            {
              "fact": "askHasHadContactOptions",
              "operator": "equal",
              "value": true
            },
            {
              "fact": "askTraveledAffectedAreasOptions",
              "operator": "equal",
              "value": true
            }
          ]
        }
      ]
    },
    "event": {
      "type": "classification",
      "params": {
        "classes": ["elevated-covid-risk"]
      }
    }
  }
]
