[
    {
        "type": "INTEGER",
        "name": "submission_id",
        "mode": "REQUIRED"
    },
    {
        "type": "INTEGER",
        "name": "observation_id",
        "mode": "REQUIRED"
    },
    {
        "type": "TIMESTAMP",
        "name": "observed_time",
        "mode": "REQUIRED"
    },
    {
        "type": "INTEGER",
        "name": "user_id",
        "mode": "REQUIRED"
    },
    {
        "type": "INTEGER",
        "name": "form_id",
        "mode": "REQUIRED"
    },
    {
        "type": "INTEGER",
        "name": "form_version",
        "mode": "REQUIRED"
    },
    {
        "type": "STRING",
        "name": "form_name",
        "mode": "REQUIRED"
    },
    {
        "type": "INTEGER",
        "name": "form_tier",
        "mode": "REQUIRED"
    },
    {
        "type": "INTEGER",
        "name": "campaign_id",
        "mode": "REQUIRED"
    },
    {
        "type": "STRING",
        "name": "campaign_name",
        "mode": "REQUIRED"
    },
    {
        "type": "INTEGER",
        "name": "project_id",
        "mode": "REQUIRED"
    },
    {
        "type": "STRING",
        "name": "project_name",
        "mode": "REQUIRED"
    },
    {
        "type": "STRING",
        "name": "organization_id",
        "mode": "REQUIRED"
    },
    {
        "type": "STRING",
        "name": "gender",
        "mode": "NULLABLE"
    },
    {
        "type": "STRING",
        "name": "age",
        "mode": "NULLABLE"
    },
    {
        "type": "STRING",
        "name": "geography",
        "mode": "NULLABLE"
    },
    {
        "type": "STRING",
        "name": "financial_situation",
        "mode": "NULLABLE"
    },
    {
        "type": "STRING",
        "name": "education",
        "mode": "NULLABLE"
    },
    {
        "type": "STRING",
        "name": "employment_status",
        "mode": "NULLABLE"
    },
    {
        "type": "STRING",
        "name": "ethnicity",
        "mode": "NULLABLE"
    },
    {
        "type": "STRING",
        "name": "religion",
        "mode": "NULLABLE"
    },
    {
        "type": "DATE",
        "name": "batch_date",
        "mode": "NULLABLE"
    },
    {
        "type": "STRING",
        "name": "location_feature_id",
        "mode": "NULLABLE"
    },
    {
        "type": "STRING",
        "name": "location_feature_name",
        "mode": "NULLABLE"
    },
    {
        "type": "FLOAT",
        "name": "observation_lat",
        "mode": "NULLABLE"
    },
    {
        "type": "FLOAT",
        "name": "observation_lon",
        "mode": "NULLABLE"
    },
    {
        "type": "STRING",
        "name": "HASC_code",
        "mode": "NULLABLE"
    },
    {
        "type": "STRING",
        "name": "L0_name",
        "mode": "NULLABLE"
    },
    {
        "type": "STRING",
        "name": "L1_name",
        "mode": "NULLABLE"
    },
    {
        "type": "STRING",
        "name": "L2_name",
        "mode": "NULLABLE"
    },
    {
        "type": "STRING",
        "name": "_1_",
        "mode": "NULLABLE",
        "description": "who_is_the_head_of_your_household"
    },
    {
        "type": "STRING",
        "name": "_2_",
        "mode": "NULLABLE",
        "description": "what_is_the_employment_situation_of_the_head_of_your_household"
    },
    {
        "type": "STRING",
        "name": "_3_",
        "mode": "NULLABLE",
        "description": "what_is_the_situation_currently_in_your_community"
    },
    {
        "type": "STRING",
        "name": "_4_",
        "mode": "NULLABLE",
        "description": "how_would_you_describe_the_current_economic_situation_in_your_family_currently"
    },
    {
        "type": "STRING",
        "name": "_5_",
        "mode": "NULLABLE",
        "description": "if_you_compared_your_personal_and_familial_economic_situation_with_3_months_ago_would_you_say_it_is"
    },
    {
        "type": "STRING",
        "name": "_6_",
        "mode": "NULLABLE",
        "description": "what_is_the_monthly_income_of_your_family_taking_into_account_all_the_payments_excluding_remittances_from_abroad_and_state_aid_received_by_those_who_live_in_this_house"
    },
    {
        "type": "STRING",
        "name": "_7_",
        "mode": "NULLABLE",
        "description": "how_much_does_your_household_spend_monthly_on_buying_food"
    },
    {
        "type": "STRING",
        "name": "_8_",
        "mode": "NULLABLE",
        "description": "in_your_close_family_that_is_father_mother_partner_children_or_siblings_is_there_someone_who_has_moved_outside_of_venezuela"
    },
    {
        "type": "STRING",
        "name": "_9_",
        "mode": "NULLABLE",
        "description": "adding_up_all_those_who_have_left_how_many_are_there_in_all_count_only_father_mother_partner_children_or_siblings"
    },
    {
        "type": "STRING",
        "name": "_10_",
        "mode": "NULLABLE",
        "description": "have_any_of_the_people_in_your_close_family_that_is_father_mother_partner_children_or_siblings_who_have_left_the_country_managed_to_help_you_or_those_who_live_in_this_household_financially"
    },
    {
        "type": "STRING",
        "name": "_11_",
        "mode": "NULLABLE",
        "description": "approximately_how_many_dollars_is_this_financial_aid_that_you_receive_from_family_members_abroad"
    },
    {
        "type": "STRING",
        "name": "_12_",
        "mode": "NULLABLE",
        "description": "of_that_financial_aid_that_you_receive_from_family_members_living_abroad_how_much_do_you_spend_to_buy_the_food_that_you_consume_in_this_household"
    },
    {
        "type": "STRING",
        "name": "_13_",
        "mode": "NULLABLE",
        "description": "currently_do_you_or_someone_in_this_household_receive_money_through_the_missions_pensions_or_bonds_of_the_national_card_from_the_government"
    },
    {
        "type": "STRING",
        "name": "_14_",
        "mode": "NULLABLE",
        "description": "how_often_do_you_receive_financial_assistance_from_the_government"
    },
    {
        "type": "STRING",
        "name": "_15_",
        "mode": "NULLABLE",
        "description": "of_the_financial_aid_that_you_receive_from_the_government_how_much_do_you_spend_to_buy_the_food_that_you_consume_in_this_household"
    },
    {
        "type": "STRING",
        "name": "_16_",
        "mode": "NULLABLE",
        "description": "have_you_had_the_opportunity_to_purchase_the_food_boxes_distributed_by_the_clap"
    },
    {
        "type": "STRING",
        "name": "_17_",
        "mode": "NULLABLE",
        "description": "in_the_last_year_how_often_have_you_received_the_clap_food_boxes"
    },
    {
        "type": "STRING",
        "name": "_18_",
        "mode": "NULLABLE",
        "description": "in_your_opinion_do_the_clap_boxes_contain_enough_food_for_your_family_to_eat_properly"
    },
    {
        "type": "STRING",
        "name": "_19_",
        "mode": "NULLABLE",
        "description": "have_you_received_any_food_in_poor_condition_in_the_clap_bags_or_boxes"
    },
    {
        "type": "STRING",
        "name": "_20_",
        "mode": "NULLABLE",
        "description": "thank_you_for_participating_in_this_survey"
    }
]
