[
    {
        "type": "INTEGER",
        "name": "submission_id",
        "mode": "REQUIRED"
    },
    {
        "type": "INTEGER",
        "name": "observation_id",
        "mode": "REQUIRED"
    },
    {
        "type": "TIMESTAMP",
        "name": "observed_time",
        "mode": "REQUIRED"
    },
    {
        "type": "INTEGER",
        "name": "user_id",
        "mode": "REQUIRED"
    },
    {
        "type": "INTEGER",
        "name": "form_id",
        "mode": "REQUIRED"
    },
    {
        "type": "INTEGER",
        "name": "form_version",
        "mode": "REQUIRED"
    },
    {
        "type": "STRING",
        "name": "form_name",
        "mode": "REQUIRED"
    },
    {
        "type": "INTEGER",
        "name": "form_tier",
        "mode": "REQUIRED"
    },
    {
        "type": "INTEGER",
        "name": "campaign_id",
        "mode": "REQUIRED"
    },
    {
        "type": "STRING",
        "name": "campaign_name",
        "mode": "REQUIRED"
    },
    {
        "type": "INTEGER",
        "name": "project_id",
        "mode": "REQUIRED"
    },
    {
        "type": "STRING",
        "name": "project_name",
        "mode": "REQUIRED"
    },
    {
        "type": "STRING",
        "name": "organization_id",
        "mode": "REQUIRED"
    },
    {
        "type": "STRING",
        "name": "gender",
        "mode": "NULLABLE"
    },
    {
        "type": "STRING",
        "name": "age",
        "mode": "NULLABLE"
    },
    {
        "type": "STRING",
        "name": "geography",
        "mode": "NULLABLE"
    },
    {
        "type": "STRING",
        "name": "financial_situation",
        "mode": "NULLABLE"
    },
    {
        "type": "STRING",
        "name": "education",
        "mode": "NULLABLE"
    },
    {
        "type": "STRING",
        "name": "employment_status",
        "mode": "NULLABLE"
    },
    {
        "type": "STRING",
        "name": "ethnicity",
        "mode": "NULLABLE"
    },
    {
        "type": "STRING",
        "name": "religion",
        "mode": "NULLABLE"
    },
    {
        "type": "DATE",
        "name": "batch_date",
        "mode": "NULLABLE"
    },
    {
        "type": "STRING",
        "name": "location_feature_id",
        "mode": "NULLABLE"
    },
    {
        "type": "STRING",
        "name": "location_feature_name",
        "mode": "NULLABLE"
    },
    {
        "type": "FLOAT",
        "name": "observation_lat",
        "mode": "NULLABLE"
    },
    {
        "type": "FLOAT",
        "name": "observation_lon",
        "mode": "NULLABLE"
    },
    {
        "type": "STRING",
        "name": "HASC_code",
        "mode": "NULLABLE"
    },
    {
        "type": "STRING",
        "name": "L0_name",
        "mode": "NULLABLE"
    },
    {
        "type": "STRING",
        "name": "L1_name",
        "mode": "NULLABLE"
    },
    {
        "type": "STRING",
        "name": "L2_name",
        "mode": "NULLABLE"
    },
    {
        "name": "_1_",
        "type": "STRING",
        "description": "please_go_and_locate_a_public_water_access_point_in_your_community",
        "mode": "NULLABLE"
    },
    {
        "name": "_2_",
        "type": "STRING",
        "description": "private_or_indoor_water_access_points_will_be_rejected",
        "mode": "NULLABLE"
    },
    {
        "name": "_3_",
        "type": "STRING",
        "description": "this_data_will_be_sent_to_venezuelan_ngos_so_they_can_better_serve_the_needs_of_your_community",
        "mode": "NULLABLE"
    },
    {
        "name": "_4_",
        "type": "STRING",
        "description": "please_take_a_photo_of_the_public_water_access_point",
        "mode": "NULLABLE"
    },
    {
        "name": "_5_",
        "type": "STRING",
        "description": "please_record_the_location_of_this_public_water_access_point",
        "mode": "NULLABLE"
    },
    {
        "name": "_6_",
        "type": "STRING",
        "description": "please_take_a_photo_of_the_surrounding_area_so_we_can_ensure_that_it_is_indeed_a_public_area",
        "mode": "NULLABLE"
    },
    {
        "name": "_7_",
        "type": "STRING",
        "description": "how_many_people_in_your_live_in_your_household",
        "mode": "NULLABLE"
    },
    {
        "name": "_8_",
        "type": "STRING",
        "description": "how_many_females_live_in_your_household",
        "mode": "NULLABLE"
    },
    {
        "name": "_9_",
        "type": "STRING",
        "description": "how_many_males_are_living_in_your_household",
        "mode": "NULLABLE"
    },
    {
        "name": "_10_",
        "type": "STRING",
        "description": "have_you_had_an_uninterrupted_supply_of_water_in_the_last_24_hours_in_your_home",
        "mode": "NULLABLE"
    },
    {
        "name": "_11_",
        "type": "STRING",
        "description": "how_many_days_have_you_had_water_service_in_the_last_week",
        "mode": "NULLABLE"
    },
    {
        "name": "_12_",
        "type": "STRING",
        "description": "in_the_last_week_how_many_days_have_you_had_to_get_water_from_a_public_access_point_because_your_did_not_have_access_to_water_in_your_house",
        "mode": "NULLABLE"
    },
    {
        "name": "_13_",
        "type": "STRING",
        "description": "on_average_how_long_does_it_take_you_to_get_water",
        "mode": "NULLABLE"
    },
    {
        "name": "_14_",
        "type": "STRING",
        "description": "using_the_last_7_days_as_a_reference_on_average_how_far_have_you_had_to_go_every_time_you_needed_to_bring_water_back_to_your_house",
        "mode": "NULLABLE"
    },
    {
        "name": "_15_",
        "type": "STRING",
        "description": "how_do_you_make_your_water_potable_in_your_household",
        "mode": "NULLABLE"
    },
    {
        "name": "_16_",
        "type": "STRING",
        "description": "for_how_long_do_you_have_water_available_at_your_house_each_day",
        "mode": "NULLABLE"
    },
    {
        "name": "_17_",
        "type": "STRING",
        "description": "using_the_last_month_as_a_reference_point_how_often_do_you_have_running_water_in_your_household",
        "mode": "NULLABLE"
    },
    {
        "name": "_18_",
        "type": "STRING",
        "description": "what_is_the_primary_way_your_typically_get_drinkable_water_in_your_area",
        "mode": "NULLABLE"
    }
]
