[
    {
        "type": "INTEGER",
        "name": "submission_id",
        "mode": "REQUIRED"
    },
    {
        "type": "INTEGER",
        "name": "observation_id",
        "mode": "REQUIRED"
    },
    {
        "type": "TIMESTAMP",
        "name": "observed_time",
        "mode": "REQUIRED"
    },
    {
        "type": "INTEGER",
        "name": "user_id",
        "mode": "REQUIRED"
    },
    {
        "type": "INTEGER",
        "name": "form_id",
        "mode": "REQUIRED"
    },
    {
        "type": "INTEGER",
        "name": "form_version",
        "mode": "REQUIRED"
    },
    {
        "type": "STRING",
        "name": "form_name",
        "mode": "REQUIRED"
    },
    {
        "type": "INTEGER",
        "name": "form_tier",
        "mode": "REQUIRED"
    },
    {
        "type": "INTEGER",
        "name": "campaign_id",
        "mode": "REQUIRED"
    },
    {
        "type": "STRING",
        "name": "campaign_name",
        "mode": "REQUIRED"
    },
    {
        "type": "INTEGER",
        "name": "project_id",
        "mode": "REQUIRED"
    },
    {
        "type": "STRING",
        "name": "project_name",
        "mode": "REQUIRED"
    },
    {
        "type": "STRING",
        "name": "organization_id",
        "mode": "REQUIRED"
    },
    {
        "type": "STRING",
        "name": "gender",
        "mode": "NULLABLE"
    },
    {
        "type": "STRING",
        "name": "age",
        "mode": "NULLABLE"
    },
    {
        "type": "STRING",
        "name": "geography",
        "mode": "NULLABLE"
    },
    {
        "type": "STRING",
        "name": "financial_situation",
        "mode": "NULLABLE"
    },
    {
        "type": "STRING",
        "name": "education",
        "mode": "NULLABLE"
    },
    {
        "type": "STRING",
        "name": "employment_status",
        "mode": "NULLABLE"
    },
    {
        "type": "STRING",
        "name": "ethnicity",
        "mode": "NULLABLE"
    },
    {
        "type": "STRING",
        "name": "religion",
        "mode": "NULLABLE"
    },
    {
        "type": "DATE",
        "name": "batch_date",
        "mode": "NULLABLE"
    },
    {
        "type": "STRING",
        "name": "location_feature_id",
        "mode": "NULLABLE"
    },
    {
        "type": "STRING",
        "name": "location_feature_name",
        "mode": "NULLABLE"
    },
    {
        "type": "FLOAT",
        "name": "observation_lat",
        "mode": "NULLABLE"
    },
    {
        "type": "FLOAT",
        "name": "observation_lon",
        "mode": "NULLABLE"
    },
    {
        "type": "STRING",
        "name": "HASC_code",
        "mode": "NULLABLE"
    },
    {
        "type": "STRING",
        "name": "L0_name",
        "mode": "NULLABLE"
    },
    {
        "type": "STRING",
        "name": "L1_name",
        "mode": "NULLABLE"
    },
    {
        "type": "STRING",
        "name": "L2_name",
        "mode": "NULLABLE"
    },
    {
        "name": "_1_",
        "type": "STRING",
        "description": "this_task_will_ask_you_to_go_to_a_gas_station_in_your_area_and_answer_some_questions",
        "mode": "NULLABLE"
    },
    {
        "name": "_2_",
        "type": "STRING",
        "description": "please_go_to_the_gas_station_closest_to_your_home_and_take_a_photo",
        "mode": "NULLABLE"
    },
    {
        "name": "_3_",
        "type": "STRING",
        "description": "please_record_the_location_of_the_this_gas_station",
        "mode": "NULLABLE"
    },
    {
        "name": "_4_",
        "type": "STRING",
        "description": "is_this_gas_station_open_or_closed",
        "mode": "NULLABLE"
    },
    {
        "name": "_5_",
        "type": "STRING",
        "description": "since_when_has_the_gas_station_been_closed",
        "mode": "NULLABLE"
    },
    {
        "name": "_6_",
        "type": "STRING",
        "description": "how_often_does_this_gas_station_open",
        "mode": "NULLABLE"
    },
    {
        "name": "_7_",
        "type": "STRING",
        "description": "have_you_been_able_to_get_gas_at_this_station_in_the_last_30_days",
        "mode": "NULLABLE"
    },
    {
        "name": "_8_",
        "type": "STRING",
        "description": "the_last_time_your_tried_to_get_gas_how_many_stations_did_you_have_to_visit_when_looking_for_gasoline",
        "mode": "NULLABLE"
    },
    {
        "name": "_9_",
        "type": "STRING",
        "description": "why_did_you_have_to_visit_more_than_one_station_in_order_to_find_gas",
        "mode": "NULLABLE"
    },
    {
        "name": "_10_",
        "type": "STRING",
        "description": "please_let_us_know_the_average_number_of_days_you_ve_had_to_invest_in_order_to_get_gas",
        "mode": "NULLABLE"
    },
    {
        "name": "_11_",
        "type": "STRING",
        "description": "how_much_time_in_hours_does_it_take_your_to_get_gasoline",
        "mode": "NULLABLE"
    },
    {
        "name": "_12_",
        "type": "STRING",
        "description": "with_what_type_of_vehicle_do_you_typically_go_to_look_for_gas",
        "mode": "NULLABLE"
    },
    {
        "name": "_13_",
        "type": "STRING",
        "description": "do_you_need_a_salvoconducto_in_order_to_get_gas",
        "mode": "NULLABLE"
    }
]
