{
  "data_asset_type": null,
  "expectation_suite_name": "probe.quality_checks",
  "expectations": [
    {
      "expectation_type": "expect_column_to_exist",
      "kwargs": {
        "column": "timestamp"
      },
      "meta": {
        "notes": {
          "content": "Expect that the `timestamp` column exists",
          "format": "markdown"
        }
      }
    },
    {
      "expectation_type": "expect_table_row_count_to_be_between",
      "kwargs": {
        "max_value": 1440,
        "min_value": 1430
      },
      "meta": {
        "notes": {
          "content": "Expect that the rows count is between 1430 and 1440",
          "format": "markdown"
        }
      }
    },
    {
      "expectation_type": "expect_custom_column_values_to_be_unique",
      "kwargs": {
        "column": "timestamp"
      },
      "meta": {
        "notes": {
          "content": "Expect that the `timestamp` values are not duplicated",
          "format": "markdown"
        }
      }
    }
  ],
  "meta": {
    "great_expectations_version": "0.13.24"
  }
}
