[
    {
        "type": "INTEGER",
        "name": "submission_id",
        "mode": "REQUIRED"
    },
    {
        "type": "INTEGER",
        "name": "observation_id",
        "mode": "REQUIRED"
    },
    {
        "type": "TIMESTAMP",
        "name": "observed_time",
        "mode": "REQUIRED"
    },
    {
        "type": "INTEGER",
        "name": "user_id",
        "mode": "REQUIRED"
    },
    {
        "type": "INTEGER",
        "name": "form_id",
        "mode": "REQUIRED"
    },
    {
        "type": "INTEGER",
        "name": "form_version",
        "mode": "REQUIRED"
    },
    {
        "type": "STRING",
        "name": "form_name",
        "mode": "REQUIRED"
    },
    {
        "type": "INTEGER",
        "name": "form_tier",
        "mode": "REQUIRED"
    },
    {
        "type": "INTEGER",
        "name": "campaign_id",
        "mode": "REQUIRED"
    },
    {
        "type": "STRING",
        "name": "campaign_name",
        "mode": "REQUIRED"
    },
    {
        "type": "INTEGER",
        "name": "project_id",
        "mode": "REQUIRED"
    },
    {
        "type": "STRING",
        "name": "project_name",
        "mode": "REQUIRED"
    },
    {
        "type": "STRING",
        "name": "organization_id",
        "mode": "REQUIRED"
    },
    {
        "type": "STRING",
        "name": "gender",
        "mode": "NULLABLE"
    },
    {
        "type": "STRING",
        "name": "age",
        "mode": "NULLABLE"
    },
    {
        "type": "STRING",
        "name": "geography",
        "mode": "NULLABLE"
    },
    {
        "type": "STRING",
        "name": "financial_situation",
        "mode": "NULLABLE"
    },
    {
        "type": "STRING",
        "name": "education",
        "mode": "NULLABLE"
    },
    {
        "type": "STRING",
        "name": "employment_status",
        "mode": "NULLABLE"
    },
    {
        "type": "STRING",
        "name": "ethnicity",
        "mode": "NULLABLE"
    },
    {
        "type": "STRING",
        "name": "religion",
        "mode": "NULLABLE"
    },
    {
        "type": "DATE",
        "name": "batch_date",
        "mode": "NULLABLE"
    },
    {
        "type": "STRING",
        "name": "location_feature_id",
        "mode": "NULLABLE"
    },
    {
        "type": "STRING",
        "name": "location_feature_name",
        "mode": "NULLABLE"
    },
    {
        "type": "FLOAT",
        "name": "observation_lat",
        "mode": "NULLABLE"
    },
    {
        "type": "FLOAT",
        "name": "observation_lon",
        "mode": "NULLABLE"
    },
    {
        "type": "STRING",
        "name": "HASC_code",
        "mode": "NULLABLE"
    },
    {
        "type": "STRING",
        "name": "L0_name",
        "mode": "NULLABLE"
    },
    {
        "type": "STRING",
        "name": "L1_name",
        "mode": "NULLABLE"
    },
    {
        "type": "STRING",
        "name": "L2_name",
        "mode": "NULLABLE"
    },
    {
        "type": "STRING",
        "name": "_1_",
        "mode": "NULLABLE",
        "description": "we_want_to_understand_how_covid_19_has_impacted_your_life"
    },
    {
        "type": "STRING",
        "name": "_2_",
        "mode": "NULLABLE",
        "description": "you_are_receiving_this_task_because_you_indicated_that_there_are_children_or_adolescents_between_3_to_17_years_old_in_your_family_or_households"
    },
    {
        "type": "STRING",
        "name": "_3_",
        "mode": "NULLABLE",
        "description": "help_understand_how_covid_19_has_impacted_access_to_education_in_your_community"
    },
    {
        "type": "STRING",
        "name": "_4_",
        "mode": "NULLABLE",
        "description": "does_your_family_household_have_boys_girls_from_0_to_2_years_old_out_of_the_formal_or_informal_educational_system_that_require_support_in_the_maternal_stage"
    },
    {
        "type": "STRING",
        "name": "_5_",
        "mode": "NULLABLE",
        "description": "were_children_from_3_to_17_years_old_enrolled_and_did_not_return_to_school"
    },
    {
        "type": "STRING",
        "name": "_6_",
        "mode": "NULLABLE",
        "description": "are_there_children_in_your_family_household_who_stopped_enrolling_in_primary_education_from_1st_to_6th_grade"
    },
    {
        "type": "STRING",
        "name": "_7_",
        "mode": "NULLABLE",
        "description": "are_there_children_in_your_family_household_who_stopped_enrolling_in_secondary_education_from_1st_to_5th_year"
    },
    {
        "type": "STRING",
        "name": "_8_",
        "mode": "NULLABLE",
        "description": "are_children_currently_attending_face_to_face_classes"
    },
    {
        "type": "STRING",
        "name": "_9_",
        "mode": "NULLABLE",
        "description": "can_children_and_adolescents_in_basic_education_observe_a_deterioration_or_deficit_of_basic_services_in_their_school_water_electricity_internet_that_does_not_exist_or_is_unusable_in_practice"
    },
    {
        "type": "STRING",
        "name": "_10_",
        "mode": "NULLABLE",
        "description": "do_children_between_the_ages_of_3_and_17_receive_regular_school_meals"
    },
    {
        "type": "STRING",
        "name": "_11_",
        "mode": "NULLABLE",
        "description": "are_there_enough_teachers_or_are_teachers_not_available_at_scheduled_class_hours_or_only_irregularly"
    },
    {
        "name": "_12_",
        "type": "STRING",
        "mode": "NULLABLE",
        "description": "are_children_from_3_to_17_years_old_dealing_with_irregular_school_activity_due_to_lack_of_sufficient_teachers"
    },
    {
        "name": "_13_",
        "type": "STRING",
        "mode": "NULLABLE",
        "description": "do_people_who_are_not_qualified_teachers_chamba_juvenil_parents_militiamen_or_others_teach_them"
    },
    {
        "name": "_14_",
        "type": "STRING",
        "mode": "NULLABLE",
        "description": "did_teachers_leave_the_educational_system_teachers_who_emigrated_or_who_practice_another_profession_or_trade_and_who_were_regular_teachers_before"
    },
    {
        "name": "_15_",
        "type": "STRING",
        "mode": "NULLABLE",
        "description": "do_the_school_and_the_teachers_who_continue_the_school_process_at_a_distance_have_internet_connection_and_equipment_to_connect"
    },
    {
        "name": "_16_",
        "type": "STRING",
        "mode": "NULLABLE",
        "description": "do_children_have_the_opportunity_to_continue_the_school_process_at_a_distance_do_they_have_internet_connection_and_equipment_to_connect_at_home"
    },
    {
        "name": "_17_",
        "type": "STRING",
        "mode": "NULLABLE",
        "description": "do_children_from_3_to_17_years_old_attend_virtual_classes_with_irregularity_due_to_lack_of_electricity_at_home_at_class_time_or_when_they_have_complete_or_submit_work"
    },
    {
        "name": "_18_",
        "type": "STRING",
        "mode": "NULLABLE",
        "description": "does_your_home_show_a_severe_deficit_of_electricity_service_with_more_than_8_hours_a_day_without_service"
    },
    {
        "name": "_19_",
        "type": "STRING",
        "mode": "NULLABLE",
        "description": "does_your_home_show_a_severe_deficit_of_internet_service_without_equipment_or_without_access_to_connection_at_the_established_hours"
    },
    {
        "name": "_20_",
        "type": "STRING",
        "mode": "NULLABLE",
        "description": "do_children_between_the_ages_of_3_and_17_attend_irregularly_or_are_they_in_a_grade_much_lower_than_they_should_be_for_their_age"
    },
    {
        "name": "_21_",
        "type": "STRING",
        "mode": "NULLABLE",
        "description": "are_children_promoted_without_the_competencies_of_the_degree_promoted_without_evaluation_or_with_a_modality_different_from_the_formal_evaluation"
    }
]
