<svg width="16" height="15" viewBox="0 0 16 15" fill="none" xmlns="http://www.w3.org/2000/svg">
<path d="M15.5383 8.1633L9.91328 13.7883C9.73716 13.9644 9.49829 14.0634 9.24922 14.0634C9.00015 14.0634 8.76128 13.9644 8.58516 13.7883C8.40904 13.6122 8.31009 13.3733 8.31009 13.1242C8.31009 12.8752 8.40904 12.6363 8.58516 12.4602L12.6094 8.43752H1.125C0.87636 8.43752 0.637903 8.33874 0.462087 8.16293C0.286272 7.98711 0.1875 7.74866 0.1875 7.50002C0.1875 7.25137 0.286272 7.01292 0.462087 6.8371C0.637903 6.66129 0.87636 6.56252 1.125 6.56252H12.6094L8.58672 2.53751C8.4106 2.36139 8.31166 2.12252 8.31166 1.87345C8.31166 1.62438 8.4106 1.38551 8.58672 1.20939C8.76284 1.03327 9.00171 0.934326 9.25078 0.934326C9.49985 0.934326 9.73872 1.03327 9.91484 1.20939L15.5398 6.83439C15.6273 6.9216 15.6966 7.02523 15.7438 7.13931C15.7911 7.25339 15.8153 7.37569 15.8152 7.49917C15.815 7.62265 15.7905 7.74489 15.743 7.85886C15.6955 7.97283 15.6259 8.07629 15.5383 8.1633Z" fill="white"/>
</svg>
