{
  "$schema": "https://schemas.wp.org/trunk/block.json",
  "apiVersion": 3,
  "name": "wpct-block/external-link",
  "version": "0.1.0",
  "title": "External Link",
  "category": "design",
  "icon": "admin-links",
  "description": "External link custom block.",
  "supports": {
    "html": false,
    "color": {
      "gradients": true,
      "link": true,
      "heading": true,
      "button": true,
      "__experimentalDefaultControls": {
        "background": true,
        "text": true
      }
    },
    "spacing": {
      "margin": ["top", "bottom"],
      "padding": true,
      "__experimentalDefaultControls": {
        "padding": true
      }
    },
    "typography": {
      "fontSize": true,
      "lineHeight": true,
      "textAlign": true,
      "__experimentalFontFamily": true,
      "__experimentalFontWeight": true,
      "__experimentalFontStyle": true,
      "__experimentalTextTransform": true,
      "__experimentalTextDecoration": true,
      "__experimentalLetterSpacing": true,
      "__experimentalDefaultControls": {
        "fontSize": true
      }
    },
    "shadow": true
  },
  "attributes": {
    "link": {
      "type": "string",
      "source": "attribute",
      "attribute": "href",
      "selector": "a"
    },
    "arrow": {
      "type": "string",
      "default": "external",
      "enum": ["internal", "external", "download", "back"]
    },
    "text": {
      "type": "string",
      "default": "Link",
      "source": "text",
      "selector": "a"
    }
  },
  "textdomain": "wpct-sm",
  "editorScript": "file:./index.js",
  "editorStyle": "file:./index.css",
  "style": "file:./view.css",
  "viewScript": "file:./view.js"
}
