{
  "$schema": "https://schemas.wp.org/trunk/block.json",
  "apiVersion": 3,
  "name": "wpct-block/page-header",
  "version": "0.1.1",
  "title": "Page Header",
  "category": "design",
  "icon": "layout",
  "description": "Page header custom block.",
  "supports": {
    "html": false
  },
  "attributes": {
    "background": {
      "type": "string"
    },
    "disposition": {
      "type": "string",
      "default": "bottom"
    }
  },
  "usesContext": ["postId", "postType"],
  "textdomain": "wpct-sm",
  "editorScript": "file:./index.js",
  "editorStyle": "file:./index.css",
  "style": "file:./view.css",
  "viewScript": "file:./view.js",
  "render": "file:./render.php"
}
