{
  "$schema": "https://schemas.wp.org/trunk/block.json",
  "apiVersion": 3,
  "name": "wpct-block/accordion-section",
  "version": "0.1.0",
  "title": "Wpct Accordion Section",
  "category": "widgets",
  "description": "A accordion section custom block.",
  "parent": ["wpct-block/accordion"],
  "supports": {
    "anchor": true,
    "align": ["wide", "full"],
    "html": false,
    "color": {
      "gradients": true,
      "link": true,
      "heading": true,
      "button": true,
      "__experimentalDefaultControls": {
        "background": true,
        "text": true
      }
    },
    "spacing": {
      "margin": ["top", "bottom"],
      "padding": true,
      "__experimentalDefaultControls": {
        "padding": true
      }
    },
    "layout": {
      "allowSwitching": false,
      "allowInheriting": false,
      "allowEditing": false,
      "default": {
        "type": "flex",
        "flexWrap": "wrap"
      }
    },
    "__experimentalBorder": {
      "color": true,
      "radius": true,
      "style": true,
      "width": true,
      "__experimentalDefaultControls": {
        "color": true,
        "radius": true,
        "style": true,
        "width": true
      }
    },
    "typography": {
      "fontSize": true,
      "lineHeight": true,
      "__experimentalFontFamily": true,
      "__experimentalFontWeight": true,
      "__experimentalFontStyle": true,
      "__experimentalTextTransform": true,
      "__experimentalTextDecoration": true,
      "__experimentalLetterSpacing": true,
      "__experimentalDefaultControls": {
        "fontSize": true
      }
    },
    "interactivity": {
      "clientNavigation": true
    },
    "shadow": true
  },
  "textdomain": "wpct",
  "editorScript": "file:./index.js",
  "editorStyle": "file:./index.css",
  "style": "file:./style-index.css",
  "viewScript": "file:./view.js",
  "keywords": ["wpct", "accordion"]
}
