{
  "$schema": "https://schemas.wp.org/trunk/block.json",
  "apiVersion": 3,
  "name": "wpct-block/lottie",
  "version": "0.1.0",
  "title": "Wpct Lottie",
  "category": "widgets",
  "icon": "video",
  "description": "A custom block to inject lottie animations.",
  "attributes": {
    "url": {
      "type": "string",
      "default" : "https://lottie.host/4db68bbd-31f6-4cd8-84eb-189de081159a/IGmMCqhzpt.lottie"
    },
    "autoplay": {
      "type" : "boolean",
      "default": "true"
    },
    "speed": {
      "type" : "integer",
      "default": 1
    }
  },
  "supports": {
    "anchor": true,
    "align": ["wide", "full"],
    "html": false,
    "color": {
      "gradients": true,
      "link": true,
      "heading": true,
      "button": true,
      "__experimentalDefaultControls": {
        "background": true,
        "text": true
      }
    },
    "spacing": {
      "margin": ["top", "bottom"],
      "padding": true,
      "__experimentalDefaultControls": {
        "padding": true
      }
    },
    "layout": {
      "allowSwitching": false,
      "allowInheriting": false,
      "allowEditing": false,
      "default": {
        "type": "flex",
        "flexWrap": "wrap"
      }
    },
    "__experimentalBorder": {
      "color": true,
      "radius": true,
      "style": true,
      "width": true,
      "__experimentalDefaultControls": {
        "color": true,
        "radius": true,
        "style": true,
        "width": true
      }
    },
    "typography": {
      "fontSize": true,
      "lineHeight": true,
      "__experimentalFontFamily": true,
      "__experimentalFontWeight": true,
      "__experimentalFontStyle": true,
      "__experimentalTextTransform": true,
      "__experimentalTextDecoration": true,
      "__experimentalLetterSpacing": true,
      "__experimentalDefaultControls": {
        "fontSize": true
      }
    },
    "interactivity": {
      "clientNavigation": true
    },
    "shadow": true
  },
  "textdomain": "wpct-sm",
  "editorScript": "file:./index.js",
  "editorStyle": "file:./index.css",
  "style": "file:./style-index.css",
  "viewScript": "file:./view.js",
  "keywords": ["wpct", "lottie", "animations"]
}
