{
  "$schema": "https://schemas.wp.org/trunk/block.json",
  "apiVersion": 3,
  "name": "wpct-block/leaflet",
  "version": "1.0.0",
  "title": "Wpct Leaflet",
  "category": "widgets",
  "icon": "dashicons-admin-site",
  "description": "Show location on a leaflet map",
  "attributes": {
    "latitude": {
      "type": "number",
      "default": 41.4
    },
    "longitude": {
      "type": "number",
      "default": 2.16
    },
    "zoom": {
      "type": "number",
      "default": 13
    }
  },
  "supports": {
    "anchor": true,
    "align": ["wide", "full"],
    "html": false,
    "spacing": {
      "margin": ["top", "bottom"],
      "padding": true,
      "__experimentalDefaultControls": {
        "padding": true
      }
    },
    "dimensions": {
      "minHeight": true
    }
  },
  "textdomain": "wpct-child-theme",
  "editorScript": "file:./index.js",
  "editorStyle": "file:./index.css",
  "style": "file:./style-index.css",
  "viewScript": "file:./view.js",
  "keywords": ["wpct", "leaflet", "map", "location"]
}
