{
  "restartable": "rs",
  "ignore": [
    ".git",
    "node_modules/**/node_modules",
    ".data",
    "certificate",
    "dist",
    "test",
    "swagger.json"
  ],
  "verbose": false,
  "execMap": {
    "js": "node --harmony"
  },
  "events": {
    "restart": "npm run build"
  },
  "watch": [
    "config/",
    "src/"
  ],
  "env": {
    "NODE_ENV": "development"
  },
  "ext": "js,html,css,ts"
}