
adc.o:
00000000 T adc_configure_power_save
00000000 T adc_configure_sequence
00000000 T adc_configure_timing
00000000 T adc_configure_trigger
00000000 T adc_disable_all_channel
00000000 T adc_disable_anch
00000000 T adc_disable_channel
00000000 T adc_disable_channel_differential_input
00000000 T adc_disable_channel_input_offset
00000000 T adc_disable_interrupt
00000000 T adc_disable_tag
00000000 T adc_disable_ts
00000000 T adc_enable_all_channel
00000000 T adc_enable_anch
00000000 T adc_enable_channel
00000000 T adc_enable_channel_differential_input
00000000 T adc_enable_channel_input_offset
00000000 T adc_enable_interrupt
00000000 T adc_enable_tag
00000000 T adc_enable_ts
00000000 T adc_get_actual_adc_clock
00000000 T adc_get_channel_status
00000000 T adc_get_channel_value
00000000 T adc_get_comparison_mode
00000000 T adc_get_interrupt_mask
00000000 T adc_get_latest_value
00000000 T adc_get_overrun_status
00000000 T adc_get_pdc_base
00000000 T adc_get_status
00000000 T adc_get_tag
00000000 T adc_get_writeprotect_status
00000000 T adc_init
00000000 T adc_set_bias_current
00000000 T adc_set_channel_input_gain
00000000 T adc_set_comparison_channel
00000000 T adc_set_comparison_mode
00000000 T adc_set_comparison_window
00000000 T adc_set_resolution
00000000 T adc_set_writeprotect
00000000 T adc_start
00000000 T adc_start_sequencer
00000000 T adc_stop
00000000 T adc_stop_sequencer

adc12_sam3u.o:

interrupt_sam_nvic.o:
00000000 D g_interrupt_enabled

pio.o:
00000000 T PIO_Clear
00000000 T PIO_Configure
00000000 T PIO_DisableInterrupt
00000000 T PIO_Get
00000000 T PIO_GetOutputDataStatus
00000000 T PIO_PullUp
00000000 T PIO_Set
00000000 T PIO_SetDebounceFilter
00000000 T PIO_SetInput
00000000 T PIO_SetOutput
00000000 T PIO_SetPeripheral

pmc.o:
00000000 T pmc_clr_fast_startup_input
00000000 T pmc_disable_all_pck
00000000 T pmc_disable_all_periph_clk
00000000 T pmc_disable_interrupt
00000000 T pmc_disable_pck
00000000 T pmc_disable_periph_clk
00000000 T pmc_disable_pllack
00000000 T pmc_disable_udpck
00000000 T pmc_disable_upll_clock
00000000 T pmc_enable_all_pck
00000000 T pmc_enable_all_periph_clk
00000000 T pmc_enable_backupmode
00000000 T pmc_enable_interrupt
00000000 T pmc_enable_pck
00000000 T pmc_enable_periph_clk
00000000 T pmc_enable_pllack
00000000 T pmc_enable_sleepmode
00000000 T pmc_enable_udpck
00000000 T pmc_enable_upll_clock
00000000 T pmc_enable_waitmode
00000000 T pmc_get_interrupt_mask
00000000 T pmc_get_status
00000000 T pmc_get_writeprotect_status
00000000 T pmc_is_locked_pllack
00000000 T pmc_is_locked_upll
00000000 T pmc_is_pck_enabled
00000000 T pmc_is_periph_clk_enabled
00000000 T pmc_mck_set_prescaler
00000000 T pmc_mck_set_source
00000000 T pmc_osc_disable_fastrc
00000000 T pmc_osc_disable_xtal
00000000 T pmc_osc_enable_fastrc
00000000 T pmc_osc_is_ready_32kxtal
00000000 T pmc_osc_is_ready_mainck
00000000 T pmc_pck_set_prescaler
00000000 T pmc_pck_set_source
00000000 T pmc_set_fast_startup_input
00000000 T pmc_set_writeprotect
00000000 T pmc_switch_mainck_to_fastrc
00000000 T pmc_switch_mainck_to_xtal
00000000 T pmc_switch_mck_to_mainck
00000000 T pmc_switch_mck_to_pllack
00000000 T pmc_switch_mck_to_sclk
00000000 T pmc_switch_mck_to_upllck
00000000 T pmc_switch_pck_to_mainck
00000000 T pmc_switch_pck_to_pllack
00000000 T pmc_switch_pck_to_sclk
00000000 T pmc_switch_pck_to_upllck
00000000 T pmc_switch_sclk_to_32kxtal
00000000 T pmc_switch_udpck_to_pllack
00000000 T pmc_switch_udpck_to_upllck

pwmc.o:
00000024 r .LC0
00000000 r .LC1
0000016c r .LC10
0000019c r .LC11
000001cc r .LC12
000001fc r .LC13
00000204 r .LC14
00000014 r .LC2
00000050 r .LC3
0000007c r .LC4
000000a8 r .LC5
000000dc r .LC6
00000108 r .LC7
00000134 r .LC8
00000160 r .LC9
00000000 t FindClockConfiguration
00000000 T PWMC_ConfigureChannel
00000000 T PWMC_ConfigureChannelExt
00000000 T PWMC_ConfigureClocks
00000000 T PWMC_ConfigureComparisonUnit
00000000 T PWMC_ConfigureEventLineMode
00000000 T PWMC_ConfigureSyncChannel
00000000 T PWMC_DisableChannel
00000000 T PWMC_DisableChannelIt
00000000 T PWMC_DisableIt
00000000 T PWMC_DisableOverrideOutput
00000000 T PWMC_EnableChannel
00000000 T PWMC_EnableChannelIt
00000000 T PWMC_EnableFaultProtection
00000000 T PWMC_EnableIt
00000000 T PWMC_EnableOverrideOutput
00000000 T PWMC_FaultClear
00000000 T PWMC_SetDeadTime
00000000 T PWMC_SetDutyCycle
00000000 T PWMC_SetFaultMode
00000000 T PWMC_SetFaultProtectionValue
00000000 T PWMC_SetOverrideValue
00000000 T PWMC_SetPeriod
00000000 T PWMC_SetSyncChannelUpdatePeriod
00000000 T PWMC_SetSyncChannelUpdateUnlock
00000000 T PWMC_WriteBuffer
         U __assert_func
00000000 r __func__.3192
00000000 r __func__.3203
00000000 r __func__.3218
00000000 r __func__.3229
00000000 r __func__.3240
00000000 r __func__.3247
00000000 r __func__.3331
00000000 r __func__.3337

rtc.o:
00000000 r .LC0
00000010 r .LC1
0000002c r .LC2
00000000 T RTC_ClearSCCR
00000000 T RTC_DisableIt
00000000 T RTC_EnableIt
00000000 T RTC_GetDate
00000000 T RTC_GetHourMode
00000000 T RTC_GetSR
00000000 T RTC_GetTime
00000000 T RTC_SetDate
00000000 T RTC_SetDateAlarm
00000000 T RTC_SetHourMode
00000000 T RTC_SetTime
00000000 T RTC_SetTimeAlarm
         U __assert_func
00000000 r __func__.3189
00000000 r __func__.3198
00000000 r __func__.3203

rtt.o:
00000000 r .LC0
00000010 r .LC1
0000002c r .LC2
00000000 T RTT_EnableIT
00000000 T RTT_GetStatus
00000000 T RTT_GetTime
00000000 T RTT_SetAlarm
00000000 T RTT_SetPrescaler
         U __assert_func
00000000 r __func__.3196
00000000 r __func__.3204

spi.o:
00000000 T SPI_Configure
00000000 T SPI_ConfigureNPCS
00000000 T SPI_Disable
00000000 T SPI_DisableIt
00000000 T SPI_Enable
00000000 T SPI_EnableIt
00000000 T SPI_GetStatus
00000000 T SPI_IsFinished
00000000 T SPI_Read
00000000 T SPI_Write
         U pmc_enable_periph_clk

tc.o:
00000000 r .LC0
00000010 r .LC1
00000000 T TC_Configure
00000000 T TC_FindMckDivisor
00000000 T TC_Start
00000000 T TC_Stop
         U __assert_func
00000000 r __func__.3191
00000000 r __func__.3197
00000000 r __func__.3203

timetick.o:
00000000 T GetTickCount
00000000 t NVIC_SetPriority
00000000 T Sleep
00000000 t SysTick_Config
00000000 T TimeTick_Configure
00000000 T TimeTick_Increment
00000000 T Wait
00000000 b _dwTickCount

twi.o:
00000000 r .LC0
00000010 r .LC1
00000018 r .LC2
00000024 r .LC3
00000054 r .LC4
00000064 r .LC5
0000007c r .LC6
0000009c r .LC7
000000a8 r .LC8
00000000 T TWI_ByteReceived
00000000 T TWI_ByteSent
00000000 T TWI_ConfigureMaster
00000000 T TWI_ConfigureSlave
00000000 T TWI_DisableIt
00000000 T TWI_EnableIt
00000000 T TWI_GetMaskedStatus
00000000 T TWI_GetStatus
00000000 T TWI_ReadByte
00000000 T TWI_SendSTOPCondition
00000000 T TWI_StartRead
00000000 T TWI_StartWrite
00000000 T TWI_Stop
00000000 T TWI_TransferComplete
00000000 T TWI_WriteByte
         U __assert_func
00000000 r __func__.3556
00000000 r __func__.3571
00000000 r __func__.3575
00000000 r __func__.3582
00000000 r __func__.3586
00000000 r __func__.3591
00000000 r __func__.3599
00000000 r __func__.3613
00000000 r __func__.3618
00000000 r __func__.3622
00000000 r __func__.3627
00000000 r __func__.3631

udp.o:

udphs.o:

uotghs.o:
00000000 t NVIC_EnableIRQ
00000000 t NVIC_SetPriority
00000000 T UDD_Attach
00000000 T UDD_ClearIN
00000000 T UDD_ClearOUT
00000000 T UDD_ClearSetupInt
00000000 T UDD_Detach
00000000 T UDD_FifoByteCount
00000000 T UDD_GetFrameNumber
00000000 T UDD_Init
00000000 T UDD_InitEP
00000000 T UDD_InitEndpoints
00000000 T UDD_ReadWriteAllowed
00000000 T UDD_ReceivedSetupInt
00000000 T UDD_Recv
00000000 T UDD_Recv8
00000000 T UDD_ReleaseRX
00000000 T UDD_ReleaseTX
00000000 T UDD_Send
00000000 T UDD_Send8
00000000 T UDD_SetAddress
00000000 T UDD_SetStack
00000000 T UDD_Stall
00000000 T UDD_WaitForINOrOUT
00000000 T UDD_WaitIN
00000000 T UDD_WaitOUT
00000000 T UOTGHS_Handler
00000000 t cpu_irq_is_enabled_flags
00000000 t cpu_irq_restore
00000000 t cpu_irq_save
         U g_interrupt_enabled
00000000 b gpf_isr
         U pmc_enable_periph_clk
         U pmc_enable_udpck
         U pmc_enable_upll_clock
         U pmc_switch_udpck_to_upllck
00000000 b ul_recv_fifo_ptr
00000000 b ul_send_fifo_ptr

usart.o:
00000000 r .LC0
00000014 r .LC1
00000000 T USART_Configure
00000000 T USART_DisableIt
00000000 T USART_EnableIt
00000000 T USART_GetChar
00000000 T USART_GetStatus
00000000 T USART_IsDataAvailable
00000000 T USART_IsRxReady
00000000 T USART_PutChar
00000000 T USART_Read
00000000 T USART_ReadBuffer
00000000 T USART_SetIrdaFilter
00000000 T USART_SetReceiverEnabled
00000000 T USART_SetTransmitterEnabled
00000000 T USART_Write
00000000 T USART_WriteBuffer
         U __assert_func
00000000 r __func__.3477

wdt.o:
00000000 T WDT_Disable
00000000 T WDT_Enable
00000000 T WDT_GetPeriod
00000000 T WDT_GetStatus
00000000 T WDT_Restart

system_sam3xa.o:
00000000 D SystemCoreClock
00000000 T SystemCoreClockUpdate
00000000 T SystemInit
00000000 T system_init_flash

startup_sam3xa.o:
00000000 W ADC_Handler
00000000 W BusFault_Handler
00000000 W CAN0_Handler
00000000 W CAN1_Handler
00000000 W DACC_Handler
00000000 W DMAC_Handler
00000000 W DebugMon_Handler
00000000 T Dummy_Handler
00000000 W EFC0_Handler
00000000 W EFC1_Handler
00000000 W EMAC_Handler
00000000 W HSMCI_Handler
00000000 W HardFault_Handler
00000000 W MemManage_Handler
00000000 W NMI_Handler
00000000 W PIOA_Handler
00000000 W PIOB_Handler
00000000 W PIOC_Handler
00000000 W PIOD_Handler
00000000 W PMC_Handler
00000000 W PWM_Handler
00000000 W PendSV_Handler
00000000 W RSTC_Handler
00000000 W RTC_Handler
00000000 W RTT_Handler
00000000 T Reset_Handler
00000000 W SMC_Handler
00000000 W SPI0_Handler
00000000 W SSC_Handler
00000000 W SUPC_Handler
00000000 W SVC_Handler
00000000 W SysTick_Handler
00000000 W TC0_Handler
00000000 W TC1_Handler
00000000 W TC2_Handler
00000000 W TC3_Handler
00000000 W TC4_Handler
00000000 W TC5_Handler
00000000 W TC6_Handler
00000000 W TC7_Handler
00000000 W TC8_Handler
00000000 W TRNG_Handler
00000000 W TWI0_Handler
00000000 W TWI1_Handler
00000000 W UART_Handler
00000000 W UOTGHS_Handler
00000000 W USART0_Handler
00000000 W USART1_Handler
00000000 W USART2_Handler
00000000 W USART3_Handler
00000000 W UsageFault_Handler
00000000 W WDT_Handler
         U __libc_init_array
         U _erelocate
         U _estack
         U _etext
         U _ezero
         U _sfixed
         U _srelocate
         U _szero
00000000 R exception_table
         U main
