
{
	"Mouse": {
		"leftClickDown": "leftClickDown",
		"leftClickUp": "leftClickUp"
	},
	"Keys": {
		"8": "Bksp",
		"9": "Tab",
		"13": "Enter",
		"16": "Shift",
		"17": "Ctrl",
		"19": "Pause",
		"20": "Caps",
		"27": "ESC",
		"32": "Space",
		"33": "PgUp",
		"34": "PgDn",
		"35": "End",
		"36": "Home",
		"37": "Left",
		"38": "Up",
		"39": "Right",
		"40": "Down",
		"45": "Ins",
		"46": "Del",
		"48": "0",
		"49": "1",
		"50": "2",
		"51": "3",
		"52": "4",
		"53": "5",
		"54": "6",
		"55": "7",
		"56": "8",
		"57": "9",
		"65": "A",
		"66": "B",
		"67": "C",
		"68": "D",
		"69": "E",
		"70": "F",
		"71": "G",
		"72": "H",
		"73": "I",
		"74": "J",
		"75": "K",
		"76": "L",
		"77": "M",
		"78": "N",
		"79": "O",
		"80": "P",
		"81": "Q",
		"82": "R",
		"83": "S",
		"84": "T",
		"85": "U",
		"86": "V",
		"87": "W",
		"88": "X",
		"89": "Y",
		"90": "Z",
		"96": "Num0",
		"97": "Num1",
		"98": "Num2",
		"99": "Num3",
		"100": "Num4",
		"101": "Num5",
		"102": "Num6",
		"103": "Num7",
		"104": "Num8",
		"105": "Num9",
		"106": "Num*",
		"107": "Num+",
		"109": "Num-",
		"110": "Num.",
		"111": "Num/",
		"144": "NumLk",
		"145": "ScrLk",
		"186": ";:",
		"187": "+=",
		"188": ",",
		"189": "-_",
		"190": ".",
		"191": "/",
		"192": "~",
		"219": "[{",
		"220": "|",
		"221": "]}",
		"222": "'"
	},
	"DefaultBindings": {
		"Up": ["38"],
		"Down": ["40"],
		"Left": ["37"],
		"Right": ["39"],
		"Rotate Left": ["90"],
		"Rotate Right": ["88"]
	}
}