{
    "asset" : {
        "generator" : "Khronos glTF Blender I/O v1.3.48",
        "version" : "2.0"
    },
    "scene" : 0,
    "scenes" : [
        {
            "name" : "Scene",
            "nodes" : [
                0,
                1,
                3
            ]
        }
    ],
    "nodes" : [
        {
            "mesh" : 0,
            "name" : "Plate"
        },
        {
            "mesh" : 1,
            "name" : "ScrewCover"
        },
        {
            "mesh" : 2,
            "name" : "SwitchPlate"
        },
        {
            "children" : [
                2
            ],
            "mesh" : 3,
            "name" : "Switch",
            "translation" : [
                0,
                0,
                -0.002110613975673914
            ]
        }
    ],
    "materials" : [
        {
            "doubleSided" : true,
            "emissiveFactor" : [
                0,
                0,
                0
            ],
            "name" : "Plastic",
            "pbrMetallicRoughness" : {
                "baseColorFactor" : [
                    0.8000000715255737,
                    0.8000000715255737,
                    0.8000000715255737,
                    1
                ],
                "metallicFactor" : 0,
                "roughnessFactor" : 0.2721518874168396
            }
        },
        {
            "doubleSided" : true,
            "emissiveFactor" : [
                0,
                0,
                0
            ],
            "name" : "Void",
            "pbrMetallicRoughness" : {
                "baseColorFactor" : [
                    0.06997819989919662,
                    0.06997819989919662,
                    0.06997819989919662,
                    1
                ],
                "metallicFactor" : 0,
                "roughnessFactor" : 1
            }
        }
    ],
    "meshes" : [
        {
            "name" : "Plane",
            "primitives" : [
                {
                    "attributes" : {
                        "POSITION" : 0,
                        "NORMAL" : 1,
                        "TEXCOORD_0" : 2
                    },
                    "indices" : 3,
                    "material" : 0
                },
                {
                    "attributes" : {
                        "POSITION" : 4,
                        "NORMAL" : 5,
                        "TEXCOORD_0" : 6
                    },
                    "indices" : 7,
                    "material" : 1
                }
            ]
        },
        {
            "name" : "Circle.001",
            "primitives" : [
                {
                    "attributes" : {
                        "POSITION" : 8,
                        "NORMAL" : 9,
                        "TEXCOORD_0" : 10
                    },
                    "indices" : 11
                }
            ]
        },
        {
            "name" : "Plane.002",
            "primitives" : [
                {
                    "attributes" : {
                        "POSITION" : 12,
                        "NORMAL" : 13,
                        "TEXCOORD_0" : 14
                    },
                    "indices" : 15,
                    "material" : 1
                }
            ]
        },
        {
            "name" : "Plane.003",
            "primitives" : [
                {
                    "attributes" : {
                        "POSITION" : 16,
                        "NORMAL" : 17,
                        "TEXCOORD_0" : 18
                    },
                    "indices" : 19,
                    "material" : 0
                }
            ]
        }
    ],
    "accessors" : [
        {
            "bufferView" : 0,
            "componentType" : 5126,
            "count" : 928,
            "max" : [
                0.034999996423721313,
                0.05700001120567322,
                0.01311297807842493
            ],
            "min" : [
                -0.034999996423721313,
                -0.05700001120567322,
                3.059798525661961e-10
            ],
            "type" : "VEC3"
        },
        {
            "bufferView" : 1,
            "componentType" : 5126,
            "count" : 928,
            "type" : "VEC3"
        },
        {
            "bufferView" : 2,
            "componentType" : 5126,
            "count" : 928,
            "type" : "VEC2"
        },
        {
            "bufferView" : 3,
            "componentType" : 5123,
            "count" : 4296,
            "type" : "SCALAR"
        },
        {
            "bufferView" : 4,
            "componentType" : 5126,
            "count" : 128,
            "max" : [
                0.0019923527725040913,
                0.04670984297990799,
                0.013112956658005714
            ],
            "min" : [
                -0.0019923527725040913,
                -0.04670984297990799,
                0.01253493782132864
            ],
            "type" : "VEC3"
        },
        {
            "bufferView" : 5,
            "componentType" : 5126,
            "count" : 128,
            "type" : "VEC3"
        },
        {
            "bufferView" : 6,
            "componentType" : 5126,
            "count" : 128,
            "type" : "VEC2"
        },
        {
            "bufferView" : 7,
            "componentType" : 5123,
            "count" : 384,
            "type" : "SCALAR"
        },
        {
            "bufferView" : 8,
            "componentType" : 5126,
            "count" : 128,
            "max" : [
                0.0020000000949949026,
                0.04671749100089073,
                0.013077172450721264
            ],
            "min" : [
                -0.0019999996293336153,
                -0.04671749100089073,
                0.013021155260503292
            ],
            "type" : "VEC3"
        },
        {
            "bufferView" : 9,
            "componentType" : 5126,
            "count" : 128,
            "type" : "VEC3"
        },
        {
            "bufferView" : 10,
            "componentType" : 5126,
            "count" : 128,
            "type" : "VEC2"
        },
        {
            "bufferView" : 11,
            "componentType" : 5123,
            "count" : 744,
            "type" : "SCALAR"
        },
        {
            "bufferView" : 12,
            "componentType" : 5126,
            "count" : 152,
            "max" : [
                0.007896700873970985,
                0.007896700873970985,
                0.015046046115458012
            ],
            "min" : [
                -0.007896700873970985,
                -0.007896700873970985,
                0.015010734088718891
            ],
            "type" : "VEC3"
        },
        {
            "bufferView" : 13,
            "componentType" : 5126,
            "count" : 152,
            "type" : "VEC3"
        },
        {
            "bufferView" : 14,
            "componentType" : 5126,
            "count" : 152,
            "type" : "VEC2"
        },
        {
            "bufferView" : 15,
            "componentType" : 5123,
            "count" : 282,
            "type" : "SCALAR"
        },
        {
            "bufferView" : 16,
            "componentType" : 5126,
            "count" : 248,
            "max" : [
                0.007166717667132616,
                0.007166716735810041,
                0.01826782152056694
            ],
            "min" : [
                -0.007166717667132616,
                -0.007166716735810041,
                0.015046046115458012
            ],
            "type" : "VEC3"
        },
        {
            "bufferView" : 17,
            "componentType" : 5126,
            "count" : 248,
            "type" : "VEC3"
        },
        {
            "bufferView" : 18,
            "componentType" : 5126,
            "count" : 248,
            "type" : "VEC2"
        },
        {
            "bufferView" : 19,
            "componentType" : 5123,
            "count" : 876,
            "type" : "SCALAR"
        }
    ],
    "bufferViews" : [
        {
            "buffer" : 0,
            "byteLength" : 11136,
            "byteOffset" : 0
        },
        {
            "buffer" : 0,
            "byteLength" : 11136,
            "byteOffset" : 11136
        },
        {
            "buffer" : 0,
            "byteLength" : 7424,
            "byteOffset" : 22272
        },
        {
            "buffer" : 0,
            "byteLength" : 8592,
            "byteOffset" : 29696
        },
        {
            "buffer" : 0,
            "byteLength" : 1536,
            "byteOffset" : 38288
        },
        {
            "buffer" : 0,
            "byteLength" : 1536,
            "byteOffset" : 39824
        },
        {
            "buffer" : 0,
            "byteLength" : 1024,
            "byteOffset" : 41360
        },
        {
            "buffer" : 0,
            "byteLength" : 768,
            "byteOffset" : 42384
        },
        {
            "buffer" : 0,
            "byteLength" : 1536,
            "byteOffset" : 43152
        },
        {
            "buffer" : 0,
            "byteLength" : 1536,
            "byteOffset" : 44688
        },
        {
            "buffer" : 0,
            "byteLength" : 1024,
            "byteOffset" : 46224
        },
        {
            "buffer" : 0,
            "byteLength" : 1488,
            "byteOffset" : 47248
        },
        {
            "buffer" : 0,
            "byteLength" : 1824,
            "byteOffset" : 48736
        },
        {
            "buffer" : 0,
            "byteLength" : 1824,
            "byteOffset" : 50560
        },
        {
            "buffer" : 0,
            "byteLength" : 1216,
            "byteOffset" : 52384
        },
        {
            "buffer" : 0,
            "byteLength" : 564,
            "byteOffset" : 53600
        },
        {
            "buffer" : 0,
            "byteLength" : 2976,
            "byteOffset" : 54164
        },
        {
            "buffer" : 0,
            "byteLength" : 2976,
            "byteOffset" : 57140
        },
        {
            "buffer" : 0,
            "byteLength" : 1984,
            "byteOffset" : 60116
        },
        {
            "buffer" : 0,
            "byteLength" : 1752,
            "byteOffset" : 62100
        }
    ],
    "buffers" : [
        {
            "byteLength" : 63852,
            "uri" : "base_switch.bin"
        }
    ]
}
