{
    "asset" : {
        "generator" : "Khronos glTF Blender I/O v1.3.48",
        "version" : "2.0"
    },
    "scene" : 0,
    "scenes" : [
        {
            "name" : "Scene",
            "nodes" : [
                0,
                1,
                2,
                3,
                4,
                5,
                6,
                7,
                8,
                9,
                10,
                11,
                12
            ]
        }
    ],
    "nodes" : [
        {
            "mesh" : 0,
            "name" : "BedFrame"
        },
        {
            "mesh" : 1,
            "name" : "Cube",
            "scale" : [
                0.9766880869865417,
                1,
                0.9766880869865417
            ]
        },
        {
            "name" : "Sun",
            "rotation" : [
                0.13979750871658325,
                -0.03633847087621689,
                -0.09456562250852585,
                0.9849840402603149
            ],
            "translation" : [
                1.7046515941619873,
                4.696779727935791,
                1.7966883182525635
            ]
        },
        {
            "mesh" : 2,
            "name" : "Blanket"
        },
        {
            "mesh" : 3,
            "name" : "PillowRight",
            "rotation" : [
                0.5411233305931091,
                0.010339147411286831,
                -0.006653661839663982,
                0.8408533334732056
            ],
            "translation" : [
                0.3553255796432495,
                0.6526194214820862,
                -0.8891257643699646
            ]
        },
        {
            "mesh" : 4,
            "name" : "PillowLeft",
            "rotation" : [
                0.515161395072937,
                0,
                0,
                0.8570932149887085
            ],
            "translation" : [
                -0.3440895974636078,
                0.6438602805137634,
                -0.9044755697250366
            ]
        },
        {
            "mesh" : 5,
            "name" : "Collider-colonly",
            "scale" : [
                0.7911652326583862,
                0.4001123309135437,
                1
            ]
        },
        {
            "mesh" : 6,
            "name" : "Circle",
            "rotation" : [
                0.08113832026720047,
                -0.08113832026720047,
                0.7024361491203308,
                0.7024362087249756
            ],
            "scale" : [
                0.009974716231226921,
                0.009974716231226921,
                0.009974716231226921
            ],
            "translation" : [
                -0.7807985544204712,
                0.6117058992385864,
                -0.9994847178459167
            ]
        },
        {
            "mesh" : 7,
            "name" : "Circle.001",
            "rotation" : [
                0.14913588762283325,
                -0.14913588762283325,
                0.6912007331848145,
                0.6912007927894592
            ],
            "scale" : [
                0.009974716231226921,
                0.009974716231226921,
                0.009974716231226921
            ],
            "translation" : [
                -0.7807985544204712,
                0.5675356984138489,
                -0.9724252223968506
            ]
        },
        {
            "mesh" : 8,
            "name" : "Circle.002",
            "rotation" : [
                0.11096730828285217,
                -0.11096730828285217,
                0.6983453631401062,
                0.6983453631401062
            ],
            "scale" : [
                0.009974716231226921,
                0.009974716231226921,
                0.009974716231226921
            ],
            "translation" : [
                -0.7807985544204712,
                0.26146823167800903,
                -1.0103859901428223
            ]
        },
        {
            "mesh" : 9,
            "name" : "Circle.003",
            "rotation" : [
                -0.2359233796596527,
                0.23592330515384674,
                0.6665884256362915,
                0.6665884852409363
            ],
            "scale" : [
                0.009974716231226921,
                0.009974716231226921,
                0.009974716231226921
            ],
            "translation" : [
                -0.7807985544204712,
                0.22826367616653442,
                -0.9819249510765076
            ]
        },
        {
            "mesh" : 10,
            "name" : "Circle.004",
            "rotation" : [
                0.11096730828285217,
                -0.11096730828285217,
                0.6983453631401062,
                0.6983453631401062
            ],
            "scale" : [
                0.009974716231226921,
                0.009974716231226921,
                0.009974716231226921
            ],
            "translation" : [
                -0.7807985544204712,
                0.24311698973178864,
                0.9490050077438354
            ]
        },
        {
            "mesh" : 11,
            "name" : "Circle.005",
            "rotation" : [
                -0.2359233796596527,
                0.23592330515384674,
                0.6665884256362915,
                0.6665884852409363
            ],
            "scale" : [
                0.009974716231226921,
                0.009974716231226921,
                0.009974716231226921
            ],
            "translation" : [
                -0.7807985544204712,
                0.2811228334903717,
                1.0130808353424072
            ]
        }
    ],
    "materials" : [
        {
            "emissiveFactor" : [
                0,
                0,
                0
            ],
            "name" : "Material.001",
            "normalTexture" : {
                "index" : 0,
                "scale" : 0.08000000566244125,
                "texCoord" : 0
            },
            "pbrMetallicRoughness" : {
                "baseColorTexture" : {
                    "index" : 1,
                    "texCoord" : 0
                },
                "metallicFactor" : 0,
                "metallicRoughnessTexture" : {
                    "index" : 2,
                    "texCoord" : 0
                }
            }
        },
        {
            "doubleSided" : true,
            "emissiveFactor" : [
                0,
                0,
                0
            ],
            "name" : "CottonWhite",
            "normalTexture" : {
                "index" : 3,
                "scale" : 0.40000003576278687,
                "texCoord" : 0
            },
            "pbrMetallicRoughness" : {
                "baseColorTexture" : {
                    "index" : 4,
                    "texCoord" : 0
                },
                "metallicFactor" : 0,
                "metallicRoughnessTexture" : {
                    "index" : 5,
                    "texCoord" : 0
                }
            }
        },
        {
            "doubleSided" : true,
            "emissiveFactor" : [
                0,
                0,
                0
            ],
            "name" : "CottonYellow",
            "normalTexture" : {
                "index" : 6,
                "scale" : 0.7000000476837158,
                "texCoord" : 0
            },
            "pbrMetallicRoughness" : {
                "baseColorTexture" : {
                    "index" : 7,
                    "texCoord" : 0
                },
                "metallicFactor" : 0,
                "metallicRoughnessTexture" : {
                    "index" : 8,
                    "texCoord" : 0
                }
            }
        },
        {
            "doubleSided" : true,
            "emissiveFactor" : [
                0,
                0,
                0
            ],
            "name" : "IkeaNeiden_Metal",
            "pbrMetallicRoughness" : {
                "baseColorFactor" : [
                    0.42002442479133606,
                    0.42002442479133606,
                    0.42002442479133606,
                    1
                ],
                "metallicFactor" : 1,
                "roughnessFactor" : 0.2142857164144516
            }
        },
        {
            "doubleSided" : true,
            "emissiveFactor" : [
                0,
                0,
                0
            ],
            "name" : "IkeaNeiden_DarkMetal",
            "pbrMetallicRoughness" : {
                "baseColorFactor" : [
                    0.031063420698046684,
                    0.031063420698046684,
                    0.031063420698046684,
                    1
                ],
                "metallicFactor" : 1,
                "roughnessFactor" : 0.8214285373687744
            }
        }
    ],
    "meshes" : [
        {
            "name" : "Plane",
            "primitives" : [
                {
                    "attributes" : {
                        "POSITION" : 0,
                        "NORMAL" : 1,
                        "TEXCOORD_0" : 2,
                        "COLOR_0" : 3
                    },
                    "indices" : 4,
                    "material" : 0
                }
            ]
        },
        {
            "name" : "Cube",
            "primitives" : [
                {
                    "attributes" : {
                        "POSITION" : 5,
                        "NORMAL" : 6,
                        "TANGENT" : 7,
                        "TEXCOORD_0" : 8
                    },
                    "indices" : 9,
                    "material" : 1
                }
            ]
        },
        {
            "name" : "Grid.002",
            "primitives" : [
                {
                    "attributes" : {
                        "POSITION" : 10,
                        "NORMAL" : 11,
                        "TANGENT" : 12,
                        "TEXCOORD_0" : 13
                    },
                    "indices" : 14,
                    "material" : 2
                },
                {
                    "attributes" : {
                        "POSITION" : 15,
                        "NORMAL" : 16,
                        "TANGENT" : 17,
                        "TEXCOORD_0" : 18
                    },
                    "indices" : 19,
                    "material" : 1
                }
            ]
        },
        {
            "name" : "Plane.001",
            "primitives" : [
                {
                    "attributes" : {
                        "POSITION" : 20,
                        "NORMAL" : 21,
                        "TANGENT" : 22,
                        "TEXCOORD_0" : 23
                    },
                    "indices" : 24,
                    "material" : 2
                },
                {
                    "attributes" : {
                        "POSITION" : 25,
                        "NORMAL" : 26,
                        "TANGENT" : 27,
                        "TEXCOORD_0" : 28
                    },
                    "indices" : 29,
                    "material" : 1
                }
            ]
        },
        {
            "name" : "Plane.002",
            "primitives" : [
                {
                    "attributes" : {
                        "POSITION" : 30,
                        "NORMAL" : 31,
                        "TANGENT" : 32,
                        "TEXCOORD_0" : 33
                    },
                    "indices" : 34,
                    "material" : 2
                },
                {
                    "attributes" : {
                        "POSITION" : 35,
                        "NORMAL" : 36,
                        "TANGENT" : 37,
                        "TEXCOORD_0" : 38
                    },
                    "indices" : 39,
                    "material" : 1
                }
            ]
        },
        {
            "name" : "Cube.001",
            "primitives" : [
                {
                    "attributes" : {
                        "POSITION" : 40,
                        "NORMAL" : 41,
                        "TANGENT" : 42,
                        "TEXCOORD_0" : 43
                    },
                    "indices" : 44
                }
            ]
        },
        {
            "name" : "Circle",
            "primitives" : [
                {
                    "attributes" : {
                        "POSITION" : 45,
                        "NORMAL" : 46,
                        "TEXCOORD_0" : 47
                    },
                    "indices" : 48,
                    "material" : 3
                },
                {
                    "attributes" : {
                        "POSITION" : 49,
                        "NORMAL" : 50,
                        "TEXCOORD_0" : 51
                    },
                    "indices" : 52,
                    "material" : 4
                }
            ]
        },
        {
            "name" : "Circle",
            "primitives" : [
                {
                    "attributes" : {
                        "POSITION" : 53,
                        "NORMAL" : 54,
                        "TEXCOORD_0" : 55
                    },
                    "indices" : 48,
                    "material" : 3
                },
                {
                    "attributes" : {
                        "POSITION" : 56,
                        "NORMAL" : 57,
                        "TEXCOORD_0" : 58
                    },
                    "indices" : 52,
                    "material" : 4
                }
            ]
        },
        {
            "name" : "Circle",
            "primitives" : [
                {
                    "attributes" : {
                        "POSITION" : 59,
                        "NORMAL" : 60,
                        "TEXCOORD_0" : 61
                    },
                    "indices" : 62,
                    "material" : 3
                },
                {
                    "attributes" : {
                        "POSITION" : 63,
                        "NORMAL" : 64,
                        "TEXCOORD_0" : 65
                    },
                    "indices" : 52,
                    "material" : 4
                }
            ]
        },
        {
            "name" : "Circle",
            "primitives" : [
                {
                    "attributes" : {
                        "POSITION" : 66,
                        "NORMAL" : 67,
                        "TEXCOORD_0" : 68
                    },
                    "indices" : 62,
                    "material" : 3
                },
                {
                    "attributes" : {
                        "POSITION" : 69,
                        "NORMAL" : 70,
                        "TEXCOORD_0" : 71
                    },
                    "indices" : 52,
                    "material" : 4
                }
            ]
        },
        {
            "name" : "Circle",
            "primitives" : [
                {
                    "attributes" : {
                        "POSITION" : 72,
                        "NORMAL" : 73,
                        "TEXCOORD_0" : 74
                    },
                    "indices" : 62,
                    "material" : 3
                },
                {
                    "attributes" : {
                        "POSITION" : 75,
                        "NORMAL" : 76,
                        "TEXCOORD_0" : 77
                    },
                    "indices" : 52,
                    "material" : 4
                }
            ]
        },
        {
            "name" : "Circle",
            "primitives" : [
                {
                    "attributes" : {
                        "POSITION" : 78,
                        "NORMAL" : 79,
                        "TEXCOORD_0" : 80
                    },
                    "indices" : 62,
                    "material" : 3
                },
                {
                    "attributes" : {
                        "POSITION" : 81,
                        "NORMAL" : 82,
                        "TEXCOORD_0" : 83
                    },
                    "indices" : 52,
                    "material" : 4
                }
            ]
        }
    ],
    "textures" : [
        {
            "source" : 0
        },
        {
            "source" : 1
        },
        {
            "source" : 2
        },
        {
            "source" : 3
        },
        {
            "source" : 4
        },
        {
            "source" : 5
        },
        {
            "source" : 6
        },
        {
            "source" : 7
        },
        {
            "source" : 8
        }
    ],
    "images" : [
        {
            "mimeType" : "image/png",
            "name" : "pine_normal",
            "uri" : "pine_normal.png"
        },
        {
            "mimeType" : "image/png",
            "name" : "pine_diffuse",
            "uri" : "pine_diffuse.png"
        },
        {
            "mimeType" : "image/png",
            "name" : "pine_roughness",
            "uri" : "pine_roughness.png"
        },
        {
            "mimeType" : "image/png",
            "name" : "cotton_white_normal",
            "uri" : "cotton_white_normal.png"
        },
        {
            "mimeType" : "image/png",
            "name" : "cotton_white_diffuse",
            "uri" : "cotton_white_diffuse.png"
        },
        {
            "mimeType" : "image/png",
            "name" : "cotton_white_roughness",
            "uri" : "cotton_white_roughness.png"
        },
        {
            "mimeType" : "image/png",
            "name" : "cotton_yellow_normal",
            "uri" : "cotton_yellow_normal.png"
        },
        {
            "mimeType" : "image/png",
            "name" : "cotton_yellow_diffuse",
            "uri" : "cotton_yellow_diffuse.png"
        },
        {
            "mimeType" : "image/png",
            "name" : "cotton_yellow_roughness",
            "uri" : "cotton_yellow_roughness.png"
        }
    ],
    "accessors" : [
        {
            "bufferView" : 0,
            "componentType" : 5126,
            "count" : 2032,
            "max" : [
                0.7799999713897705,
                0.6499999761581421,
                1.034999966621399
            ],
            "min" : [
                -0.7799999713897705,
                0,
                -1.034999966621399
            ],
            "type" : "VEC3"
        },
        {
            "bufferView" : 1,
            "componentType" : 5126,
            "count" : 2032,
            "type" : "VEC3"
        },
        {
            "bufferView" : 2,
            "componentType" : 5126,
            "count" : 2032,
            "type" : "VEC2"
        },
        {
            "bufferView" : 3,
            "componentType" : 5126,
            "count" : 2032,
            "type" : "VEC4"
        },
        {
            "bufferView" : 4,
            "componentType" : 5123,
            "count" : 6306,
            "type" : "SCALAR"
        },
        {
            "bufferView" : 5,
            "componentType" : 5126,
            "count" : 123,
            "max" : [
                0.7599999904632568,
                0.4371921122074127,
                1.0099999904632568
            ],
            "min" : [
                -0.7599999904632568,
                0.19719210267066956,
                -1.0099999904632568
            ],
            "type" : "VEC3"
        },
        {
            "bufferView" : 6,
            "componentType" : 5126,
            "count" : 123,
            "type" : "VEC3"
        },
        {
            "bufferView" : 7,
            "componentType" : 5126,
            "count" : 123,
            "type" : "VEC4"
        },
        {
            "bufferView" : 8,
            "componentType" : 5126,
            "count" : 123,
            "type" : "VEC2"
        },
        {
            "bufferView" : 9,
            "componentType" : 5123,
            "count" : 510,
            "type" : "SCALAR"
        },
        {
            "bufferView" : 10,
            "componentType" : 5126,
            "count" : 797,
            "max" : [
                0.9758403897285461,
                0.498855859041214,
                1.3046467304229736
            ],
            "min" : [
                -1.0016565322875977,
                0.024513665586709976,
                -0.7282483577728271
            ],
            "type" : "VEC3"
        },
        {
            "bufferView" : 11,
            "componentType" : 5126,
            "count" : 797,
            "type" : "VEC3"
        },
        {
            "bufferView" : 12,
            "componentType" : 5126,
            "count" : 797,
            "type" : "VEC4"
        },
        {
            "bufferView" : 13,
            "componentType" : 5126,
            "count" : 797,
            "type" : "VEC2"
        },
        {
            "bufferView" : 14,
            "componentType" : 5123,
            "count" : 4422,
            "type" : "SCALAR"
        },
        {
            "bufferView" : 15,
            "componentType" : 5126,
            "count" : 214,
            "max" : [
                0.870563268661499,
                0.515626072883606,
                -0.19480478763580322
            ],
            "min" : [
                -0.9133970141410828,
                0.03359278663992882,
                -0.7282483577728271
            ],
            "type" : "VEC3"
        },
        {
            "bufferView" : 16,
            "componentType" : 5126,
            "count" : 214,
            "type" : "VEC3"
        },
        {
            "bufferView" : 17,
            "componentType" : 5126,
            "count" : 214,
            "type" : "VEC4"
        },
        {
            "bufferView" : 18,
            "componentType" : 5126,
            "count" : 214,
            "type" : "VEC2"
        },
        {
            "bufferView" : 19,
            "componentType" : 5123,
            "count" : 1065,
            "type" : "SCALAR"
        },
        {
            "bufferView" : 20,
            "componentType" : 5126,
            "count" : 325,
            "max" : [
                0.35400521755218506,
                0.065823033452034,
                0.23228450119495392
            ],
            "min" : [
                -0.36202314496040344,
                -0.01974232867360115,
                -0.23433007299900055
            ],
            "type" : "VEC3"
        },
        {
            "bufferView" : 21,
            "componentType" : 5126,
            "count" : 325,
            "type" : "VEC3"
        },
        {
            "bufferView" : 22,
            "componentType" : 5126,
            "count" : 325,
            "type" : "VEC4"
        },
        {
            "bufferView" : 23,
            "componentType" : 5126,
            "count" : 325,
            "type" : "VEC2"
        },
        {
            "bufferView" : 24,
            "componentType" : 5123,
            "count" : 1371,
            "type" : "SCALAR"
        },
        {
            "bufferView" : 25,
            "componentType" : 5126,
            "count" : 165,
            "max" : [
                0.35277095437049866,
                -0.00338573707267642,
                0.23228450119495392
            ],
            "min" : [
                -0.36202314496040344,
                -0.06402299553155899,
                -0.22351455688476562
            ],
            "type" : "VEC3"
        },
        {
            "bufferView" : 26,
            "componentType" : 5126,
            "count" : 165,
            "type" : "VEC3"
        },
        {
            "bufferView" : 27,
            "componentType" : 5126,
            "count" : 165,
            "type" : "VEC4"
        },
        {
            "bufferView" : 28,
            "componentType" : 5126,
            "count" : 165,
            "type" : "VEC2"
        },
        {
            "bufferView" : 29,
            "componentType" : 5123,
            "count" : 825,
            "type" : "SCALAR"
        },
        {
            "bufferView" : 30,
            "componentType" : 5126,
            "count" : 291,
            "max" : [
                0.35400521755218506,
                0.0656498447060585,
                0.23228450119495392
            ],
            "min" : [
                -0.36202314496040344,
                -0.01974232867360115,
                -0.23433007299900055
            ],
            "type" : "VEC3"
        },
        {
            "bufferView" : 31,
            "componentType" : 5126,
            "count" : 291,
            "type" : "VEC3"
        },
        {
            "bufferView" : 32,
            "componentType" : 5126,
            "count" : 291,
            "type" : "VEC4"
        },
        {
            "bufferView" : 33,
            "componentType" : 5126,
            "count" : 291,
            "type" : "VEC2"
        },
        {
            "bufferView" : 34,
            "componentType" : 5123,
            "count" : 1224,
            "type" : "SCALAR"
        },
        {
            "bufferView" : 35,
            "componentType" : 5126,
            "count" : 146,
            "max" : [
                0.35277095437049866,
                -0.00338573707267642,
                0.23228450119495392
            ],
            "min" : [
                -0.36202314496040344,
                -0.0640038251876831,
                -0.22351455688476562
            ],
            "type" : "VEC3"
        },
        {
            "bufferView" : 36,
            "componentType" : 5126,
            "count" : 146,
            "type" : "VEC3"
        },
        {
            "bufferView" : 37,
            "componentType" : 5126,
            "count" : 146,
            "type" : "VEC4"
        },
        {
            "bufferView" : 38,
            "componentType" : 5126,
            "count" : 146,
            "type" : "VEC2"
        },
        {
            "bufferView" : 39,
            "componentType" : 5123,
            "count" : 726,
            "type" : "SCALAR"
        },
        {
            "bufferView" : 40,
            "componentType" : 5126,
            "count" : 24,
            "max" : [
                1,
                1.1657037734985352,
                1.0521687269210815
            ],
            "min" : [
                -1,
                0,
                -1
            ],
            "type" : "VEC3"
        },
        {
            "bufferView" : 41,
            "componentType" : 5126,
            "count" : 24,
            "type" : "VEC3"
        },
        {
            "bufferView" : 42,
            "componentType" : 5126,
            "count" : 24,
            "type" : "VEC4"
        },
        {
            "bufferView" : 43,
            "componentType" : 5126,
            "count" : 24,
            "type" : "VEC2"
        },
        {
            "bufferView" : 44,
            "componentType" : 5123,
            "count" : 36,
            "type" : "SCALAR"
        },
        {
            "bufferView" : 45,
            "componentType" : 5126,
            "count" : 374,
            "max" : [
                0.7301319241523743,
                0.06841564178466797,
                0.7301222681999207
            ],
            "min" : [
                -0.7301284670829773,
                -156.62396240234375,
                -0.7301381230354309
            ],
            "type" : "VEC3"
        },
        {
            "bufferView" : 46,
            "componentType" : 5126,
            "count" : 374,
            "type" : "VEC3"
        },
        {
            "bufferView" : 47,
            "componentType" : 5126,
            "count" : 374,
            "type" : "VEC2"
        },
        {
            "bufferView" : 48,
            "componentType" : 5123,
            "count" : 912,
            "type" : "SCALAR"
        },
        {
            "bufferView" : 49,
            "componentType" : 5126,
            "count" : 60,
            "max" : [
                0.23135197162628174,
                0.06841564178466797,
                0.26713162660598755
            ],
            "min" : [
                -0.23134845495224,
                -156.62396240234375,
                -0.26714757084846497
            ],
            "type" : "VEC3"
        },
        {
            "bufferView" : 50,
            "componentType" : 5126,
            "count" : 60,
            "type" : "VEC3"
        },
        {
            "bufferView" : 51,
            "componentType" : 5126,
            "count" : 60,
            "type" : "VEC2"
        },
        {
            "bufferView" : 52,
            "componentType" : 5123,
            "count" : 96,
            "type" : "SCALAR"
        },
        {
            "bufferView" : 53,
            "componentType" : 5126,
            "count" : 374,
            "max" : [
                0.7301433682441711,
                0.06841564178466797,
                0.7301222681999207
            ],
            "min" : [
                -0.7301284670829773,
                -156.62396240234375,
                -0.7301304936408997
            ],
            "type" : "VEC3"
        },
        {
            "bufferView" : 54,
            "componentType" : 5126,
            "count" : 374,
            "type" : "VEC3"
        },
        {
            "bufferView" : 55,
            "componentType" : 5126,
            "count" : 374,
            "type" : "VEC2"
        },
        {
            "bufferView" : 56,
            "componentType" : 5126,
            "count" : 60,
            "max" : [
                0.2313634157180786,
                0.06841564178466797,
                0.26713162660598755
            ],
            "min" : [
                -0.23134845495224,
                -156.62396240234375,
                -0.2671399414539337
            ],
            "type" : "VEC3"
        },
        {
            "bufferView" : 57,
            "componentType" : 5126,
            "count" : 60,
            "type" : "VEC3"
        },
        {
            "bufferView" : 58,
            "componentType" : 5126,
            "count" : 60,
            "type" : "VEC2"
        },
        {
            "bufferView" : 59,
            "componentType" : 5126,
            "count" : 376,
            "max" : [
                0.7301337718963623,
                0.06841564178466797,
                0.7301222681999207
            ],
            "min" : [
                -0.7301284670829773,
                -156.62396240234375,
                -0.7301304936408997
            ],
            "type" : "VEC3"
        },
        {
            "bufferView" : 60,
            "componentType" : 5126,
            "count" : 376,
            "type" : "VEC3"
        },
        {
            "bufferView" : 61,
            "componentType" : 5126,
            "count" : 376,
            "type" : "VEC2"
        },
        {
            "bufferView" : 62,
            "componentType" : 5123,
            "count" : 912,
            "type" : "SCALAR"
        },
        {
            "bufferView" : 63,
            "componentType" : 5126,
            "count" : 60,
            "max" : [
                0.23135386407375336,
                0.06841564178466797,
                0.26713162660598755
            ],
            "min" : [
                -0.23134845495224,
                -156.62396240234375,
                -0.2671399414539337
            ],
            "type" : "VEC3"
        },
        {
            "bufferView" : 64,
            "componentType" : 5126,
            "count" : 60,
            "type" : "VEC3"
        },
        {
            "bufferView" : 65,
            "componentType" : 5126,
            "count" : 60,
            "type" : "VEC2"
        },
        {
            "bufferView" : 66,
            "componentType" : 5126,
            "count" : 376,
            "max" : [
                0.7301357388496399,
                0.06841564178466797,
                0.7301222681999207
            ],
            "min" : [
                -0.7301284670829773,
                -156.62396240234375,
                -0.7301533818244934
            ],
            "type" : "VEC3"
        },
        {
            "bufferView" : 67,
            "componentType" : 5126,
            "count" : 376,
            "type" : "VEC3"
        },
        {
            "bufferView" : 68,
            "componentType" : 5126,
            "count" : 376,
            "type" : "VEC2"
        },
        {
            "bufferView" : 69,
            "componentType" : 5126,
            "count" : 60,
            "max" : [
                0.23135578632354736,
                0.06841564178466797,
                0.26713162660598755
            ],
            "min" : [
                -0.23134845495224,
                -156.62396240234375,
                -0.26716282963752747
            ],
            "type" : "VEC3"
        },
        {
            "bufferView" : 70,
            "componentType" : 5126,
            "count" : 60,
            "type" : "VEC3"
        },
        {
            "bufferView" : 71,
            "componentType" : 5126,
            "count" : 60,
            "type" : "VEC2"
        },
        {
            "bufferView" : 72,
            "componentType" : 5126,
            "count" : 376,
            "max" : [
                0.7301337718963623,
                0.06841564178466797,
                0.7301222681999207
            ],
            "min" : [
                -0.7301284670829773,
                -156.62396240234375,
                -0.7301380634307861
            ],
            "type" : "VEC3"
        },
        {
            "bufferView" : 73,
            "componentType" : 5126,
            "count" : 376,
            "type" : "VEC3"
        },
        {
            "bufferView" : 74,
            "componentType" : 5126,
            "count" : 376,
            "type" : "VEC2"
        },
        {
            "bufferView" : 75,
            "componentType" : 5126,
            "count" : 60,
            "max" : [
                0.23135386407375336,
                0.06841564178466797,
                0.26713162660598755
            ],
            "min" : [
                -0.23134845495224,
                -156.62396240234375,
                -0.2671475410461426
            ],
            "type" : "VEC3"
        },
        {
            "bufferView" : 76,
            "componentType" : 5126,
            "count" : 60,
            "type" : "VEC3"
        },
        {
            "bufferView" : 77,
            "componentType" : 5126,
            "count" : 60,
            "type" : "VEC2"
        },
        {
            "bufferView" : 78,
            "componentType" : 5126,
            "count" : 376,
            "max" : [
                0.7301395535469055,
                0.06841564178466797,
                0.7301222681999207
            ],
            "min" : [
                -0.7301284670829773,
                -156.62396240234375,
                -0.7301381230354309
            ],
            "type" : "VEC3"
        },
        {
            "bufferView" : 79,
            "componentType" : 5126,
            "count" : 376,
            "type" : "VEC3"
        },
        {
            "bufferView" : 80,
            "componentType" : 5126,
            "count" : 376,
            "type" : "VEC2"
        },
        {
            "bufferView" : 81,
            "componentType" : 5126,
            "count" : 60,
            "max" : [
                0.231359601020813,
                0.06841564178466797,
                0.26713162660598755
            ],
            "min" : [
                -0.23134845495224,
                -156.62396240234375,
                -0.26714757084846497
            ],
            "type" : "VEC3"
        },
        {
            "bufferView" : 82,
            "componentType" : 5126,
            "count" : 60,
            "type" : "VEC3"
        },
        {
            "bufferView" : 83,
            "componentType" : 5126,
            "count" : 60,
            "type" : "VEC2"
        }
    ],
    "bufferViews" : [
        {
            "buffer" : 0,
            "byteLength" : 24384,
            "byteOffset" : 0
        },
        {
            "buffer" : 0,
            "byteLength" : 24384,
            "byteOffset" : 24384
        },
        {
            "buffer" : 0,
            "byteLength" : 16256,
            "byteOffset" : 48768
        },
        {
            "buffer" : 0,
            "byteLength" : 32512,
            "byteOffset" : 65024
        },
        {
            "buffer" : 0,
            "byteLength" : 12612,
            "byteOffset" : 97536
        },
        {
            "buffer" : 0,
            "byteLength" : 1476,
            "byteOffset" : 110148
        },
        {
            "buffer" : 0,
            "byteLength" : 1476,
            "byteOffset" : 111624
        },
        {
            "buffer" : 0,
            "byteLength" : 1968,
            "byteOffset" : 113100
        },
        {
            "buffer" : 0,
            "byteLength" : 984,
            "byteOffset" : 115068
        },
        {
            "buffer" : 0,
            "byteLength" : 1020,
            "byteOffset" : 116052
        },
        {
            "buffer" : 0,
            "byteLength" : 9564,
            "byteOffset" : 117072
        },
        {
            "buffer" : 0,
            "byteLength" : 9564,
            "byteOffset" : 126636
        },
        {
            "buffer" : 0,
            "byteLength" : 12752,
            "byteOffset" : 136200
        },
        {
            "buffer" : 0,
            "byteLength" : 6376,
            "byteOffset" : 148952
        },
        {
            "buffer" : 0,
            "byteLength" : 8844,
            "byteOffset" : 155328
        },
        {
            "buffer" : 0,
            "byteLength" : 2568,
            "byteOffset" : 164172
        },
        {
            "buffer" : 0,
            "byteLength" : 2568,
            "byteOffset" : 166740
        },
        {
            "buffer" : 0,
            "byteLength" : 3424,
            "byteOffset" : 169308
        },
        {
            "buffer" : 0,
            "byteLength" : 1712,
            "byteOffset" : 172732
        },
        {
            "buffer" : 0,
            "byteLength" : 2130,
            "byteOffset" : 174444
        },
        {
            "buffer" : 0,
            "byteLength" : 3900,
            "byteOffset" : 176576
        },
        {
            "buffer" : 0,
            "byteLength" : 3900,
            "byteOffset" : 180476
        },
        {
            "buffer" : 0,
            "byteLength" : 5200,
            "byteOffset" : 184376
        },
        {
            "buffer" : 0,
            "byteLength" : 2600,
            "byteOffset" : 189576
        },
        {
            "buffer" : 0,
            "byteLength" : 2742,
            "byteOffset" : 192176
        },
        {
            "buffer" : 0,
            "byteLength" : 1980,
            "byteOffset" : 194920
        },
        {
            "buffer" : 0,
            "byteLength" : 1980,
            "byteOffset" : 196900
        },
        {
            "buffer" : 0,
            "byteLength" : 2640,
            "byteOffset" : 198880
        },
        {
            "buffer" : 0,
            "byteLength" : 1320,
            "byteOffset" : 201520
        },
        {
            "buffer" : 0,
            "byteLength" : 1650,
            "byteOffset" : 202840
        },
        {
            "buffer" : 0,
            "byteLength" : 3492,
            "byteOffset" : 204492
        },
        {
            "buffer" : 0,
            "byteLength" : 3492,
            "byteOffset" : 207984
        },
        {
            "buffer" : 0,
            "byteLength" : 4656,
            "byteOffset" : 211476
        },
        {
            "buffer" : 0,
            "byteLength" : 2328,
            "byteOffset" : 216132
        },
        {
            "buffer" : 0,
            "byteLength" : 2448,
            "byteOffset" : 218460
        },
        {
            "buffer" : 0,
            "byteLength" : 1752,
            "byteOffset" : 220908
        },
        {
            "buffer" : 0,
            "byteLength" : 1752,
            "byteOffset" : 222660
        },
        {
            "buffer" : 0,
            "byteLength" : 2336,
            "byteOffset" : 224412
        },
        {
            "buffer" : 0,
            "byteLength" : 1168,
            "byteOffset" : 226748
        },
        {
            "buffer" : 0,
            "byteLength" : 1452,
            "byteOffset" : 227916
        },
        {
            "buffer" : 0,
            "byteLength" : 288,
            "byteOffset" : 229368
        },
        {
            "buffer" : 0,
            "byteLength" : 288,
            "byteOffset" : 229656
        },
        {
            "buffer" : 0,
            "byteLength" : 384,
            "byteOffset" : 229944
        },
        {
            "buffer" : 0,
            "byteLength" : 192,
            "byteOffset" : 230328
        },
        {
            "buffer" : 0,
            "byteLength" : 72,
            "byteOffset" : 230520
        },
        {
            "buffer" : 0,
            "byteLength" : 4488,
            "byteOffset" : 230592
        },
        {
            "buffer" : 0,
            "byteLength" : 4488,
            "byteOffset" : 235080
        },
        {
            "buffer" : 0,
            "byteLength" : 2992,
            "byteOffset" : 239568
        },
        {
            "buffer" : 0,
            "byteLength" : 1824,
            "byteOffset" : 242560
        },
        {
            "buffer" : 0,
            "byteLength" : 720,
            "byteOffset" : 244384
        },
        {
            "buffer" : 0,
            "byteLength" : 720,
            "byteOffset" : 245104
        },
        {
            "buffer" : 0,
            "byteLength" : 480,
            "byteOffset" : 245824
        },
        {
            "buffer" : 0,
            "byteLength" : 192,
            "byteOffset" : 246304
        },
        {
            "buffer" : 0,
            "byteLength" : 4488,
            "byteOffset" : 246496
        },
        {
            "buffer" : 0,
            "byteLength" : 4488,
            "byteOffset" : 250984
        },
        {
            "buffer" : 0,
            "byteLength" : 2992,
            "byteOffset" : 255472
        },
        {
            "buffer" : 0,
            "byteLength" : 720,
            "byteOffset" : 258464
        },
        {
            "buffer" : 0,
            "byteLength" : 720,
            "byteOffset" : 259184
        },
        {
            "buffer" : 0,
            "byteLength" : 480,
            "byteOffset" : 259904
        },
        {
            "buffer" : 0,
            "byteLength" : 4512,
            "byteOffset" : 260384
        },
        {
            "buffer" : 0,
            "byteLength" : 4512,
            "byteOffset" : 264896
        },
        {
            "buffer" : 0,
            "byteLength" : 3008,
            "byteOffset" : 269408
        },
        {
            "buffer" : 0,
            "byteLength" : 1824,
            "byteOffset" : 272416
        },
        {
            "buffer" : 0,
            "byteLength" : 720,
            "byteOffset" : 274240
        },
        {
            "buffer" : 0,
            "byteLength" : 720,
            "byteOffset" : 274960
        },
        {
            "buffer" : 0,
            "byteLength" : 480,
            "byteOffset" : 275680
        },
        {
            "buffer" : 0,
            "byteLength" : 4512,
            "byteOffset" : 276160
        },
        {
            "buffer" : 0,
            "byteLength" : 4512,
            "byteOffset" : 280672
        },
        {
            "buffer" : 0,
            "byteLength" : 3008,
            "byteOffset" : 285184
        },
        {
            "buffer" : 0,
            "byteLength" : 720,
            "byteOffset" : 288192
        },
        {
            "buffer" : 0,
            "byteLength" : 720,
            "byteOffset" : 288912
        },
        {
            "buffer" : 0,
            "byteLength" : 480,
            "byteOffset" : 289632
        },
        {
            "buffer" : 0,
            "byteLength" : 4512,
            "byteOffset" : 290112
        },
        {
            "buffer" : 0,
            "byteLength" : 4512,
            "byteOffset" : 294624
        },
        {
            "buffer" : 0,
            "byteLength" : 3008,
            "byteOffset" : 299136
        },
        {
            "buffer" : 0,
            "byteLength" : 720,
            "byteOffset" : 302144
        },
        {
            "buffer" : 0,
            "byteLength" : 720,
            "byteOffset" : 302864
        },
        {
            "buffer" : 0,
            "byteLength" : 480,
            "byteOffset" : 303584
        },
        {
            "buffer" : 0,
            "byteLength" : 4512,
            "byteOffset" : 304064
        },
        {
            "buffer" : 0,
            "byteLength" : 4512,
            "byteOffset" : 308576
        },
        {
            "buffer" : 0,
            "byteLength" : 3008,
            "byteOffset" : 313088
        },
        {
            "buffer" : 0,
            "byteLength" : 720,
            "byteOffset" : 316096
        },
        {
            "buffer" : 0,
            "byteLength" : 720,
            "byteOffset" : 316816
        },
        {
            "buffer" : 0,
            "byteLength" : 480,
            "byteOffset" : 317536
        }
    ],
    "buffers" : [
        {
            "byteLength" : 318016,
            "uri" : "ikea_neiden.bin"
        }
    ]
}
