{
    "asset" : {
        "generator" : "Khronos glTF Blender I/O v1.3.48",
        "version" : "2.0"
    },
    "scene" : 0,
    "scenes" : [
        {
            "name" : "Scene",
            "nodes" : [
                0,
                1
            ]
        }
    ],
    "nodes" : [
        {
            "mesh" : 0,
            "name" : "Light",
            "rotation" : [
                0.7071068286895752,
                0,
                0,
                0.7071068286895752
            ]
        },
        {
            "mesh" : 1,
            "name" : "Frame",
            "rotation" : [
                0.7071068286895752,
                0,
                0,
                0.7071068286895752
            ]
        }
    ],
    "materials" : [
        {
            "doubleSided" : true,
            "emissiveFactor" : [
                1,
                0.8790550827980042,
                0.27666181325912476
            ],
            "name" : "Light",
            "pbrMetallicRoughness" : {}
        },
        {
            "doubleSided" : true,
            "emissiveFactor" : [
                0,
                0,
                0
            ],
            "name" : "Metal",
            "pbrMetallicRoughness" : {
                "baseColorFactor" : [
                    0.6618639230728149,
                    0.6618639230728149,
                    0.6618639230728149,
                    1
                ],
                "metallicFactor" : 1,
                "roughnessFactor" : 0.6321428418159485
            }
        }
    ],
    "meshes" : [
        {
            "name" : "BezierCurve.003",
            "primitives" : [
                {
                    "attributes" : {
                        "POSITION" : 0,
                        "NORMAL" : 1,
                        "TANGENT" : 2,
                        "TEXCOORD_0" : 3
                    },
                    "indices" : 4,
                    "material" : 0
                }
            ]
        },
        {
            "name" : "BezierCurve.002",
            "primitives" : [
                {
                    "attributes" : {
                        "POSITION" : 5,
                        "NORMAL" : 6,
                        "TANGENT" : 7,
                        "TEXCOORD_0" : 8
                    },
                    "indices" : 9,
                    "material" : 1
                }
            ]
        }
    ],
    "accessors" : [
        {
            "bufferView" : 0,
            "componentType" : 5126,
            "count" : 1174,
            "max" : [
                0.14903928339481354,
                0.14903928339481354,
                0.04185314103960991
            ],
            "min" : [
                -0.14903928339481354,
                -0.14903928339481354,
                8.329377305926755e-05
            ],
            "type" : "VEC3"
        },
        {
            "bufferView" : 1,
            "componentType" : 5126,
            "count" : 1174,
            "type" : "VEC3"
        },
        {
            "bufferView" : 2,
            "componentType" : 5126,
            "count" : 1174,
            "type" : "VEC4"
        },
        {
            "bufferView" : 3,
            "componentType" : 5126,
            "count" : 1174,
            "type" : "VEC2"
        },
        {
            "bufferView" : 4,
            "componentType" : 5123,
            "count" : 4416,
            "type" : "SCALAR"
        },
        {
            "bufferView" : 5,
            "componentType" : 5126,
            "count" : 832,
            "max" : [
                0.14903928339481354,
                0.14903928339481354,
                0.012818578630685806
            ],
            "min" : [
                -0.14903928339481354,
                -0.14903928339481354,
                8.329377305926755e-05
            ],
            "type" : "VEC3"
        },
        {
            "bufferView" : 6,
            "componentType" : 5126,
            "count" : 832,
            "type" : "VEC3"
        },
        {
            "bufferView" : 7,
            "componentType" : 5126,
            "count" : 832,
            "type" : "VEC4"
        },
        {
            "bufferView" : 8,
            "componentType" : 5126,
            "count" : 832,
            "type" : "VEC2"
        },
        {
            "bufferView" : 9,
            "componentType" : 5123,
            "count" : 3072,
            "type" : "SCALAR"
        }
    ],
    "bufferViews" : [
        {
            "buffer" : 0,
            "byteLength" : 14088,
            "byteOffset" : 0
        },
        {
            "buffer" : 0,
            "byteLength" : 14088,
            "byteOffset" : 14088
        },
        {
            "buffer" : 0,
            "byteLength" : 18784,
            "byteOffset" : 28176
        },
        {
            "buffer" : 0,
            "byteLength" : 9392,
            "byteOffset" : 46960
        },
        {
            "buffer" : 0,
            "byteLength" : 8832,
            "byteOffset" : 56352
        },
        {
            "buffer" : 0,
            "byteLength" : 9984,
            "byteOffset" : 65184
        },
        {
            "buffer" : 0,
            "byteLength" : 9984,
            "byteOffset" : 75168
        },
        {
            "buffer" : 0,
            "byteLength" : 13312,
            "byteOffset" : 85152
        },
        {
            "buffer" : 0,
            "byteLength" : 6656,
            "byteOffset" : 98464
        },
        {
            "buffer" : 0,
            "byteLength" : 6144,
            "byteOffset" : 105120
        }
    ],
    "buffers" : [
        {
            "byteLength" : 111264,
            "uri" : "eglo.bin"
        }
    ]
}
