[gd_scene load_steps=3 format=2]

[ext_resource path="res://entities/player_character/player_character.gd" type="Script" id=1]

[sub_resource type="CapsuleShape" id=1]
radius = 0.2
height = 1.38

[node name="PlayerCharacter" type="KinematicBody"]
script = ExtResource( 1 )

[node name="Camera" type="Camera" parent="."]
transform = Transform( 1, 0, 0, 0, 1, 0, 0, 0, 1, 0, 1.57966, 0 )
far = 1024.0

[node name="RayCast" type="RayCast" parent="Camera"]
enabled = true
cast_to = Vector3( 0, 0, -2 )
collision_mask = 513
collide_with_areas = true

[node name="CollisionShape" type="CollisionShape" parent="."]
transform = Transform( 1, 0, 0, 0, -1.62921e-07, -1, 0, 1, -1.62921e-07, 0, 0.89, 0 )
shape = SubResource( 1 )
