[gd_scene load_steps=2 format=2]

[ext_resource path="res://ui/hud/overlays/overlay.gd" type="Script" id=1]

[node name="Overlay" type="ColorRect"]
anchor_right = 1.0
anchor_bottom = 1.0
color = Color( 0, 0, 0, 0.313726 )
script = ExtResource( 1 )
__meta__ = {
"_edit_use_anchors_": false
}
