{
    "asset" : {
        "generator" : "Khronos glTF Blender I/O v1.3.48",
        "version" : "2.0"
    },
    "scene" : 0,
    "scenes" : [
        {
            "name" : "Scene",
            "nodes" : [
                0,
                1
            ]
        }
    ],
    "nodes" : [
        {
            "mesh" : 0,
            "name" : "Chassis",
            "scale" : [
                0.20000000298023224,
                1,
                0.20000000298023224
            ]
        },
        {
            "mesh" : 1,
            "name" : "Hood"
        }
    ],
    "materials" : [
        {
            "doubleSided" : true,
            "emissiveFactor" : [
                0,
                0,
                0
            ],
            "name" : "Chrome",
            "pbrMetallicRoughness" : {
                "baseColorFactor" : [
                    0.2956925630569458,
                    0.2956925630569458,
                    0.2956925630569458,
                    1
                ],
                "metallicFactor" : 1,
                "roughnessFactor" : 0.699999988079071
            }
        },
        {
            "doubleSided" : true,
            "emissiveFactor" : [
                0,
                0,
                0
            ],
            "name" : "Plastic",
            "pbrMetallicRoughness" : {
                "baseColorFactor" : [
                    0.8000000715255737,
                    0.7579959034919739,
                    0.6398285031318665,
                    1
                ],
                "metallicFactor" : 0,
                "roughnessFactor" : 0.30000001192092896
            }
        },
        {
            "doubleSided" : true,
            "emissiveFactor" : [
                0,
                0,
                0
            ],
            "name" : "Shadow",
            "pbrMetallicRoughness" : {
                "baseColorFactor" : [
                    0.13286374509334564,
                    0.13286374509334564,
                    0.13286374509334564,
                    1
                ],
                "metallicFactor" : 0,
                "roughnessFactor" : 0.800000011920929
            }
        }
    ],
    "meshes" : [
        {
            "name" : "Plane",
            "primitives" : [
                {
                    "attributes" : {
                        "POSITION" : 0,
                        "NORMAL" : 1,
                        "TEXCOORD_0" : 2
                    },
                    "indices" : 3,
                    "material" : 0
                },
                {
                    "attributes" : {
                        "POSITION" : 4,
                        "NORMAL" : 5,
                        "TEXCOORD_0" : 6
                    },
                    "indices" : 7,
                    "material" : 1
                },
                {
                    "attributes" : {
                        "POSITION" : 8,
                        "NORMAL" : 9,
                        "TEXCOORD_0" : 10
                    },
                    "indices" : 11,
                    "material" : 2
                }
            ]
        },
        {
            "name" : "Plane.001",
            "primitives" : [
                {
                    "attributes" : {
                        "POSITION" : 12,
                        "NORMAL" : 13,
                        "TEXCOORD_0" : 14
                    },
                    "indices" : 15,
                    "material" : 0
                },
                {
                    "attributes" : {
                        "POSITION" : 16,
                        "NORMAL" : 17,
                        "TEXCOORD_0" : 18
                    },
                    "indices" : 19,
                    "material" : 1
                }
            ]
        }
    ],
    "accessors" : [
        {
            "bufferView" : 0,
            "componentType" : 5126,
            "count" : 58,
            "max" : [
                1,
                0.05000000074505806,
                1
            ],
            "min" : [
                -1,
                0,
                -1
            ],
            "type" : "VEC3"
        },
        {
            "bufferView" : 1,
            "componentType" : 5126,
            "count" : 58,
            "type" : "VEC3"
        },
        {
            "bufferView" : 2,
            "componentType" : 5126,
            "count" : 58,
            "type" : "VEC2"
        },
        {
            "bufferView" : 3,
            "componentType" : 5123,
            "count" : 180,
            "type" : "SCALAR"
        },
        {
            "bufferView" : 4,
            "componentType" : 5126,
            "count" : 93,
            "max" : [
                1,
                0.05000000074505806,
                1
            ],
            "min" : [
                -1,
                0,
                -1
            ],
            "type" : "VEC3"
        },
        {
            "bufferView" : 5,
            "componentType" : 5126,
            "count" : 93,
            "type" : "VEC3"
        },
        {
            "bufferView" : 6,
            "componentType" : 5126,
            "count" : 93,
            "type" : "VEC2"
        },
        {
            "bufferView" : 7,
            "componentType" : 5123,
            "count" : 324,
            "type" : "SCALAR"
        },
        {
            "bufferView" : 8,
            "componentType" : 5126,
            "count" : 41,
            "max" : [
                0.8481518626213074,
                0.05000000074505806,
                0.8348619937896729
            ],
            "min" : [
                -0.8481518626213074,
                0.005221710540354252,
                -0.8348619937896729
            ],
            "type" : "VEC3"
        },
        {
            "bufferView" : 9,
            "componentType" : 5126,
            "count" : 41,
            "type" : "VEC3"
        },
        {
            "bufferView" : 10,
            "componentType" : 5126,
            "count" : 41,
            "type" : "VEC2"
        },
        {
            "bufferView" : 11,
            "componentType" : 5123,
            "count" : 180,
            "type" : "SCALAR"
        },
        {
            "bufferView" : 12,
            "componentType" : 5126,
            "count" : 429,
            "max" : [
                0.1514914631843567,
                0.04965192824602127,
                0.1514914631843567
            ],
            "min" : [
                -0.1514914631843567,
                0.03965193033218384,
                -0.1514914631843567
            ],
            "type" : "VEC3"
        },
        {
            "bufferView" : 13,
            "componentType" : 5126,
            "count" : 429,
            "type" : "VEC3"
        },
        {
            "bufferView" : 14,
            "componentType" : 5126,
            "count" : 429,
            "type" : "VEC2"
        },
        {
            "bufferView" : 15,
            "componentType" : 5123,
            "count" : 1332,
            "type" : "SCALAR"
        },
        {
            "bufferView" : 16,
            "componentType" : 5126,
            "count" : 90,
            "max" : [
                0.1514914631843567,
                0.04965192824602127,
                0.1514914631843567
            ],
            "min" : [
                -0.1514914631843567,
                0.03965193033218384,
                -0.1514914631843567
            ],
            "type" : "VEC3"
        },
        {
            "bufferView" : 17,
            "componentType" : 5126,
            "count" : 90,
            "type" : "VEC3"
        },
        {
            "bufferView" : 18,
            "componentType" : 5126,
            "count" : 90,
            "type" : "VEC2"
        },
        {
            "bufferView" : 19,
            "componentType" : 5123,
            "count" : 264,
            "type" : "SCALAR"
        }
    ],
    "bufferViews" : [
        {
            "buffer" : 0,
            "byteLength" : 696,
            "byteOffset" : 0
        },
        {
            "buffer" : 0,
            "byteLength" : 696,
            "byteOffset" : 696
        },
        {
            "buffer" : 0,
            "byteLength" : 464,
            "byteOffset" : 1392
        },
        {
            "buffer" : 0,
            "byteLength" : 360,
            "byteOffset" : 1856
        },
        {
            "buffer" : 0,
            "byteLength" : 1116,
            "byteOffset" : 2216
        },
        {
            "buffer" : 0,
            "byteLength" : 1116,
            "byteOffset" : 3332
        },
        {
            "buffer" : 0,
            "byteLength" : 744,
            "byteOffset" : 4448
        },
        {
            "buffer" : 0,
            "byteLength" : 648,
            "byteOffset" : 5192
        },
        {
            "buffer" : 0,
            "byteLength" : 492,
            "byteOffset" : 5840
        },
        {
            "buffer" : 0,
            "byteLength" : 492,
            "byteOffset" : 6332
        },
        {
            "buffer" : 0,
            "byteLength" : 328,
            "byteOffset" : 6824
        },
        {
            "buffer" : 0,
            "byteLength" : 360,
            "byteOffset" : 7152
        },
        {
            "buffer" : 0,
            "byteLength" : 5148,
            "byteOffset" : 7512
        },
        {
            "buffer" : 0,
            "byteLength" : 5148,
            "byteOffset" : 12660
        },
        {
            "buffer" : 0,
            "byteLength" : 3432,
            "byteOffset" : 17808
        },
        {
            "buffer" : 0,
            "byteLength" : 2664,
            "byteOffset" : 21240
        },
        {
            "buffer" : 0,
            "byteLength" : 1080,
            "byteOffset" : 23904
        },
        {
            "buffer" : 0,
            "byteLength" : 1080,
            "byteOffset" : 24984
        },
        {
            "buffer" : 0,
            "byteLength" : 720,
            "byteOffset" : 26064
        },
        {
            "buffer" : 0,
            "byteLength" : 528,
            "byteOffset" : 26784
        }
    ],
    "buffers" : [
        {
            "byteLength" : 27312,
            "uri" : "bathroom_vent.bin"
        }
    ]
}
