[gd_scene load_steps=5 format=2]

[ext_resource path="res://locations/location.tscn" type="PackedScene" id=1]
[ext_resource path="res://entities/storm/storm.tscn" type="PackedScene" id=2]
[ext_resource path="res://assets/models/architecture/door/fixed_door.tscn" type="PackedScene" id=3]

[sub_resource type="Environment" id=1]
background_mode = 1
background_color = Color( 0.294118, 0.184314, 0.101961, 1 )
background_energy = 0.0
ambient_light_color = Color( 0.333333, 0.14902, 0.0313726, 1 )
ambient_light_energy = 0.1
ambient_light_sky_contribution = 0.0
tonemap_mode = 2
tonemap_exposure = 0.84
tonemap_white = 1.18
auto_exposure_scale = 0.12
ssao_enabled = true
ssao_radius = 0.25
ssao_intensity = 1.48
ssao_light_affect = 0.22
ssao_quality = 2
ssao_blur = 2
glow_enabled = true
glow_intensity = 0.27
glow_strength = 0.9
glow_bloom = 1.0
glow_hdr_threshold = 0.81
glow_hdr_luminance_cap = 13.88
glow_hdr_scale = 2.25
glow_bicubic_upscale = true

[node name="Room" instance=ExtResource( 1 )]

[node name="PlayerCharacter" parent="." index="0"]
transform = Transform( -1, 0, -8.74228e-08, 0, 1, 0, 8.74228e-08, 0, -1, -1.06927, 0, -2.50154 )

[node name="FrontDoor" parent="Architecture" index="0" instance=ExtResource( 3 )]
transform = Transform( 1, 0, 0, 0, 1, 0, 0, 0, 1, -1.09, 0, -3.04 )

[node name="Downlights" type="Node" parent="." index="2"]

[node name="SpotLight" type="OmniLight" parent="Environment" index="0"]
transform = Transform( 1, 0, 0, 0, 1, -0.00048887, 0, 0.00048887, 1, -0.396841, 1.22312, 2.64056 )
light_color = Color( 0.67451, 0.376471, 0.156863, 1 )
light_energy = 1.72
shadow_enabled = true
shadow_bias = 0.0
shadow_reverse_cull_face = true
__meta__ = {
"_editor_description_": ""
}

[node name="Storm" parent="Environment" index="1" instance=ExtResource( 2 )]

[node name="WorldEnvironment" type="WorldEnvironment" parent="Environment" index="2"]
environment = SubResource( 1 )
