{
    "asset" : {
        "generator" : "Khronos glTF Blender I/O v1.3.48",
        "version" : "2.0"
    },
    "scene" : 0,
    "scenes" : [
        {
            "name" : "Scene",
            "nodes" : [
                2
            ]
        }
    ],
    "nodes" : [
        {
            "name" : "SeatMirror",
            "translation" : [
                0.0005336552858352661,
                0.38593435287475586,
                0.03920655697584152
            ]
        },
        {
            "children" : [
                0
            ],
            "mesh" : 0,
            "name" : "Seat"
        },
        {
            "children" : [
                1
            ],
            "mesh" : 1,
            "name" : "Base"
        }
    ],
    "materials" : [
        {
            "doubleSided" : true,
            "emissiveFactor" : [
                0,
                0,
                0
            ],
            "name" : "Wood",
            "normalTexture" : {
                "index" : 0,
                "scale" : 0.7000000476837158,
                "texCoord" : 0
            },
            "pbrMetallicRoughness" : {
                "baseColorTexture" : {
                    "index" : 1,
                    "texCoord" : 0
                },
                "metallicFactor" : 0,
                "metallicRoughnessTexture" : {
                    "index" : 2,
                    "texCoord" : 0
                }
            }
        }
    ],
    "meshes" : [
        {
            "name" : "Plane",
            "primitives" : [
                {
                    "attributes" : {
                        "POSITION" : 0,
                        "NORMAL" : 1,
                        "TANGENT" : 2,
                        "TEXCOORD_0" : 3
                    },
                    "indices" : 4,
                    "material" : 0
                }
            ]
        },
        {
            "name" : "Circle",
            "primitives" : [
                {
                    "attributes" : {
                        "POSITION" : 5,
                        "NORMAL" : 6,
                        "TEXCOORD_0" : 7
                    },
                    "indices" : 8,
                    "material" : 0
                }
            ]
        }
    ],
    "textures" : [
        {
            "source" : 0
        },
        {
            "source" : 1
        },
        {
            "source" : 2
        }
    ],
    "images" : [
        {
            "mimeType" : "image/png",
            "name" : "oak_normal",
            "uri" : "oak_normal.png"
        },
        {
            "mimeType" : "image/png",
            "name" : "oak_diffuse",
            "uri" : "oak_diffuse.png"
        },
        {
            "mimeType" : "image/png",
            "name" : "oak_roughness",
            "uri" : "oak_roughness.png"
        }
    ],
    "accessors" : [
        {
            "bufferView" : 0,
            "componentType" : 5126,
            "count" : 1294,
            "max" : [
                0.23606789112091064,
                0.39679792523384094,
                0.2536134719848633
            ],
            "min" : [
                -0.23500056564807892,
                0.37759092450141907,
                -0.17520035803318024
            ],
            "type" : "VEC3"
        },
        {
            "bufferView" : 1,
            "componentType" : 5126,
            "count" : 1294,
            "type" : "VEC3"
        },
        {
            "bufferView" : 2,
            "componentType" : 5126,
            "count" : 1294,
            "type" : "VEC4"
        },
        {
            "bufferView" : 3,
            "componentType" : 5126,
            "count" : 1294,
            "type" : "VEC2"
        },
        {
            "bufferView" : 4,
            "componentType" : 5123,
            "count" : 4992,
            "type" : "SCALAR"
        },
        {
            "bufferView" : 5,
            "componentType" : 5126,
            "count" : 2935,
            "max" : [
                0.23930001258850098,
                0.8500000238418579,
                0.25429999828338623
            ],
            "min" : [
                -0.23930001258850098,
                0,
                -0.2542203366756439
            ],
            "type" : "VEC3"
        },
        {
            "bufferView" : 6,
            "componentType" : 5126,
            "count" : 2935,
            "type" : "VEC3"
        },
        {
            "bufferView" : 7,
            "componentType" : 5126,
            "count" : 2935,
            "type" : "VEC2"
        },
        {
            "bufferView" : 8,
            "componentType" : 5123,
            "count" : 8580,
            "type" : "SCALAR"
        }
    ],
    "bufferViews" : [
        {
            "buffer" : 0,
            "byteLength" : 15528,
            "byteOffset" : 0
        },
        {
            "buffer" : 0,
            "byteLength" : 15528,
            "byteOffset" : 15528
        },
        {
            "buffer" : 0,
            "byteLength" : 20704,
            "byteOffset" : 31056
        },
        {
            "buffer" : 0,
            "byteLength" : 10352,
            "byteOffset" : 51760
        },
        {
            "buffer" : 0,
            "byteLength" : 9984,
            "byteOffset" : 62112
        },
        {
            "buffer" : 0,
            "byteLength" : 35220,
            "byteOffset" : 72096
        },
        {
            "buffer" : 0,
            "byteLength" : 35220,
            "byteOffset" : 107316
        },
        {
            "buffer" : 0,
            "byteLength" : 23480,
            "byteOffset" : 142536
        },
        {
            "buffer" : 0,
            "byteLength" : 17160,
            "byteOffset" : 166016
        }
    ],
    "buffers" : [
        {
            "byteLength" : 183176,
            "uri" : "perch.bin"
        }
    ]
}
