[gd_scene load_steps=3 format=2]

[ext_resource path="res://game_states/gameplay_state.tscn" type="PackedScene" id=1]
[ext_resource path="res://classes/state/state_machine.gd" type="Script" id=2]

[node name="Game" type="Node"]
script = ExtResource( 2 )

[node name="GameplayState" parent="." instance=ExtResource( 1 )]
