[gd_scene load_steps=2 format=2]

[ext_resource path="res://entities/useables/doors/hinged_door.gd" type="Script" id=1]

[node name="HingedDoor" type="Area"]
collision_layer = 513
collision_mask = 513
script = ExtResource( 1 )

[node name="CollisionShape" type="CollisionShape" parent="."]
transform = Transform( 1, 0, 0, 0, 1, 0, 0, 0, 1, 0, 1, 0 )

[node name="MovementCollider" type="StaticBody" parent="."]

[node name="CollisionShape" type="CollisionShape" parent="MovementCollider"]
transform = Transform( 1, 0, 0, 0, 1, 0, 0, 0, 1, 0, 1, 0 )

[node name="Tween" type="Tween" parent="."]
