[gd_scene load_steps=3 format=2]

[sub_resource type="Image" id=3]
data = {
"data": PoolByteArray( 0, 0, 0, 0, 0, 0, 0, 0, 0, 0, 0, 0, 0, 0, 0, 0, 0, 0, 0, 0, 0, 0, 0, 0, 35, 36, 51, 255, 35, 36, 51, 255, 35, 36, 51, 255, 35, 36, 51, 255, 35, 36, 51, 255, 35, 36, 51, 255, 35, 36, 51, 255, 35, 36, 51, 255, 35, 36, 51, 255, 35, 36, 51, 255, 35, 36, 51, 255, 35, 36, 51, 255, 35, 36, 51, 255, 35, 36, 51, 255, 35, 36, 51, 255, 35, 36, 51, 255, 35, 36, 51, 255, 35, 36, 51, 255, 35, 36, 51, 255, 35, 36, 51, 255, 0, 0, 0, 0, 0, 0, 0, 0, 0, 0, 0, 0, 0, 0, 0, 0, 0, 0, 0, 0, 0, 0, 0, 0, 0, 0, 0, 0, 0, 0, 0, 0, 0, 0, 0, 0, 0, 0, 0, 0, 0, 0, 0, 0, 0, 0, 0, 0, 35, 36, 51, 255, 35, 36, 51, 255, 35, 36, 51, 255, 35, 36, 51, 255, 35, 36, 51, 255, 35, 36, 51, 255, 35, 36, 51, 255, 35, 36, 51, 255, 35, 36, 51, 255, 35, 36, 51, 255, 35, 36, 51, 255, 35, 36, 51, 255, 35, 36, 51, 255, 35, 36, 51, 255, 35, 36, 51, 255, 35, 36, 51, 255, 35, 36, 51, 255, 35, 36, 51, 255, 35, 36, 51, 255, 35, 36, 51, 255, 0, 0, 0, 0, 0, 0, 0, 0, 0, 0, 0, 0, 0, 0, 0, 0, 0, 0, 0, 0, 0, 0, 0, 0, 0, 0, 0, 0, 0, 0, 0, 0, 0, 0, 0, 0, 0, 0, 0, 0, 0, 0, 0, 0, 0, 0, 0, 0, 35, 36, 51, 255, 35, 36, 51, 255, 35, 36, 51, 255, 35, 36, 51, 255, 35, 36, 51, 255, 35, 36, 51, 255, 35, 36, 51, 255, 35, 36, 51, 255, 35, 36, 51, 255, 35, 36, 51, 255, 35, 36, 51, 255, 35, 36, 51, 255, 35, 36, 51, 255, 35, 36, 51, 255, 35, 36, 51, 255, 35, 36, 51, 255, 35, 36, 51, 255, 35, 36, 51, 255, 35, 36, 51, 255, 35, 36, 51, 255, 0, 0, 0, 0, 0, 0, 0, 0, 0, 0, 0, 0, 0, 0, 0, 0, 0, 0, 0, 0, 0, 0, 0, 0, 0, 0, 0, 0, 0, 0, 0, 0, 0, 0, 0, 0, 0, 0, 0, 0, 0, 0, 0, 0, 0, 0, 0, 0, 35, 36, 51, 255, 35, 36, 51, 255, 35, 36, 51, 255, 35, 36, 51, 255, 35, 36, 51, 255, 35, 36, 51, 255, 35, 36, 51, 255, 35, 36, 51, 255, 35, 36, 51, 255, 35, 36, 51, 255, 35, 36, 51, 255, 35, 36, 51, 255, 35, 36, 51, 255, 35, 36, 51, 255, 35, 36, 51, 255, 35, 36, 51, 255, 35, 36, 51, 255, 35, 36, 51, 255, 35, 36, 51, 255, 35, 36, 51, 255, 0, 0, 0, 0, 0, 0, 0, 0, 0, 0, 0, 0, 0, 0, 0, 0, 0, 0, 0, 0, 0, 0, 0, 0, 0, 0, 0, 0, 0, 0, 0, 0, 0, 0, 0, 0, 0, 0, 0, 0, 0, 0, 0, 0, 0, 0, 0, 0, 71, 55, 89, 255, 71, 55, 89, 255, 35, 36, 51, 255, 35, 36, 51, 255, 35, 36, 51, 255, 35, 36, 51, 255, 35, 36, 51, 255, 35, 36, 51, 255, 35, 36, 51, 255, 35, 36, 51, 255, 35, 36, 51, 255, 35, 36, 51, 255, 35, 36, 51, 255, 35, 36, 51, 255, 35, 36, 51, 255, 35, 36, 51, 255, 35, 36, 51, 255, 35, 36, 51, 255, 71, 55, 89, 255, 71, 55, 89, 255, 0, 0, 0, 0, 0, 0, 0, 0, 0, 0, 0, 0, 0, 0, 0, 0, 0, 0, 0, 0, 0, 0, 0, 0, 0, 0, 0, 0, 0, 0, 0, 0, 0, 0, 0, 0, 0, 0, 0, 0, 0, 0, 0, 0, 0, 0, 0, 0, 152, 135, 159, 255, 152, 135, 159, 255, 71, 55, 89, 255, 71, 55, 89, 255, 35, 36, 51, 255, 35, 36, 51, 255, 35, 36, 51, 255, 35, 36, 51, 255, 35, 36, 51, 255, 35, 36, 51, 255, 35, 36, 51, 255, 35, 36, 51, 255, 35, 36, 51, 255, 35, 36, 51, 255, 35, 36, 51, 255, 35, 36, 51, 255, 71, 55, 89, 255, 71, 55, 89, 255, 152, 135, 159, 255, 152, 135, 159, 255, 0, 0, 0, 0, 0, 0, 0, 0, 0, 0, 0, 0, 0, 0, 0, 0, 0, 0, 0, 0, 0, 0, 0, 0, 0, 0, 0, 0, 0, 0, 0, 0, 0, 0, 0, 0, 0, 0, 0, 0, 0, 0, 0, 0, 0, 0, 0, 0, 152, 135, 159, 255, 152, 135, 159, 255, 152, 135, 159, 255, 71, 55, 89, 255, 35, 36, 51, 255, 35, 36, 51, 255, 35, 36, 51, 255, 35, 36, 51, 255, 35, 36, 51, 255, 35, 36, 51, 255, 35, 36, 51, 255, 35, 36, 51, 255, 35, 36, 51, 255, 35, 36, 51, 255, 35, 36, 51, 255, 71, 55, 89, 255, 152, 135, 159, 255, 152, 135, 159, 255, 152, 135, 159, 255, 152, 135, 159, 255, 0, 0, 0, 0, 0, 0, 0, 0, 0, 0, 0, 0, 0, 0, 0, 0, 0, 0, 0, 0, 0, 0, 0, 0, 0, 0, 0, 0, 0, 0, 0, 0, 0, 0, 0, 0, 0, 0, 0, 0, 0, 0, 0, 0, 0, 0, 0, 0, 152, 135, 159, 255, 152, 135, 159, 255, 152, 135, 159, 255, 152, 135, 159, 255, 71, 55, 89, 255, 35, 36, 51, 255, 35, 36, 51, 255, 35, 36, 51, 255, 35, 36, 51, 255, 35, 36, 51, 255, 35, 36, 51, 255, 35, 36, 51, 255, 35, 36, 51, 255, 35, 36, 51, 255, 35, 36, 51, 255, 71, 55, 89, 255, 152, 135, 159, 255, 152, 135, 159, 255, 152, 135, 159, 255, 152, 135, 159, 255, 0, 0, 0, 0, 0, 0, 0, 0, 0, 0, 0, 0, 0, 0, 0, 0, 0, 0, 0, 0, 0, 0, 0, 0, 0, 0, 0, 0, 0, 0, 0, 0, 0, 0, 0, 0, 0, 0, 0, 0, 0, 0, 0, 0, 0, 0, 0, 0, 152, 135, 159, 255, 152, 135, 159, 255, 195, 179, 200, 255, 152, 135, 159, 255, 71, 55, 89, 255, 35, 36, 51, 255, 35, 36, 51, 255, 35, 36, 51, 255, 35, 36, 51, 255, 35, 36, 51, 255, 35, 36, 51, 255, 35, 36, 51, 255, 35, 36, 51, 255, 35, 36, 51, 255, 71, 55, 89, 255, 152, 135, 159, 255, 152, 135, 159, 255, 195, 179, 200, 255, 152, 135, 159, 255, 152, 135, 159, 255, 0, 0, 0, 0, 0, 0, 0, 0, 0, 0, 0, 0, 0, 0, 0, 0, 0, 0, 0, 0, 0, 0, 0, 0, 0, 0, 0, 0, 0, 0, 0, 0, 0, 0, 0, 0, 0, 0, 0, 0, 0, 0, 0, 0, 0, 0, 0, 0, 152, 135, 159, 255, 195, 179, 200, 255, 195, 179, 200, 255, 152, 135, 159, 255, 152, 135, 159, 255, 71, 55, 89, 255, 35, 36, 51, 255, 35, 36, 51, 255, 35, 36, 51, 255, 35, 36, 51, 255, 35, 36, 51, 255, 35, 36, 51, 255, 35, 36, 51, 255, 35, 36, 51, 255, 71, 55, 89, 255, 152, 135, 159, 255, 195, 179, 200, 255, 195, 179, 200, 255, 152, 135, 159, 255, 152, 135, 159, 255, 0, 0, 0, 0, 0, 0, 0, 0, 0, 0, 0, 0, 0, 0, 0, 0, 0, 0, 0, 0, 0, 0, 0, 0, 0, 0, 0, 0, 0, 0, 0, 0, 0, 0, 0, 0, 0, 0, 0, 0, 0, 0, 0, 0, 0, 0, 0, 0, 152, 135, 159, 255, 195, 179, 200, 255, 195, 179, 200, 255, 195, 179, 200, 255, 152, 135, 159, 255, 71, 55, 89, 255, 35, 36, 51, 255, 35, 36, 51, 255, 35, 36, 51, 255, 35, 36, 51, 255, 35, 36, 51, 255, 35, 36, 51, 255, 35, 36, 51, 255, 35, 36, 51, 255, 71, 55, 89, 255, 152, 135, 159, 255, 195, 179, 200, 255, 195, 179, 200, 255, 195, 179, 200, 255, 152, 135, 159, 255, 0, 0, 0, 0, 0, 0, 0, 0, 0, 0, 0, 0, 0, 0, 0, 0, 0, 0, 0, 0, 0, 0, 0, 0, 0, 0, 0, 0, 0, 0, 0, 0, 0, 0, 0, 0, 0, 0, 0, 0, 0, 0, 0, 0, 0, 0, 0, 0, 195, 179, 200, 255, 195, 179, 200, 255, 195, 179, 200, 255, 195, 179, 200, 255, 152, 135, 159, 255, 152, 135, 159, 255, 71, 55, 89, 255, 35, 36, 51, 255, 35, 36, 51, 255, 35, 36, 51, 255, 35, 36, 51, 255, 35, 36, 51, 255, 35, 36, 51, 255, 71, 55, 89, 255, 152, 135, 159, 255, 152, 135, 159, 255, 195, 179, 200, 255, 195, 179, 200, 255, 195, 179, 200, 255, 152, 135, 159, 255, 0, 0, 0, 0, 0, 0, 0, 0, 0, 0, 0, 0, 0, 0, 0, 0, 0, 0, 0, 0, 0, 0, 0, 0, 0, 0, 0, 0, 0, 0, 0, 0, 0, 0, 0, 0, 0, 0, 0, 0, 0, 0, 0, 0, 0, 0, 0, 0, 195, 179, 200, 255, 195, 179, 200, 255, 195, 179, 200, 255, 195, 179, 200, 255, 152, 135, 159, 255, 152, 135, 159, 255, 71, 55, 89, 255, 35, 36, 51, 255, 35, 36, 51, 255, 35, 36, 51, 255, 35, 36, 51, 255, 35, 36, 51, 255, 35, 36, 51, 255, 71, 55, 89, 255, 152, 135, 159, 255, 152, 135, 159, 255, 195, 179, 200, 255, 195, 179, 200, 255, 195, 179, 200, 255, 195, 179, 200, 255, 0, 0, 0, 0, 0, 0, 0, 0, 0, 0, 0, 0, 0, 0, 0, 0, 0, 0, 0, 0, 0, 0, 0, 0, 0, 0, 0, 0, 0, 0, 0, 0, 0, 0, 0, 0, 0, 0, 0, 0, 0, 0, 0, 0, 0, 0, 0, 0, 195, 179, 200, 255, 195, 179, 200, 255, 195, 179, 200, 255, 195, 179, 200, 255, 195, 179, 200, 255, 152, 135, 159, 255, 71, 55, 89, 255, 35, 36, 51, 255, 35, 36, 51, 255, 35, 36, 51, 255, 35, 36, 51, 255, 35, 36, 51, 255, 35, 36, 51, 255, 71, 55, 89, 255, 152, 135, 159, 255, 195, 179, 200, 255, 195, 179, 200, 255, 195, 179, 200, 255, 195, 179, 200, 255, 195, 179, 200, 255, 0, 0, 0, 0, 0, 0, 0, 0, 0, 0, 0, 0, 0, 0, 0, 0, 0, 0, 0, 0, 0, 0, 0, 0, 0, 0, 0, 0, 0, 0, 0, 0, 0, 0, 0, 0, 0, 0, 0, 0, 0, 0, 0, 0, 0, 0, 0, 0, 195, 179, 200, 255, 195, 179, 200, 255, 195, 179, 200, 255, 195, 179, 200, 255, 195, 179, 200, 255, 152, 135, 159, 255, 71, 55, 89, 255, 35, 36, 51, 255, 35, 36, 51, 255, 35, 36, 51, 255, 35, 36, 51, 255, 35, 36, 51, 255, 35, 36, 51, 255, 71, 55, 89, 255, 152, 135, 159, 255, 195, 179, 200, 255, 195, 179, 200, 255, 195, 179, 200, 255, 195, 179, 200, 255, 195, 179, 200, 255, 0, 0, 0, 0, 0, 0, 0, 0, 0, 0, 0, 0, 0, 0, 0, 0, 0, 0, 0, 0, 0, 0, 0, 0, 0, 0, 0, 0, 0, 0, 0, 0, 0, 0, 0, 0, 0, 0, 0, 0, 0, 0, 0, 0, 0, 0, 0, 0, 195, 179, 200, 255, 195, 179, 200, 255, 195, 179, 200, 255, 195, 179, 200, 255, 195, 179, 200, 255, 152, 135, 159, 255, 71, 55, 89, 255, 35, 36, 51, 255, 35, 36, 51, 255, 35, 36, 51, 255, 35, 36, 51, 255, 35, 36, 51, 255, 35, 36, 51, 255, 71, 55, 89, 255, 152, 135, 159, 255, 195, 179, 200, 255, 195, 179, 200, 255, 195, 179, 200, 255, 195, 179, 200, 255, 152, 135, 159, 255, 0, 0, 0, 0, 0, 0, 0, 0, 0, 0, 0, 0, 0, 0, 0, 0, 0, 0, 0, 0, 0, 0, 0, 0, 0, 0, 0, 0, 0, 0, 0, 0, 0, 0, 0, 0, 0, 0, 0, 0, 0, 0, 0, 0, 0, 0, 0, 0, 71, 55, 89, 255, 152, 135, 159, 255, 195, 179, 200, 255, 195, 179, 200, 255, 195, 179, 200, 255, 195, 179, 200, 255, 71, 55, 89, 255, 35, 36, 51, 255, 35, 36, 51, 255, 35, 36, 51, 255, 35, 36, 51, 255, 35, 36, 51, 255, 35, 36, 51, 255, 71, 55, 89, 255, 195, 179, 200, 255, 195, 179, 200, 255, 195, 179, 200, 255, 195, 179, 200, 255, 195, 179, 200, 255, 71, 55, 89, 255, 0, 0, 0, 0, 0, 0, 0, 0, 0, 0, 0, 0, 0, 0, 0, 0, 0, 0, 0, 0, 0, 0, 0, 0, 0, 0, 0, 0, 0, 0, 0, 0, 0, 0, 0, 0, 0, 0, 0, 0, 0, 0, 0, 0, 0, 0, 0, 0, 71, 55, 89, 255, 71, 55, 89, 255, 152, 135, 159, 255, 195, 179, 200, 255, 195, 179, 200, 255, 195, 179, 200, 255, 71, 55, 89, 255, 35, 36, 51, 255, 35, 36, 51, 255, 35, 36, 51, 255, 35, 36, 51, 255, 35, 36, 51, 255, 35, 36, 51, 255, 71, 55, 89, 255, 195, 179, 200, 255, 195, 179, 200, 255, 195, 179, 200, 255, 152, 135, 159, 255, 71, 55, 89, 255, 71, 55, 89, 255, 0, 0, 0, 0, 0, 0, 0, 0, 0, 0, 0, 0, 0, 0, 0, 0, 0, 0, 0, 0, 0, 0, 0, 0, 0, 0, 0, 0, 0, 0, 0, 0, 0, 0, 0, 0, 0, 0, 0, 0, 0, 0, 0, 0, 0, 0, 0, 0, 152, 135, 159, 255, 71, 55, 89, 255, 71, 55, 89, 255, 152, 135, 159, 255, 195, 179, 200, 255, 195, 179, 200, 255, 71, 55, 89, 255, 35, 36, 51, 255, 35, 36, 51, 255, 35, 36, 51, 255, 35, 36, 51, 255, 35, 36, 51, 255, 35, 36, 51, 255, 71, 55, 89, 255, 195, 179, 200, 255, 195, 179, 200, 255, 152, 135, 159, 255, 71, 55, 89, 255, 71, 55, 89, 255, 152, 135, 159, 255, 0, 0, 0, 0, 0, 0, 0, 0, 0, 0, 0, 0, 0, 0, 0, 0, 0, 0, 0, 0, 0, 0, 0, 0, 0, 0, 0, 0, 0, 0, 0, 0, 0, 0, 0, 0, 0, 0, 0, 0, 0, 0, 0, 0, 0, 0, 0, 0, 152, 135, 159, 255, 152, 135, 159, 255, 71, 55, 89, 255, 71, 55, 89, 255, 195, 179, 200, 255, 195, 179, 200, 255, 71, 55, 89, 255, 35, 36, 51, 255, 35, 36, 51, 255, 35, 36, 51, 255, 35, 36, 51, 255, 35, 36, 51, 255, 35, 36, 51, 255, 71, 55, 89, 255, 195, 179, 200, 255, 195, 179, 200, 255, 71, 55, 89, 255, 71, 55, 89, 255, 152, 135, 159, 255, 152, 135, 159, 255, 0, 0, 0, 0, 0, 0, 0, 0, 0, 0, 0, 0, 0, 0, 0, 0, 0, 0, 0, 0, 0, 0, 0, 0, 0, 0, 0, 0, 0, 0, 0, 0, 0, 0, 0, 0, 0, 0, 0, 0, 0, 0, 0, 0, 0, 0, 0, 0, 152, 135, 159, 255, 152, 135, 159, 255, 152, 135, 159, 255, 71, 55, 89, 255, 152, 135, 159, 255, 195, 179, 200, 255, 71, 55, 89, 255, 35, 36, 51, 255, 35, 36, 51, 255, 35, 36, 51, 255, 35, 36, 51, 255, 35, 36, 51, 255, 35, 36, 51, 255, 71, 55, 89, 255, 195, 179, 200, 255, 152, 135, 159, 255, 71, 55, 89, 255, 152, 135, 159, 255, 152, 135, 159, 255, 152, 135, 159, 255, 0, 0, 0, 0, 0, 0, 0, 0, 0, 0, 0, 0, 0, 0, 0, 0, 0, 0, 0, 0, 0, 0, 0, 0, 0, 0, 0, 0, 0, 0, 0, 0, 0, 0, 0, 0, 0, 0, 0, 0, 0, 0, 0, 0, 0, 0, 0, 0, 152, 135, 159, 255, 152, 135, 159, 255, 152, 135, 159, 255, 71, 55, 89, 255, 152, 135, 159, 255, 195, 179, 200, 255, 71, 55, 89, 255, 26, 33, 32, 255, 26, 33, 32, 255, 26, 33, 32, 255, 26, 33, 32, 255, 26, 33, 32, 255, 26, 33, 32, 255, 71, 55, 89, 255, 195, 179, 200, 255, 152, 135, 159, 255, 71, 55, 89, 255, 152, 135, 159, 255, 152, 135, 159, 255, 152, 135, 159, 255, 0, 0, 0, 0, 0, 0, 0, 0, 0, 0, 0, 0, 0, 0, 0, 0, 0, 0, 0, 0, 0, 0, 0, 0, 0, 0, 0, 0, 0, 0, 0, 0, 0, 0, 0, 0, 0, 0, 0, 0, 0, 0, 0, 0, 0, 0, 0, 0, 152, 135, 159, 255, 152, 135, 159, 255, 195, 179, 200, 255, 152, 135, 159, 255, 71, 55, 89, 255, 195, 179, 200, 255, 71, 55, 89, 255, 66, 72, 73, 255, 66, 72, 73, 255, 66, 72, 73, 255, 66, 72, 73, 255, 66, 72, 73, 255, 66, 72, 73, 255, 71, 55, 89, 255, 195, 179, 200, 255, 71, 55, 89, 255, 152, 135, 159, 255, 195, 179, 200, 255, 152, 135, 159, 255, 152, 135, 159, 255, 0, 0, 0, 0, 0, 0, 0, 0, 0, 0, 0, 0, 0, 0, 0, 0, 0, 0, 0, 0, 0, 0, 0, 0, 0, 0, 0, 0, 0, 0, 0, 0, 0, 0, 0, 0, 0, 0, 0, 0, 0, 0, 0, 0, 0, 0, 0, 0, 152, 135, 159, 255, 195, 179, 200, 255, 195, 179, 200, 255, 152, 135, 159, 255, 71, 55, 89, 255, 195, 179, 200, 255, 152, 135, 159, 255, 66, 72, 73, 255, 66, 72, 73, 255, 66, 72, 73, 255, 66, 72, 73, 255, 66, 72, 73, 255, 66, 72, 73, 255, 152, 135, 159, 255, 195, 179, 200, 255, 71, 55, 89, 255, 152, 135, 159, 255, 195, 179, 200, 255, 195, 179, 200, 255, 152, 135, 159, 255, 0, 0, 0, 0, 0, 0, 0, 0, 0, 0, 0, 0, 0, 0, 0, 0, 0, 0, 0, 0, 0, 0, 0, 0, 0, 0, 0, 0, 0, 0, 0, 0, 0, 0, 0, 0, 0, 0, 0, 0, 0, 0, 0, 0, 0, 0, 0, 0, 152, 135, 159, 255, 195, 179, 200, 255, 195, 179, 200, 255, 195, 179, 200, 255, 71, 55, 89, 255, 195, 179, 200, 255, 152, 135, 159, 255, 66, 72, 73, 255, 94, 113, 115, 255, 94, 113, 115, 255, 94, 113, 115, 255, 94, 113, 115, 255, 66, 72, 73, 255, 152, 135, 159, 255, 195, 179, 200, 255, 71, 55, 89, 255, 195, 179, 200, 255, 195, 179, 200, 255, 195, 179, 200, 255, 152, 135, 159, 255, 0, 0, 0, 0, 0, 0, 0, 0, 0, 0, 0, 0, 0, 0, 0, 0, 0, 0, 0, 0, 0, 0, 0, 0, 0, 0, 0, 0, 0, 0, 0, 0, 0, 0, 0, 0, 0, 0, 0, 0, 0, 0, 0, 0, 0, 0, 0, 0, 152, 135, 159, 255, 195, 179, 200, 255, 152, 135, 159, 255, 71, 55, 89, 255, 71, 55, 89, 255, 195, 179, 200, 255, 152, 135, 159, 255, 66, 72, 73, 255, 94, 113, 115, 255, 94, 113, 115, 255, 94, 113, 115, 255, 94, 113, 115, 255, 66, 72, 73, 255, 152, 135, 159, 255, 195, 179, 200, 255, 71, 55, 89, 255, 195, 179, 200, 255, 195, 179, 200, 255, 195, 179, 200, 255, 152, 135, 159, 255, 0, 0, 0, 0, 0, 0, 0, 0, 0, 0, 0, 0, 0, 0, 0, 0, 0, 0, 0, 0, 0, 0, 0, 0, 0, 0, 0, 0, 0, 0, 0, 0, 0, 0, 0, 0, 0, 0, 0, 0, 0, 0, 0, 0, 0, 0, 0, 0, 152, 135, 159, 255, 195, 179, 200, 255, 195, 179, 200, 255, 195, 179, 200, 255, 71, 55, 89, 255, 195, 179, 200, 255, 152, 135, 159, 255, 66, 72, 73, 255, 94, 113, 115, 255, 94, 113, 115, 255, 94, 113, 115, 255, 94, 113, 115, 255, 66, 72, 73, 255, 152, 135, 159, 255, 195, 179, 200, 255, 71, 55, 89, 255, 71, 55, 89, 255, 152, 135, 159, 255, 195, 179, 200, 255, 152, 135, 159, 255, 0, 0, 0, 0, 0, 0, 0, 0, 0, 0, 0, 0, 0, 0, 0, 0, 0, 0, 0, 0, 0, 0, 0, 0, 0, 0, 0, 0, 0, 0, 0, 0, 0, 0, 0, 0, 0, 0, 0, 0, 0, 0, 0, 0, 0, 0, 0, 0, 195, 179, 200, 255, 195, 179, 200, 255, 195, 179, 200, 255, 71, 55, 89, 255, 152, 135, 159, 255, 195, 179, 200, 255, 195, 179, 200, 255, 152, 135, 159, 255, 94, 113, 115, 255, 94, 113, 115, 255, 94, 113, 115, 255, 94, 113, 115, 255, 152, 135, 159, 255, 195, 179, 200, 255, 195, 179, 200, 255, 71, 55, 89, 255, 195, 179, 200, 255, 195, 179, 200, 255, 195, 179, 200, 255, 195, 179, 200, 255, 0, 0, 0, 0, 0, 0, 0, 0, 0, 0, 0, 0, 0, 0, 0, 0, 0, 0, 0, 0, 0, 0, 0, 0, 0, 0, 0, 0, 0, 0, 0, 0, 0, 0, 0, 0, 0, 0, 0, 0, 0, 0, 0, 0, 0, 0, 0, 0, 195, 179, 200, 255, 152, 135, 159, 255, 152, 135, 159, 255, 195, 179, 200, 255, 152, 135, 159, 255, 195, 179, 200, 255, 195, 179, 200, 255, 152, 135, 159, 255, 94, 113, 115, 255, 94, 113, 115, 255, 94, 113, 115, 255, 94, 113, 115, 255, 152, 135, 159, 255, 195, 179, 200, 255, 195, 179, 200, 255, 152, 135, 159, 255, 71, 55, 89, 255, 195, 179, 200, 255, 195, 179, 200, 255, 195, 179, 200, 255, 0, 0, 0, 0, 0, 0, 0, 0, 0, 0, 0, 0, 0, 0, 0, 0, 0, 0, 0, 0, 0, 0, 0, 0, 0, 0, 0, 0, 0, 0, 0, 0, 0, 0, 0, 0, 0, 0, 0, 0, 0, 0, 0, 0, 0, 0, 0, 0, 195, 179, 200, 255, 195, 179, 200, 255, 195, 179, 200, 255, 195, 179, 200, 255, 152, 135, 159, 255, 195, 179, 200, 255, 195, 179, 200, 255, 152, 135, 159, 255, 94, 113, 115, 255, 94, 113, 115, 255, 94, 113, 115, 255, 94, 113, 115, 255, 152, 135, 159, 255, 195, 179, 200, 255, 195, 179, 200, 255, 152, 135, 159, 255, 195, 179, 200, 255, 152, 135, 159, 255, 152, 135, 159, 255, 195, 179, 200, 255, 0, 0, 0, 0, 0, 0, 0, 0, 0, 0, 0, 0, 0, 0, 0, 0, 0, 0, 0, 0, 0, 0, 0, 0, 0, 0, 0, 0, 0, 0, 0, 0, 0, 0, 0, 0, 0, 0, 0, 0, 0, 0, 0, 0, 0, 0, 0, 0, 195, 179, 200, 255, 195, 179, 200, 255, 195, 179, 200, 255, 152, 135, 159, 255, 195, 179, 200, 255, 195, 179, 200, 255, 195, 179, 200, 255, 152, 135, 159, 255, 94, 113, 115, 255, 94, 113, 115, 255, 94, 113, 115, 255, 94, 113, 115, 255, 152, 135, 159, 255, 195, 179, 200, 255, 195, 179, 200, 255, 195, 179, 200, 255, 152, 135, 159, 255, 195, 179, 200, 255, 195, 179, 200, 255, 195, 179, 200, 255, 0, 0, 0, 0, 0, 0, 0, 0, 0, 0, 0, 0, 0, 0, 0, 0, 0, 0, 0, 0, 0, 0, 0, 0, 0, 0, 0, 0, 0, 0, 0, 0, 0, 0, 0, 0, 0, 0, 0, 0, 0, 0, 0, 0, 0, 0, 0, 0, 195, 179, 200, 255, 176, 158, 160, 255, 176, 158, 160, 255, 152, 135, 159, 255, 195, 179, 200, 255, 195, 179, 200, 255, 195, 179, 200, 255, 152, 135, 159, 255, 94, 113, 115, 255, 94, 113, 115, 255, 94, 113, 115, 255, 94, 113, 115, 255, 152, 135, 159, 255, 195, 179, 200, 255, 195, 179, 200, 255, 195, 179, 200, 255, 152, 135, 159, 255, 176, 158, 160, 255, 176, 158, 160, 255, 195, 179, 200, 255, 0, 0, 0, 0, 0, 0, 0, 0, 0, 0, 0, 0, 0, 0, 0, 0, 0, 0, 0, 0, 0, 0, 0, 0, 0, 0, 0, 0, 0, 0, 0, 0, 0, 0, 0, 0, 0, 0, 0, 0, 0, 0, 0, 0, 0, 0, 0, 0, 195, 179, 200, 255, 176, 158, 160, 255, 195, 179, 200, 255, 152, 135, 159, 255, 195, 179, 200, 255, 195, 179, 200, 255, 152, 135, 159, 255, 152, 135, 159, 255, 94, 113, 115, 255, 94, 113, 115, 255, 94, 113, 115, 255, 94, 113, 115, 255, 152, 135, 159, 255, 152, 135, 159, 255, 195, 179, 200, 255, 195, 179, 200, 255, 152, 135, 159, 255, 195, 179, 200, 255, 176, 158, 160, 255, 195, 179, 200, 255, 0, 0, 0, 0, 0, 0, 0, 0, 0, 0, 0, 0, 0, 0, 0, 0, 0, 0, 0, 0, 0, 0, 0, 0, 0, 0, 0, 0, 0, 0, 0, 0, 0, 0, 0, 0, 0, 0, 0, 0, 0, 0, 0, 0, 0, 0, 0, 0, 195, 179, 200, 255, 195, 179, 200, 255, 195, 179, 200, 255, 152, 135, 159, 255, 195, 179, 200, 255, 195, 179, 200, 255, 152, 135, 159, 255, 152, 135, 159, 255, 94, 113, 115, 255, 94, 113, 115, 255, 94, 113, 115, 255, 94, 113, 115, 255, 152, 135, 159, 255, 152, 135, 159, 255, 195, 179, 200, 255, 195, 179, 200, 255, 152, 135, 159, 255, 195, 179, 200, 255, 195, 179, 200, 255, 195, 179, 200, 255, 0, 0, 0, 0, 0, 0, 0, 0, 0, 0, 0, 0, 0, 0, 0, 0, 0, 0, 0, 0, 0, 0, 0, 0, 0, 0, 0, 0, 0, 0, 0, 0, 0, 0, 0, 0, 0, 0, 0, 0, 0, 0, 0, 0, 0, 0, 0, 0, 195, 179, 200, 255, 195, 179, 200, 255, 195, 179, 200, 255, 152, 135, 159, 255, 195, 179, 200, 255, 195, 179, 200, 255, 152, 135, 159, 255, 152, 135, 159, 255, 94, 113, 115, 255, 94, 113, 115, 255, 94, 113, 115, 255, 94, 113, 115, 255, 152, 135, 159, 255, 152, 135, 159, 255, 195, 179, 200, 255, 195, 179, 200, 255, 152, 135, 159, 255, 195, 179, 200, 255, 195, 179, 200, 255, 195, 179, 200, 255, 0, 0, 0, 0, 0, 0, 0, 0, 0, 0, 0, 0, 0, 0, 0, 0, 0, 0, 0, 0, 0, 0, 0, 0, 0, 0, 0, 0, 0, 0, 0, 0, 0, 0, 0, 0, 0, 0, 0, 0, 0, 0, 0, 0, 0, 0, 0, 0, 195, 179, 200, 255, 195, 179, 200, 255, 152, 135, 159, 255, 195, 179, 200, 255, 195, 179, 200, 255, 195, 179, 200, 255, 152, 135, 159, 255, 152, 135, 159, 255, 94, 113, 115, 255, 94, 113, 115, 255, 94, 113, 115, 255, 94, 113, 115, 255, 152, 135, 159, 255, 152, 135, 159, 255, 195, 179, 200, 255, 195, 179, 200, 255, 152, 135, 159, 255, 195, 179, 200, 255, 195, 179, 200, 255, 195, 179, 200, 255, 0, 0, 0, 0, 0, 0, 0, 0, 0, 0, 0, 0, 0, 0, 0, 0, 0, 0, 0, 0, 0, 0, 0, 0, 0, 0, 0, 0, 0, 0, 0, 0, 0, 0, 0, 0, 0, 0, 0, 0, 0, 0, 0, 0, 0, 0, 0, 0, 195, 179, 200, 255, 195, 179, 200, 255, 195, 179, 200, 255, 195, 179, 200, 255, 195, 179, 200, 255, 152, 135, 159, 255, 195, 179, 200, 255, 152, 135, 159, 255, 94, 113, 115, 255, 94, 113, 115, 255, 94, 113, 115, 255, 94, 113, 115, 255, 152, 135, 159, 255, 195, 179, 200, 255, 152, 135, 159, 255, 195, 179, 200, 255, 195, 179, 200, 255, 152, 135, 159, 255, 195, 179, 200, 255, 195, 179, 200, 255, 0, 0, 0, 0, 0, 0, 0, 0, 0, 0, 0, 0, 0, 0, 0, 0, 0, 0, 0, 0, 0, 0, 0, 0, 0, 0, 0, 0, 0, 0, 0, 0, 0, 0, 0, 0, 0, 0, 0, 0, 0, 0, 0, 0, 0, 0, 0, 0, 0, 0, 0, 0, 195, 179, 200, 255, 195, 179, 200, 255, 195, 179, 200, 255, 195, 179, 200, 255, 152, 135, 159, 255, 195, 179, 200, 255, 152, 135, 159, 255, 94, 113, 115, 255, 94, 113, 115, 255, 94, 113, 115, 255, 94, 113, 115, 255, 152, 135, 159, 255, 195, 179, 200, 255, 152, 135, 159, 255, 195, 179, 200, 255, 195, 179, 200, 255, 195, 179, 200, 255, 195, 179, 200, 255, 0, 0, 0, 0, 0, 0, 0, 0, 0, 0, 0, 0, 0, 0, 0, 0, 0, 0, 0, 0, 0, 0, 0, 0, 0, 0, 0, 0, 0, 0, 0, 0, 0, 0, 0, 0, 0, 0, 0, 0, 0, 0, 0, 0, 0, 0, 0, 0, 0, 0, 0, 0, 0, 0, 0, 0, 152, 135, 159, 255, 195, 179, 200, 255, 195, 179, 200, 255, 195, 179, 200, 255, 152, 135, 159, 255, 176, 158, 160, 255, 152, 135, 159, 255, 94, 113, 115, 255, 94, 113, 115, 255, 94, 113, 115, 255, 94, 113, 115, 255, 152, 135, 159, 255, 176, 158, 160, 255, 152, 135, 159, 255, 195, 179, 200, 255, 195, 179, 200, 255, 195, 179, 200, 255, 152, 135, 159, 255, 0, 0, 0, 0, 0, 0, 0, 0, 0, 0, 0, 0, 0, 0, 0, 0, 0, 0, 0, 0, 0, 0, 0, 0, 0, 0, 0, 0, 0, 0, 0, 0, 0, 0, 0, 0, 0, 0, 0, 0, 0, 0, 0, 0, 0, 0, 0, 0, 0, 0, 0, 0, 0, 0, 0, 0, 0, 0, 0, 0, 152, 135, 159, 255, 152, 135, 159, 255, 152, 135, 159, 255, 71, 55, 89, 255, 195, 179, 200, 255, 152, 135, 159, 255, 66, 72, 73, 255, 94, 113, 115, 255, 94, 113, 115, 255, 66, 72, 73, 255, 152, 135, 159, 255, 195, 179, 200, 255, 71, 55, 89, 255, 152, 135, 159, 255, 152, 135, 159, 255, 152, 135, 159, 255, 0, 0, 0, 0, 0, 0, 0, 0, 0, 0, 0, 0, 0, 0, 0, 0, 0, 0, 0, 0, 0, 0, 0, 0, 0, 0, 0, 0, 0, 0, 0, 0, 0, 0, 0, 0, 0, 0, 0, 0, 0, 0, 0, 0, 0, 0, 0, 0, 0, 0, 0, 0, 0, 0, 0, 0, 0, 0, 0, 0, 0, 0, 0, 0, 0, 0, 0, 0, 71, 55, 89, 255, 71, 55, 89, 255, 71, 55, 89, 255, 152, 135, 159, 255, 152, 135, 159, 255, 66, 72, 73, 255, 66, 72, 73, 255, 66, 72, 73, 255, 66, 72, 73, 255, 152, 135, 159, 255, 152, 135, 159, 255, 71, 55, 89, 255, 71, 55, 89, 255, 71, 55, 89, 255, 0, 0, 0, 0, 0, 0, 0, 0, 0, 0, 0, 0, 0, 0, 0, 0, 0, 0, 0, 0, 0, 0, 0, 0, 0, 0, 0, 0, 0, 0, 0, 0, 0, 0, 0, 0, 0, 0, 0, 0, 0, 0, 0, 0, 0, 0, 0, 0, 0, 0, 0, 0, 0, 0, 0, 0, 0, 0, 0, 0, 0, 0, 0, 0, 0, 0, 0, 0, 0, 0, 0, 0, 0, 0, 0, 0, 0, 0, 0, 0, 71, 55, 89, 255, 71, 55, 89, 255, 152, 135, 159, 255, 26, 33, 32, 255, 134, 98, 115, 255, 134, 98, 115, 255, 26, 33, 32, 255, 152, 135, 159, 255, 71, 55, 89, 255, 71, 55, 89, 255, 0, 0, 0, 0, 0, 0, 0, 0, 0, 0, 0, 0, 0, 0, 0, 0, 0, 0, 0, 0, 0, 0, 0, 0, 0, 0, 0, 0, 0, 0, 0, 0, 0, 0, 0, 0, 0, 0, 0, 0, 0, 0, 0, 0, 0, 0, 0, 0, 0, 0, 0, 0, 0, 0, 0, 0, 0, 0, 0, 0, 0, 0, 0, 0, 0, 0, 0, 0, 0, 0, 0, 0, 0, 0, 0, 0, 0, 0, 0, 0, 0, 0, 0, 0, 0, 0, 0, 0, 0, 0, 0, 0, 0, 0, 0, 0, 0, 0, 0, 0, 43, 34, 50, 255, 43, 34, 50, 255, 43, 34, 50, 255, 43, 34, 50, 255, 0, 0, 0, 0, 0, 0, 0, 0, 0, 0, 0, 0, 0, 0, 0, 0, 0, 0, 0, 0, 0, 0, 0, 0, 0, 0, 0, 0, 0, 0, 0, 0, 0, 0, 0, 0, 0, 0, 0, 0, 0, 0, 0, 0, 0, 0, 0, 0, 0, 0, 0, 0, 0, 0, 0, 0, 0, 0, 0, 0, 0, 0, 0, 0, 0, 0, 0, 0, 0, 0, 0, 0, 0, 0, 0, 0, 0, 0, 0, 0, 0, 0, 0, 0, 0, 0, 0, 0, 0, 0, 0, 0, 0, 0, 0, 0, 0, 0, 0, 0, 0, 0, 0, 0, 0, 0, 0, 0, 71, 55, 89, 255, 71, 55, 89, 255, 134, 98, 115, 255, 134, 98, 115, 255, 71, 55, 89, 255, 71, 55, 89, 255, 0, 0, 0, 0, 0, 0, 0, 0, 0, 0, 0, 0, 0, 0, 0, 0, 0, 0, 0, 0, 0, 0, 0, 0, 0, 0, 0, 0, 0, 0, 0, 0, 0, 0, 0, 0, 0, 0, 0, 0, 0, 0, 0, 0, 0, 0, 0, 0, 0, 0, 0, 0, 0, 0, 0, 0, 0, 0, 0, 0, 0, 0, 0, 0, 0, 0, 0, 0, 0, 0, 0, 0, 0, 0, 0, 0, 0, 0, 0, 0, 0, 0, 0, 0, 0, 0, 0, 0, 0, 0, 0, 0, 0, 0, 0, 0, 0, 0, 0, 0, 0, 0, 0, 0, 134, 98, 115, 255, 134, 98, 115, 255, 134, 98, 115, 255, 134, 98, 115, 255, 134, 98, 115, 255, 134, 98, 115, 255, 0, 0, 0, 0, 0, 0, 0, 0, 0, 0, 0, 0, 0, 0, 0, 0, 0, 0, 0, 0, 0, 0, 0, 0, 0, 0, 0, 0, 0, 0, 0, 0, 0, 0, 0, 0, 0, 0, 0, 0, 0, 0, 0, 0, 0, 0, 0, 0, 0, 0, 0, 0, 0, 0, 0, 0, 0, 0, 0, 0, 0, 0, 0, 0, 0, 0, 0, 0, 0, 0, 0, 0, 0, 0, 0, 0, 0, 0, 0, 0, 0, 0, 0, 0, 0, 0, 0, 0, 0, 0, 0, 0, 0, 0, 0, 0, 0, 0, 0, 0, 134, 98, 115, 255, 162, 135, 138, 255, 162, 135, 138, 255, 134, 98, 115, 255, 134, 98, 115, 255, 162, 135, 138, 255, 162, 135, 138, 255, 134, 98, 115, 255, 0, 0, 0, 0, 0, 0, 0, 0, 0, 0, 0, 0, 0, 0, 0, 0, 0, 0, 0, 0, 0, 0, 0, 0, 0, 0, 0, 0, 0, 0, 0, 0, 0, 0, 0, 0, 0, 0, 0, 0, 0, 0, 0, 0, 0, 0, 0, 0, 0, 0, 0, 0, 0, 0, 0, 0, 0, 0, 0, 0, 0, 0, 0, 0, 0, 0, 0, 0, 0, 0, 0, 0, 0, 0, 0, 0, 0, 0, 0, 0, 0, 0, 0, 0, 0, 0, 0, 0, 0, 0, 0, 0, 71, 55, 89, 255, 134, 98, 115, 255, 162, 135, 138, 255, 43, 34, 50, 255, 43, 34, 50, 255, 43, 34, 50, 255, 43, 34, 50, 255, 162, 135, 138, 255, 134, 98, 115, 255, 71, 55, 89, 255, 0, 0, 0, 0, 0, 0, 0, 0, 0, 0, 0, 0, 0, 0, 0, 0, 0, 0, 0, 0, 0, 0, 0, 0, 0, 0, 0, 0, 0, 0, 0, 0, 0, 0, 0, 0, 0, 0, 0, 0, 0, 0, 0, 0, 0, 0, 0, 0, 0, 0, 0, 0, 0, 0, 0, 0, 0, 0, 0, 0, 0, 0, 0, 0, 0, 0, 0, 0, 0, 0, 0, 0, 0, 0, 0, 0, 0, 0, 0, 0, 0, 0, 0, 0, 0, 0, 0, 0, 134, 98, 115, 255, 134, 98, 115, 255, 134, 98, 115, 255, 162, 135, 138, 255, 162, 135, 138, 255, 162, 135, 138, 255, 162, 135, 138, 255, 134, 98, 115, 255, 134, 98, 115, 255, 134, 98, 115, 255, 0, 0, 0, 0, 0, 0, 0, 0, 0, 0, 0, 0, 0, 0, 0, 0, 0, 0, 0, 0, 0, 0, 0, 0, 0, 0, 0, 0, 0, 0, 0, 0, 0, 0, 0, 0, 0, 0, 0, 0, 0, 0, 0, 0, 0, 0, 0, 0, 0, 0, 0, 0, 0, 0, 0, 0, 0, 0, 0, 0, 0, 0, 0, 0, 0, 0, 0, 0, 0, 0, 0, 0, 0, 0, 0, 0, 0, 0, 0, 0, 0, 0, 0, 0, 134, 98, 115, 255, 162, 135, 138, 255, 162, 135, 138, 255, 162, 135, 138, 255, 134, 98, 115, 255, 71, 55, 89, 255, 43, 34, 50, 255, 134, 98, 115, 255, 162, 135, 138, 255, 162, 135, 138, 255, 162, 135, 138, 255, 134, 98, 115, 255, 0, 0, 0, 0, 0, 0, 0, 0, 0, 0, 0, 0, 0, 0, 0, 0, 0, 0, 0, 0, 0, 0, 0, 0, 0, 0, 0, 0, 0, 0, 0, 0, 0, 0, 0, 0, 0, 0, 0, 0, 0, 0, 0, 0, 0, 0, 0, 0, 0, 0, 0, 0, 0, 0, 0, 0, 0, 0, 0, 0, 0, 0, 0, 0, 0, 0, 0, 0, 0, 0, 0, 0, 0, 0, 0, 0, 134, 98, 115, 255, 162, 135, 138, 255, 71, 55, 89, 255, 71, 55, 89, 255, 162, 135, 138, 255, 162, 135, 138, 255, 162, 135, 138, 255, 134, 98, 115, 255, 162, 135, 138, 255, 162, 135, 138, 255, 71, 55, 89, 255, 71, 55, 89, 255, 162, 135, 138, 255, 134, 98, 115, 255, 0, 0, 0, 0, 0, 0, 0, 0, 0, 0, 0, 0, 0, 0, 0, 0, 0, 0, 0, 0, 0, 0, 0, 0, 0, 0, 0, 0, 0, 0, 0, 0, 0, 0, 0, 0, 0, 0, 0, 0, 0, 0, 0, 0, 0, 0, 0, 0, 0, 0, 0, 0, 0, 0, 0, 0, 0, 0, 0, 0, 0, 0, 0, 0, 0, 0, 0, 0, 71, 55, 89, 255, 162, 135, 138, 255, 162, 135, 138, 255, 162, 135, 138, 255, 134, 98, 115, 255, 71, 55, 89, 255, 162, 135, 138, 255, 162, 135, 138, 255, 134, 98, 115, 255, 134, 98, 115, 255, 71, 55, 89, 255, 134, 98, 115, 255, 162, 135, 138, 255, 162, 135, 138, 255, 162, 135, 138, 255, 71, 55, 89, 255, 0, 0, 0, 0, 0, 0, 0, 0, 0, 0, 0, 0, 0, 0, 0, 0, 0, 0, 0, 0, 0, 0, 0, 0, 0, 0, 0, 0, 0, 0, 0, 0, 0, 0, 0, 0, 0, 0, 0, 0, 0, 0, 0, 0, 0, 0, 0, 0, 0, 0, 0, 0, 0, 0, 0, 0, 0, 0, 0, 0, 0, 0, 0, 0, 71, 55, 89, 255, 134, 98, 115, 255, 162, 135, 138, 255, 134, 98, 115, 255, 71, 55, 89, 255, 43, 34, 50, 255, 43, 34, 50, 255, 162, 135, 138, 255, 134, 98, 115, 255, 43, 34, 50, 255, 43, 34, 50, 255, 71, 55, 89, 255, 134, 98, 115, 255, 162, 135, 138, 255, 134, 98, 115, 255, 71, 55, 89, 255, 0, 0, 0, 0, 0, 0, 0, 0, 0, 0, 0, 0, 0, 0, 0, 0, 0, 0, 0, 0, 0, 0, 0, 0, 0, 0, 0, 0, 0, 0, 0, 0, 0, 0, 0, 0, 0, 0, 0, 0, 0, 0, 0, 0, 0, 0, 0, 0, 0, 0, 0, 0, 0, 0, 0, 0, 0, 0, 0, 0, 0, 0, 0, 0, 71, 55, 89, 255, 134, 98, 115, 255, 134, 98, 115, 255, 71, 55, 89, 255, 43, 34, 50, 255, 43, 34, 50, 255, 43, 34, 50, 255, 162, 135, 138, 255, 162, 135, 138, 255, 43, 34, 50, 255, 43, 34, 50, 255, 43, 34, 50, 255, 71, 55, 89, 255, 134, 98, 115, 255, 134, 98, 115, 255, 71, 55, 89, 255, 0, 0, 0, 0, 0, 0, 0, 0, 0, 0, 0, 0, 0, 0, 0, 0, 0, 0, 0, 0, 0, 0, 0, 0, 0, 0, 0, 0, 0, 0, 0, 0, 0, 0, 0, 0, 0, 0, 0, 0, 0, 0, 0, 0, 0, 0, 0, 0, 0, 0, 0, 0, 0, 0, 0, 0, 0, 0, 0, 0, 0, 0, 0, 0, 71, 55, 89, 255, 134, 98, 115, 255, 162, 135, 138, 255, 162, 135, 138, 255, 134, 98, 115, 255, 134, 98, 115, 255, 71, 55, 89, 255, 162, 135, 138, 255, 162, 135, 138, 255, 71, 55, 89, 255, 134, 98, 115, 255, 134, 98, 115, 255, 162, 135, 138, 255, 162, 135, 138, 255, 134, 98, 115, 255, 71, 55, 89, 255, 0, 0, 0, 0, 0, 0, 0, 0, 0, 0, 0, 0, 0, 0, 0, 0, 0, 0, 0, 0, 0, 0, 0, 0, 0, 0, 0, 0, 0, 0, 0, 0, 0, 0, 0, 0, 0, 0, 0, 0, 0, 0, 0, 0, 0, 0, 0, 0, 0, 0, 0, 0, 0, 0, 0, 0, 0, 0, 0, 0, 0, 0, 0, 0, 71, 55, 89, 255, 134, 98, 115, 255, 134, 98, 115, 255, 134, 98, 115, 255, 134, 98, 115, 255, 71, 55, 89, 255, 162, 135, 138, 255, 162, 135, 138, 255, 162, 135, 138, 255, 162, 135, 138, 255, 71, 55, 89, 255, 134, 98, 115, 255, 134, 98, 115, 255, 134, 98, 115, 255, 134, 98, 115, 255, 71, 55, 89, 255, 0, 0, 0, 0, 0, 0, 0, 0, 0, 0, 0, 0, 0, 0, 0, 0, 0, 0, 0, 0, 0, 0, 0, 0, 0, 0, 0, 0, 0, 0, 0, 0, 0, 0, 0, 0, 0, 0, 0, 0, 0, 0, 0, 0, 0, 0, 0, 0, 0, 0, 0, 0, 0, 0, 0, 0, 0, 0, 0, 0, 0, 0, 0, 0, 71, 55, 89, 255, 134, 98, 115, 255, 162, 135, 138, 255, 162, 135, 138, 255, 162, 135, 138, 255, 162, 135, 138, 255, 162, 135, 138, 255, 134, 98, 115, 255, 134, 98, 115, 255, 162, 135, 138, 255, 162, 135, 138, 255, 162, 135, 138, 255, 162, 135, 138, 255, 162, 135, 138, 255, 134, 98, 115, 255, 71, 55, 89, 255, 0, 0, 0, 0, 0, 0, 0, 0, 0, 0, 0, 0, 0, 0, 0, 0, 0, 0, 0, 0, 0, 0, 0, 0, 0, 0, 0, 0, 0, 0, 0, 0, 0, 0, 0, 0, 0, 0, 0, 0, 0, 0, 0, 0, 0, 0, 0, 0, 0, 0, 0, 0, 0, 0, 0, 0, 0, 0, 0, 0, 0, 0, 0, 0, 71, 55, 89, 255, 134, 98, 115, 255, 134, 98, 115, 255, 162, 135, 138, 255, 162, 135, 138, 255, 162, 135, 138, 255, 134, 98, 115, 255, 162, 135, 138, 255, 162, 135, 138, 255, 134, 98, 115, 255, 162, 135, 138, 255, 162, 135, 138, 255, 162, 135, 138, 255, 134, 98, 115, 255, 134, 98, 115, 255, 71, 55, 89, 255, 0, 0, 0, 0, 0, 0, 0, 0, 0, 0, 0, 0, 0, 0, 0, 0, 0, 0, 0, 0, 0, 0, 0, 0, 0, 0, 0, 0, 0, 0, 0, 0, 0, 0, 0, 0, 0, 0, 0, 0, 0, 0, 0, 0, 0, 0, 0, 0, 0, 0, 0, 0, 0, 0, 0, 0, 0, 0, 0, 0, 0, 0, 0, 0, 0, 0, 0, 0, 71, 55, 89, 255, 134, 98, 115, 255, 134, 98, 115, 255, 162, 135, 138, 255, 162, 135, 138, 255, 162, 135, 138, 255, 162, 135, 138, 255, 162, 135, 138, 255, 162, 135, 138, 255, 162, 135, 138, 255, 162, 135, 138, 255, 134, 98, 115, 255, 134, 98, 115, 255, 71, 55, 89, 255, 0, 0, 0, 0, 0, 0, 0, 0, 0, 0, 0, 0, 0, 0, 0, 0, 0, 0, 0, 0, 0, 0, 0, 0, 0, 0, 0, 0, 0, 0, 0, 0, 0, 0, 0, 0, 0, 0, 0, 0, 0, 0, 0, 0, 0, 0, 0, 0, 0, 0, 0, 0, 0, 0, 0, 0, 0, 0, 0, 0, 0, 0, 0, 0, 0, 0, 0, 0, 0, 0, 0, 0, 0, 0, 0, 0, 71, 55, 89, 255, 134, 98, 115, 255, 134, 98, 115, 255, 134, 98, 115, 255, 162, 135, 138, 255, 162, 135, 138, 255, 162, 135, 138, 255, 162, 135, 138, 255, 134, 98, 115, 255, 134, 98, 115, 255, 134, 98, 115, 255, 71, 55, 89, 255, 0, 0, 0, 0, 0, 0, 0, 0, 0, 0, 0, 0, 0, 0, 0, 0, 0, 0, 0, 0, 0, 0, 0, 0, 0, 0, 0, 0, 0, 0, 0, 0, 0, 0, 0, 0, 0, 0, 0, 0, 0, 0, 0, 0, 0, 0, 0, 0, 0, 0, 0, 0, 0, 0, 0, 0, 0, 0, 0, 0, 0, 0, 0, 0, 0, 0, 0, 0, 0, 0, 0, 0, 0, 0, 0, 0, 0, 0, 0, 0, 0, 0, 0, 0, 71, 55, 89, 255, 134, 98, 115, 255, 134, 98, 115, 255, 134, 98, 115, 255, 134, 98, 115, 255, 134, 98, 115, 255, 134, 98, 115, 255, 134, 98, 115, 255, 134, 98, 115, 255, 71, 55, 89, 255, 0, 0, 0, 0, 0, 0, 0, 0, 0, 0, 0, 0, 0, 0, 0, 0, 0, 0, 0, 0, 0, 0, 0, 0, 0, 0, 0, 0, 0, 0, 0, 0, 0, 0, 0, 0, 0, 0, 0, 0, 0, 0, 0, 0, 0, 0, 0, 0, 0, 0, 0, 0, 0, 0, 0, 0, 0, 0, 0, 0, 0, 0, 0, 0, 0, 0, 0, 0, 0, 0, 0, 0, 0, 0, 0, 0, 0, 0, 0, 0, 0, 0, 0, 0, 0, 0, 0, 0, 0, 0, 0, 0, 0, 0, 0, 0, 71, 55, 89, 255, 71, 55, 89, 255, 134, 98, 115, 255, 134, 98, 115, 255, 71, 55, 89, 255, 71, 55, 89, 255, 0, 0, 0, 0, 0, 0, 0, 0, 0, 0, 0, 0, 0, 0, 0, 0, 0, 0, 0, 0, 0, 0, 0, 0, 0, 0, 0, 0, 0, 0, 0, 0, 0, 0, 0, 0, 0, 0, 0, 0, 0, 0, 0, 0, 0, 0, 0, 0, 0, 0, 0, 0, 0, 0, 0, 0, 0, 0, 0, 0, 0, 0, 0, 0, 0, 0, 0, 0, 0, 0, 0, 0, 0, 0, 0, 0, 0, 0, 0, 0, 0, 0, 0, 0, 0, 0, 0, 0, 0, 0, 0, 0, 0, 0, 0, 0, 0, 0, 0, 0, 0, 0, 0, 0, 0, 0, 0, 0, 0, 0, 0, 0, 0, 0, 0, 0, 0, 0, 0, 0, 0, 0, 0, 0, 0, 0, 0, 0, 0, 0, 0, 0, 0, 0, 0, 0, 0, 0, 0, 0, 0, 0, 0, 0, 0, 0, 0, 0, 0, 0, 0, 0, 0, 0, 0, 0, 0, 0, 0, 0, 0, 0, 0, 0, 0, 0, 0, 0, 0, 0, 0, 0, 0, 0, 0, 0, 0, 0, 0, 0, 0, 0, 0, 0, 0, 0, 0, 0, 0, 0, 0, 0, 0, 0, 0, 0, 0, 0, 0, 0, 0, 0, 0, 0, 0, 0, 0, 0, 0, 0, 0, 0, 0, 0, 0, 0, 0, 0, 0, 0, 0, 0, 0, 0, 0, 0, 0, 0, 0, 0, 0, 0, 0, 0, 0, 0, 0, 0, 0, 0, 0, 0, 0, 0, 0, 0, 0, 0, 0, 0, 0, 0, 0, 0, 0, 0, 0, 0, 0, 0, 0, 0, 0, 0, 0, 0, 0, 0, 0, 0, 0, 0, 0, 0, 0, 0, 0, 0, 0, 0, 0, 0, 0, 0, 0, 0, 0, 0, 0, 0, 0, 0, 0, 0, 0, 0, 0, 0, 0, 0, 0, 0, 0, 0, 0, 0, 0, 0, 0, 0, 0, 0, 0, 0, 0, 0, 0, 0, 0, 0, 0, 0, 0, 0, 0, 0, 0, 0, 0, 0, 0, 0, 0, 0, 0, 0, 0, 0, 0, 0, 0, 0, 0, 0, 0, 0, 0, 0, 0, 0, 0, 0, 0, 0, 0, 0, 0, 0, 0, 0, 0, 0, 0, 0, 0, 0, 0, 0, 0, 0, 0, 0, 0, 0, 0, 0, 0, 0, 0, 0, 0, 0, 0, 0, 0, 0, 0, 0, 0, 0, 0, 0, 0, 0, 0, 0, 0, 0, 0, 0, 0, 0, 0, 0, 0, 0, 0, 0, 0, 0, 0, 0, 0, 0, 0, 0, 0, 0, 0, 0, 0, 0, 0, 0, 0, 0, 0, 0, 0, 0, 0, 0, 0, 0, 0, 0 ),
"format": "RGBA8",
"height": 64,
"mipmaps": false,
"width": 32
}

[sub_resource type="ImageTexture" id=2]
flags = 26
lossy_quality = 1.0
flags = 26
image = SubResource( 3 )
size = Vector2( 32, 64 )

[node name="Analyst2" type="Spatial"]

[node name="Sprite3D" type="Sprite3D" parent="."]
transform = Transform( 4, 0, 0, 0, 4, 0, 0, 0, 4, 0, 1.275, 0 )
flip_v = true
modulate = Color( 0.890196, 0.890196, 0.890196, 1 )
billboard = 2
texture = SubResource( 2 )
