Run [cat ../README.md]
Wait returned: stop signal: trace/breakpoint trap
0 execve
1 brk
2 brk
3 arch_prctl
4 arch_prctl
5 access
6 access
7 openat
8 openat
9 fstat
10 fstat
11 mmap
12 mmap
13 close
14 close
15 openat
16 openat
17 read
18 read
19 pread64
20 pread64
21 pread64
22 pread64
23 pread64
24 pread64
25 fstat
26 fstat
27 mmap
28 mmap
29 pread64
30 pread64
31 pread64
32 pread64
33 pread64
34 pread64
35 mmap
36 mmap
37 mprotect
38 mprotect
39 mmap
40 mmap
41 mmap
42 mmap
43 mmap
44 mmap
45 mmap
46 mmap
47 close
48 close
49 arch_prctl
50 arch_prctl
51 mprotect
52 mprotect
53 mprotect
54 mprotect
55 mprotect
56 mprotect
57 munmap
58 munmap
59 brk
60 brk
61 brk
62 brk
63 openat
64 openat
65 fstat
66 fstat
67 mmap
68 mmap
69 close
70 close
71 openat
72 openat
73 fstat
74 fstat
75 read
76 read
77 read
78 read
79 close
80 close
81 openat
82 openat
83 fstat
84 fstat
85 mmap
86 mmap
87 close
88 close
89 openat
90 openat
91 fstat
92 fstat
93 mmap
94 mmap
95 close
96 close
97 openat
98 openat
99 fstat
100 fstat
101 mmap
102 mmap
103 close
104 close
105 openat
106 openat
107 fstat
108 fstat
109 mmap
110 mmap
111 close
112 close
113 openat
114 openat
115 fstat
116 fstat
117 mmap
118 mmap
119 close
120 close
121 openat
122 openat
123 fstat
124 fstat
125 mmap
126 mmap
127 close
128 close
129 openat
130 openat
131 fstat
132 fstat
133 mmap
134 mmap
135 close
136 close
137 openat
138 openat
139 fstat
140 fstat
141 close
142 close
143 openat
144 openat
145 fstat
146 fstat
147 mmap
148 mmap
149 close
150 close
151 openat
152 openat
153 fstat
154 fstat
155 mmap
156 mmap
157 close
158 close
159 openat
160 openat
161 fstat
162 fstat
163 mmap
164 mmap
165 close
166 close
167 openat
168 openat
169 fstat
170 fstat
171 mmap
172 mmap
173 close
174 close
175 openat
176 openat
177 fstat
178 fstat
179 mmap
180 mmap
181 close
182 close
183 openat
184 openat
185 fstat
186 fstat
187 mmap
188 mmap
189 close
190 close
191 fstat
192 fstat
193 openat
194 openat
Total syscall: 196
