Run [hostname]
Wait returned: stop signal: trace/breakpoint trap
0 execve
1 brk
2 brk
3 arch_prctl
4 arch_prctl
5 access
6 access
7 openat
8 openat
9 fstat
10 fstat
11 mmap
12 mmap
13 close
14 close
15 openat
16 openat
17 read
18 read
19 pread64
20 pread64
21 pread64
22 pread64
23 pread64
24 pread64
25 fstat
26 fstat
27 mmap
28 mmap
29 pread64
30 pread64
31 pread64
32 pread64
33 pread64
34 pread64
35 mmap
36 mmap
37 mprotect
38 mprotect
39 mmap
40 mmap
41 mmap
42 mmap
43 mmap
44 mmap
45 mmap
46 mmap
47 close
48 close
49 arch_prctl
50 arch_prctl
51 mprotect
52 mprotect
53 mprotect
54 mprotect
55 mprotect
56 mprotect
57 munmap
58 munmap
59 brk
60 brk
61 brk
62 brk
63 sethostname
64 sethostname
65 write (No syscall)
66 setitimer
67 write (No syscall)
68 setitimer
69 write (No syscall)
70 setitimer
71 exit_group
Total syscall: 72
