module gitlab.com/cntu.cnsl/sidecar-debugger

go 1.16

require (
	github.com/fatih/color v1.12.0
	github.com/kr/text v0.2.0 // indirect
	github.com/niemeyer/pretty v0.0.0-20200227124842-a10e7caefd8e // indirect
	github.com/seccomp/libseccomp-golang v0.9.1
	github.com/spf13/cobra v1.2.1
	github.com/spf13/viper v1.8.1
	gopkg.in/check.v1 v1.0.0-20200227125254-8fa46927fb4f // indirect
)
