Run [ls ../]
Wait returned: stop signal: trace/breakpoint trap
0 execve
1 brk
2 brk
3 arch_prctl
4 arch_prctl
5 access
6 access
7 openat
8 openat
9 fstat
10 fstat
11 mmap
12 mmap
13 close
14 close
15 openat
16 openat
17 read
18 read
19 fstat
20 fstat
21 mmap
22 mmap
23 mmap
24 mmap
25 mprotect
26 mprotect
27 mmap
28 mmap
29 mmap
30 mmap
31 mmap
32 mmap
33 mmap
34 mmap
35 close
36 close
37 openat
38 openat
39 read
40 read
41 pread64
42 pread64
43 pread64
44 pread64
45 pread64
46 pread64
47 fstat
48 fstat
49 pread64
50 pread64
51 pread64
52 pread64
53 pread64
54 pread64
55 mmap
56 mmap
57 mprotect
58 mprotect
59 mmap
60 mmap
61 mmap
62 mmap
63 mmap
64 mmap
65 mmap
66 mmap
67 close
68 close
69 openat
70 openat
71 read
72 read
73 fstat
74 fstat
75 mmap
76 mmap
77 mmap
78 mmap
79 mmap
80 mmap
81 mmap
82 mmap
83 close
84 close
85 openat
86 openat
87 read
88 read
89 fstat
90 fstat
91 mmap
92 mmap
93 mmap
94 mmap
95 mmap
96 mmap
97 mmap
98 mmap
99 close
100 close
101 openat
102 openat
103 read
104 read
105 pread64
106 pread64
107 fstat
108 fstat
109 pread64
110 pread64
111 mmap
112 mmap
113 mmap
114 mmap
115 mmap
116 mmap
117 mmap
118 mmap
119 mmap
120 mmap
121 close
122 close
123 mmap
124 mmap
125 arch_prctl
126 arch_prctl
127 mprotect
128 mprotect
129 mprotect
130 mprotect
131 mprotect
132 mprotect
133 mprotect
134 mprotect
135 mprotect
136 mprotect
137 mprotect
138 mprotect
139 mprotect
140 mprotect
141 munmap
142 munmap
143 set_tid_address
144 set_tid_address
145 set_robust_list
146 set_robust_list
147 rt_sigaction
148 rt_sigaction
149 rt_sigaction
150 rt_sigaction
151 rt_sigprocmask
152 rt_sigprocmask
153 prlimit64
154 prlimit64
155 statfs
156 statfs
157 statfs
158 statfs
159 brk
160 brk
161 brk
162 brk
163 openat
164 openat
165 fstat
166 fstat
167 read
168 read
169 read
170 read
171 close
172 close
173 access
174 access
175 openat
176 openat
177 fstat
178 fstat
179 mmap
180 mmap
181 close
182 close
183 openat
184 openat
185 fstat
186 fstat
187 read
188 read
189 read
190 read
191 close
192 close
193 openat
194 openat
195 fstat
196 fstat
197 mmap
198 mmap
199 close
200 close
201 openat
202 openat
203 fstat
204 fstat
205 mmap
206 mmap
207 close
208 close
209 futex
210 futex
211 openat
212 openat
213 fstat
214 fstat
215 mmap
216 mmap
217 close
218 close
219 openat
220 openat
221 fstat
222 fstat
223 mmap
224 mmap
225 close
226 close
227 openat
228 openat
229 fstat
230 fstat
231 mmap
232 mmap
233 close
234 close
235 openat
236 openat
237 fstat
238 fstat
239 mmap
240 mmap
241 close
242 close
243 openat
244 openat
245 fstat
246 fstat
247 mmap
248 mmap
249 close
250 close
251 openat
252 openat
253 fstat
254 fstat
255 close
256 close
257 openat
258 openat
259 fstat
260 fstat
261 mmap
262 mmap
263 close
264 close
265 openat
266 openat
267 fstat
268 fstat
269 mmap
270 mmap
271 close
272 close
273 openat
274 openat
275 fstat
276 fstat
277 mmap
278 mmap
279 close
280 close
281 openat
282 openat
283 fstat
284 fstat
285 mmap
286 mmap
287 close
288 close
289 openat
290 openat
291 fstat
292 fstat
293 mmap
294 mmap
295 close
296 close
297 openat
298 openat
299 fstat
300 fstat
301 mmap
302 mmap
303 close
304 close
305 ioctl
306 ioctl
307 ioctl
308 ioctl
309 stat
310 stat
311 lstat
312 lstat
313 openat
314 openat
315 openat
316 openat
317 openat
318 openat
319 openat
320 openat
321 openat
322 openat
323 openat
324 openat
325 write
326 write
327 write
328 write
329 openat
330 openat
331 openat
332 openat
333 openat
334 openat
335 openat
336 openat
337 openat
338 openat
339 openat
340 openat
341 write
342 write
343 write
344 write
345 stat
346 stat
347 openat
348 openat
349 fstat
350 fstat
351 fstat
352 fstat
353 getdents64
354 getdents64
355 getdents64
356 getdents64
357 close
358 close
359 write
../:
Dockerfile
Dockerfile_run
LICENSE
README.md
cmd
experiments
go.mod
go.sum
main.go
scripts
setup.sh
sidecar-debugger
yaml
360 write
361 close
362 close
363 close
364 close
365 exit_group
Total syscall: 366
