Run [lsns]
Wait returned: stop signal: trace/breakpoint trap
0 execve
1 brk
2 brk
3 arch_prctl
4 arch_prctl
5 access
6 access
7 openat
8 openat
9 fstat
10 fstat
11 mmap
12 mmap
13 close
14 close
15 openat
16 openat
17 read
18 read
19 fstat
20 fstat
21 mmap
22 mmap
23 mmap
24 mmap
25 mmap
26 mmap
27 mmap
28 mmap
29 mmap
30 mmap
31 close
32 close
33 openat
34 openat
35 read
36 read
37 fstat
38 fstat
39 mmap
40 mmap
41 mmap
42 mmap
43 mmap
44 mmap
45 mmap
46 mmap
47 close
48 close
49 openat
50 openat
51 read
52 read
53 pread64
54 pread64
55 pread64
56 pread64
57 pread64
58 pread64
59 fstat
60 fstat
61 pread64
62 pread64
63 pread64
64 pread64
65 pread64
66 pread64
67 mmap
68 mmap
69 mprotect
70 mprotect
71 mmap
72 mmap
73 mmap
74 mmap
75 mmap
76 mmap
77 mmap
78 mmap
79 close
80 close
81 openat
82 openat
83 read
84 read
85 fstat
86 fstat
87 mmap
88 mmap
89 mprotect
90 mprotect
91 mmap
92 mmap
93 mmap
94 mmap
95 mmap
96 mmap
97 close
98 close
99 openat
100 openat
101 read
102 read
103 fstat
104 fstat
105 mmap
106 mmap
107 mprotect
108 mprotect
109 mmap
110 mmap
111 mmap
112 mmap
113 mmap
114 mmap
115 mmap
116 mmap
117 close
118 close
119 openat
120 openat
121 read
122 read
123 fstat
124 fstat
125 mmap
126 mmap
127 mmap
128 mmap
129 mmap
130 mmap
131 mmap
132 mmap
133 close
134 close
135 openat
136 openat
137 read
138 read
139 fstat
140 fstat
141 mmap
142 mmap
143 mmap
144 mmap
145 mmap
146 mmap
147 mmap
148 mmap
149 mmap
150 mmap
151 close
152 close
153 openat
154 openat
155 read
156 read
157 pread64
158 pread64
159 fstat
160 fstat
161 pread64
162 pread64
163 mmap
164 mmap
165 mmap
166 mmap
167 mmap
168 mmap
169 mmap
170 mmap
171 mmap
172 mmap
173 close
174 close
175 mmap
176 mmap
177 arch_prctl
178 arch_prctl
179 mprotect
180 mprotect
181 mprotect
182 mprotect
183 mprotect
184 mprotect
185 mprotect
186 mprotect
187 mprotect
188 mprotect
189 mprotect
190 mprotect
191 mprotect
192 mprotect
193 mprotect
194 mprotect
195 mprotect
196 mprotect
197 mprotect
198 mprotect
199 munmap
200 munmap
201 set_tid_address
202 set_tid_address
203 set_robust_list
204 set_robust_list
205 rt_sigaction
206 rt_sigaction
207 rt_sigaction
208 rt_sigaction
209 rt_sigprocmask
210 rt_sigprocmask
211 prlimit64
212 prlimit64
213 statfs
214 statfs
215 statfs
216 statfs
217 brk
218 brk
219 brk
220 brk
221 openat
222 openat
223 fstat
224 fstat
225 read
226 read
227 read
228 read
229 close
230 close
231 access
232 access
233 openat
234 openat
235 fstat
236 fstat
237 mmap
238 mmap
239 close
240 close
241 openat
242 openat
243 fstat
244 fstat
245 read
246 read
247 read
248 read
249 close
250 close
251 openat
252 openat
253 fstat
254 fstat
255 mmap
256 mmap
257 close
258 close
259 openat
260 openat
261 fstat
262 fstat
263 mmap
264 mmap
265 close
266 close
267 futex
268 futex
269 openat
270 openat
271 fstat
272 fstat
273 mmap
274 mmap
275 close
276 close
277 openat
278 openat
279 fstat
280 fstat
281 mmap
282 mmap
283 close
284 close
285 openat
286 openat
287 fstat
288 fstat
289 mmap
290 mmap
291 close
292 close
293 openat
294 openat
295 fstat
296 fstat
297 mmap
298 mmap
299 close
300 close
301 openat
302 openat
303 fstat
304 fstat
305 mmap
306 mmap
307 close
308 close
309 openat
310 openat
311 fstat
312 fstat
313 close
314 close
315 openat
316 openat
317 fstat
318 fstat
319 mmap
320 mmap
321 close
322 close
323 openat
324 openat
325 fstat
326 fstat
327 mmap
328 mmap
329 close
330 close
331 openat
332 openat
333 fstat
334 fstat
335 mmap
336 mmap
337 close
338 close
339 openat
340 openat
341 fstat
342 fstat
343 mmap
344 mmap
345 close
346 close
347 openat
348 openat
349 fstat
350 fstat
351 mmap
352 mmap
353 close
354 close
355 openat
356 openat
357 fstat
358 fstat
359 mmap
360 mmap
361 close
362 close
363 openat
364 openat
365 openat
366 openat
367 openat
368 openat
369 openat
370 openat
371 openat
372 openat
373 openat
374 openat
375 write
376 write
377 write
378 write
379 write
380 write
381 close
382 close
383 close
384 close
385 exit_group
Total syscall: 386
