{
    "type": "object",
    "properties": {
        "pollingIntervalSeconds": {
            "type": "number"
        },
        "services": {
            "type": "array",
            "items": {
                "type": "object",
                "properties": {
                    "id": {
                        "type": "string"
                    },
                    "baseUri": {
                        "type": "string"
                    },
                    "ipAddress": {
                        "type": "string"
                    },
                    "port": {
                        "type": "number"
                    },
                    "username": {
                        "type": "string"
                    },
                    "password": {
                        "type": "string"
                    },
                    "protocol": {
                        "type": "string",
                        "enum": [
                            "DOIP",
                            "DOIP-HTTP",
                            "CORDRA-HTTP"
                        ]
                    },
                    "latestTxnId": {
                        "type": "number"
                    },
                    "error": {
                        "type": "string"
                    },
                    "lastRunTimestamp": {
                        "type": "string"
                    },
                    "includeTypes": {
                        "type": "array",
                        "items": {
                            "type": "string"
                        }
                    },
                    "excludeTypes": {
                        "type": "array",
                        "items": {
                            "type": "string"
                        }
                    },
                    "customQuery": {
                        "type": "string"
                    }
                }
            }
        }
    }
}