{
    "id": "test/service",
    "type": "0.TYPE/DOIPServiceInfo",
    "attributes": {
        "ipAddress": "0.0.0.0",
        "port": 9000,
        "protocol": "TCP",
        "protocolVersion": "2.0",
        "cordraVersion": {
            "number": "2.5.0"
        },
        "publicKey": {
            "kty": "RSA",
            "n": "pOkfm8sii9yqc_HXlFlXOqWKOTv01R5A0VIQOeG33PgPFnkL8vDiSY06aY10uZWJlPjfDapeLIu6lwvux-xcc1yqS1PDOYb3rS0VmmsTps7QIJ7XRaWaPzWGEIaLzEVJnnrdesqIH0kc3LoY4oaYPCzYtMrAj5pX7vxG0zhG32hOZGPVpljTiidfMqYzu9t5yw4hCwHyAaLj-CXy2jIBUQDbq1CGYwFrw8o9pw6vNnhAdnTce12lCPfkKxHNZfYAkBGrmdg-pPXYoRtrKB6xoX8iJYMdfBmkv5MP-dcwaPF2OAhr_OMAWtDf1kjdmP0s0MGQcDYOPdO7ZGqYZ_NnYQ",
            "e": "AQAB"
        }
    }
}